osdir.com

[Date Prev][Date Next][Thread Prev][Thread Next][Date Index][Thread Index]

[jira] [Created] (CALCITE-2686) Project fail to build


Brandon Jiang created CALCITE-2686:
--------------------------------------

             Summary: Project fail to build 
                 Key: CALCITE-2686
                 URL: https://issues.apache.org/jira/browse/CALCITE-2686
             Project: Calcite
          Issue Type: Bug
    Affects Versions: 1.17.0
         Environment: windows under maven 3.3.9 and JDK 1.8.0_111
            Reporter: Brandon Jiang
            Assignee: Julian Hyde


With 1.17 release, project fail to build on windows under maven 3.3.9 and JDK 1.8.0_111

 
{code:java}
$ git clone https://github.com/apache/calcite.git
$ cd calcite
$ mvn install -DskipTests -Dcheckstyle.skip=true
{code}
{code:java}
[INFO] Calcite ............................................ SUCCESS [ 33.487 s]
[INFO] Calcite Linq4j ..................................... FAILURE [ 6.202 s]
[INFO] Calcite Core ....................................... SKIPPED
[INFO] Calcite Babel ...................................... SKIPPED
[INFO] Calcite Cassandra .................................. SKIPPED
[INFO] Calcite Druid ...................................... SKIPPED
[INFO] Calcite Elasticsearch .............................. SKIPPED
[INFO] Calcite Examples ................................... SKIPPED
[INFO] Calcite Example CSV ................................ SKIPPED
[INFO] Calcite Example Function ........................... SKIPPED
[INFO] Calcite File ....................................... SKIPPED
[INFO] Calcite Geode ...................................... SKIPPED
[INFO] Calcite MongoDB .................................... SKIPPED
[INFO] Calcite Pig ........................................ SKIPPED
[INFO] Calcite Piglet ..................................... SKIPPED
[INFO] Calcite Plus ....................................... SKIPPED
[INFO] Calcite Server ..................................... SKIPPED
[INFO] Calcite Spark ...................................... SKIPPED
[INFO] Calcite Splunk ..................................... SKIPPED
[INFO] Calcite Ubenchmark ................................. SKIPPED
[INFO] ------------------------------------------------------------------------
[INFO] BUILD FAILURE
[INFO] ------------------------------------------------------------------------
[INFO] Total time: 40.345 s
[INFO] Finished at: 2018-11-20T17:56:23+08:00
[INFO] Final Memory: 35M/578M
[INFO] ------------------------------------------------------------------------
[ERROR] Failed to execute goal de.thetaphi:forbiddenapis:2.6:testCheck (default)
 on project calcite-linq4j: Check for forbidden API calls failed while scanning
class 'org.apache.calcite.linq4j.test.ExpressionTest' (ExpressionTest.java): jav
a.lang.ClassNotFoundException: org.junit.Test (while looking up details about re
ferenced class 'org.junit.Test') -> [Help 1]{code}
 



--
This message was sent by Atlassian JIRA
(v7.6.3#76005)