osdir.com


[Date Prev][Date Next][Thread Prev][Thread Next][Date Index][Thread Index]

Build failed in Jenkins: brooklyn-master-build-docker #1210


See <https://builds.apache.org/job/brooklyn-master-build-docker/1210/display/redirect>

------------------------------------------
[...truncated 47.48 MB...]
2018-12-28 12:45:00,802 INFO  - TESTNG INVOKING CONFIGURATION: "Surefire test" - @BeforeMethod org.apache.brooklyn.test.framework.TestEffectorTest.setUp()
2018-12-28 12:45:00,802 INFO  - Added external config supplier named 'brooklyn-demo-sample': org.apache.brooklyn.core.config.external.InPlaceExternalConfigSupplier@6aa5974e
2018-12-28 12:45:00,836 INFO  - TESTNG PASSED CONFIGURATION: "Surefire test" - @BeforeMethod org.apache.brooklyn.test.framework.TestEffectorTest.setUp() finished in 34 ms
2018-12-28 12:45:00,837 INFO  - TESTNG INVOKING: "Surefire test" - org.apache.brooklyn.test.framework.TestEffectorTest.testEffectorNegativeAssertions()
2018-12-28 12:45:00,869 WARN  fVH2uCk9-[c5ps0wgz0m,gg3womu10h,ogjpon80j1] Repeater: error caught checking condition: effectorReturnsString expected equalTo Not the string I expected but found Goodbye World!
2018-12-28 12:45:00,870 WARN  fVH2uCk9-[c5ps0wgz0m,gg3womu10h,ogjpon80j1] Error invoking start at TestEffectorImpl{id=ogjpon80j1}: AssertionError: effectorReturnsString expected equalTo Not the string I expected but found Goodbye World!
2018-12-28 12:45:00,882 WARN  WUJ4QZgU-[c5ps0wgz0m,gg3womu10h] Error invoking start at TestCaseImpl{id=gg3womu10h}: Error invoking start at TestEffectorImpl{id=ogjpon80j1}: AssertionError: effectorReturnsString expected equalTo Not the string I expected but found Goodbye World!
2018-12-28 12:45:00,899 WARN  UVEUsnVu-[c5ps0wgz0m] Setting Application[ps0wgz0m] on-fire due to problems when expected running, up=false, problems: {service-lifecycle-indicators-from-children-and-members=Required entity not healthy: TestCase:gg3w (gg3womu10h)}
2018-12-28 12:45:00,900 WARN  UVEUsnVu-[c5ps0wgz0m] Error invoking start at Application[ps0wgz0m]: ProblemStartingChildrenException: org.apache.brooklyn.util.exceptions.PropagatedRuntimeException: Error invoking start at TestCaseImpl{id=gg3womu10h}: Error invoking start at TestEffectorImpl{id=ogjpon80j1}: AssertionError: effectorReturnsString expected equalTo Not the string I expected but found Goodbye World!
2018-12-28 12:45:00,924 INFO  - TESTNG PASSED: "Surefire test" - org.apache.brooklyn.test.framework.TestEffectorTest.testEffectorNegativeAssertions() finished in 84 ms
2018-12-28 12:45:00,924 INFO  - TESTNG INVOKING CONFIGURATION: "Surefire test" - @AfterMethod org.apache.brooklyn.core.test.BrooklynMgmtUnitTestSupport.tearDown()
2018-12-28 12:45:00,935 INFO  - TESTNG PASSED CONFIGURATION: "Surefire test" - @AfterMethod org.apache.brooklyn.core.test.BrooklynMgmtUnitTestSupport.tearDown() finished in 11 ms
2018-12-28 12:45:00,936 INFO  - TESTNG INVOKING CONFIGURATION: "Surefire test" - @BeforeMethod org.apache.brooklyn.test.framework.TestEffectorTest.setUp()
2018-12-28 12:45:00,936 INFO  - Added external config supplier named 'brooklyn-demo-sample': org.apache.brooklyn.core.config.external.InPlaceExternalConfigSupplier@29013ef2
2018-12-28 12:45:00,967 INFO  - TESTNG PASSED CONFIGURATION: "Surefire test" - @BeforeMethod org.apache.brooklyn.test.framework.TestEffectorTest.setUp() finished in 31 ms
2018-12-28 12:45:00,967 INFO  - TESTNG INVOKING: "Surefire test" - org.apache.brooklyn.test.framework.TestEffectorTest.testEffectorPositiveAssertions()
2018-12-28 12:45:01,003 INFO  - TESTNG PASSED: "Surefire test" - org.apache.brooklyn.test.framework.TestEffectorTest.testEffectorPositiveAssertions() finished in 36 ms
2018-12-28 12:45:01,003 INFO  - TESTNG INVOKING CONFIGURATION: "Surefire test" - @AfterMethod org.apache.brooklyn.core.test.BrooklynMgmtUnitTestSupport.tearDown()
2018-12-28 12:45:01,015 INFO  - TESTNG PASSED CONFIGURATION: "Surefire test" - @AfterMethod org.apache.brooklyn.core.test.BrooklynMgmtUnitTestSupport.tearDown() finished in 12 ms
2018-12-28 12:45:01,016 INFO  - TESTNG INVOKING CONFIGURATION: "Surefire test" - @BeforeMethod org.apache.brooklyn.test.framework.TestEffectorTest.setUp()
2018-12-28 12:45:01,016 INFO  - Added external config supplier named 'brooklyn-demo-sample': org.apache.brooklyn.core.config.external.InPlaceExternalConfigSupplier@43a4a9e5
2018-12-28 12:45:01,048 INFO  - TESTNG PASSED CONFIGURATION: "Surefire test" - @BeforeMethod org.apache.brooklyn.test.framework.TestEffectorTest.setUp() finished in 32 ms
2018-12-28 12:45:01,050 INFO  - TESTNG INVOKING: "Surefire test" - org.apache.brooklyn.test.framework.TestEffectorTest.testEffectorReturnsInt()
[GC (Allocation Failure)  250850K->21528K(770048K), 0.0214604 secs]
2018-12-28 12:45:01,117 INFO  - TESTNG PASSED: "Surefire test" - org.apache.brooklyn.test.framework.TestEffectorTest.testEffectorReturnsInt() finished in 69 ms
2018-12-28 12:45:01,120 INFO  - TESTNG INVOKING CONFIGURATION: "Surefire test" - @AfterMethod org.apache.brooklyn.core.test.BrooklynMgmtUnitTestSupport.tearDown()
2018-12-28 12:45:01,130 INFO  - TESTNG PASSED CONFIGURATION: "Surefire test" - @AfterMethod org.apache.brooklyn.core.test.BrooklynMgmtUnitTestSupport.tearDown() finished in 13 ms
2018-12-28 12:45:01,136 INFO  - TESTNG INVOKING CONFIGURATION: "Surefire test" - @BeforeMethod org.apache.brooklyn.test.framework.TestEffectorTest.setUp()
2018-12-28 12:45:01,139 INFO  - Added external config supplier named 'brooklyn-demo-sample': org.apache.brooklyn.core.config.external.InPlaceExternalConfigSupplier@3c28e5b6
2018-12-28 12:45:01,177 INFO  - TESTNG PASSED CONFIGURATION: "Surefire test" - @BeforeMethod org.apache.brooklyn.test.framework.TestEffectorTest.setUp() finished in 41 ms
2018-12-28 12:45:01,182 INFO  - TESTNG INVOKING: "Surefire test" - org.apache.brooklyn.test.framework.TestEffectorTest.testEffectorTimeout()
2018-12-28 12:45:01,232 WARN  myJvKQHz-[hbsnf2iepl,y7vzrt03kf,gsjrlfyomp] Repeater: error caught checking condition: Effector effectorHangs timed out after 10ms
2018-12-28 12:45:01,239 WARN  myJvKQHz-[hbsnf2iepl,y7vzrt03kf,gsjrlfyomp] Error invoking start at TestEffectorImpl{id=gsjrlfyomp}: AssertionError: Effector effectorHangs timed out after 10ms
2018-12-28 12:45:01,248 WARN  L4tbYE8J-[hbsnf2iepl,y7vzrt03kf] Error invoking start at TestCaseImpl{id=y7vzrt03kf}: Error invoking start at TestEffectorImpl{id=gsjrlfyomp}: AssertionError: Effector effectorHangs timed out after 10ms
2018-12-28 12:45:01,258 WARN  ivV2EUsy-[hbsnf2iepl] Setting Application[snf2iepl] on-fire due to problems when expected running, up=false, not-up-indicators: {service.state=Application starting}
2018-12-28 12:45:01,258 WARN  ivV2EUsy-[hbsnf2iepl] Error invoking start at Application[snf2iepl]: ProblemStartingChildrenException: org.apache.brooklyn.util.exceptions.PropagatedRuntimeException: Error invoking start at TestCaseImpl{id=y7vzrt03kf}: Error invoking start at TestEffectorImpl{id=gsjrlfyomp}: AssertionError: Effector effectorHangs timed out after 10ms
2018-12-28 12:45:01,277 INFO  - TESTNG PASSED: "Surefire test" - org.apache.brooklyn.test.framework.TestEffectorTest.testEffectorTimeout() finished in 99 ms
2018-12-28 12:45:01,281 INFO  - TESTNG INVOKING CONFIGURATION: "Surefire test" - @AfterMethod org.apache.brooklyn.core.test.BrooklynMgmtUnitTestSupport.tearDown()
2018-12-28 12:45:01,301 WARN  ZCCj8H36-[hbsnf2iepl,y7vzrt03kf,l4k0ivu8bg] Error invoking effectorHangs at TestEntityImpl{id=l4k0ivu8bg}: RuntimeInterruptedException: java.lang.InterruptedException: sleep interrupted
2018-12-28 12:45:01,315 INFO  - TESTNG PASSED CONFIGURATION: "Surefire test" - @AfterMethod org.apache.brooklyn.core.test.BrooklynMgmtUnitTestSupport.tearDown() finished in 38 ms
2018-12-28 12:45:01,321 INFO  - TESTNG INVOKING CONFIGURATION: "Surefire test" - @BeforeMethod org.apache.brooklyn.test.framework.TestEffectorTest.setUp()
2018-12-28 12:45:01,328 INFO  - Added external config supplier named 'brooklyn-demo-sample': org.apache.brooklyn.core.config.external.InPlaceExternalConfigSupplier@39832280
2018-12-28 12:45:01,373 INFO  - TESTNG PASSED CONFIGURATION: "Surefire test" - @BeforeMethod org.apache.brooklyn.test.framework.TestEffectorTest.setUp() finished in 52 ms
2018-12-28 12:45:01,373 INFO  - TESTNG INVOKING: "Surefire test" - org.apache.brooklyn.test.framework.TestEffectorTest.testEffectorTimeoutAppliesOnlyToCallAndNotToAssertionCheck()
2018-12-28 12:45:01,413 WARN  f8diCoNd-[ksk5aznuxn,wt68bjndin,p86ja4hdj3] Repeater: error caught checking condition: effectorReturnsString expected equalTo Not the string I expected but found Goodbye World!
2018-12-28 12:45:01,420 WARN  f8diCoNd-[ksk5aznuxn,wt68bjndin,p86ja4hdj3] Error invoking start at TestEffectorImpl{id=p86ja4hdj3}: AssertionError: effectorReturnsString expected equalTo Not the string I expected but found Goodbye World!
2018-12-28 12:45:01,436 WARN  oEYbNCb4-[ksk5aznuxn,wt68bjndin] Error invoking start at TestCaseImpl{id=wt68bjndin}: Error invoking start at TestEffectorImpl{id=p86ja4hdj3}: AssertionError: effectorReturnsString expected equalTo Not the string I expected but found Goodbye World!
2018-12-28 12:45:01,447 WARN  CZ25qB7E-[ksk5aznuxn] Setting Application[k5aznuxn] on-fire due to problems when expected running, up=false, problems: {service-lifecycle-indicators-from-children-and-members=Required entity not healthy: TestCase:wt68 (wt68bjndin)}
2018-12-28 12:45:01,447 WARN  - Setting Application[k5aznuxn] on-fire due to problems when expected running, up=false, problems: {service-lifecycle-indicators-from-children-and-members=Required entity not healthy: TestCase:wt68 (wt68bjndin)}
2018-12-28 12:45:01,447 WARN  CZ25qB7E-[ksk5aznuxn] Error invoking start at Application[k5aznuxn]: ProblemStartingChildrenException: org.apache.brooklyn.util.exceptions.PropagatedRuntimeException: Error invoking start at TestCaseImpl{id=wt68bjndin}: Error invoking start at TestEffectorImpl{id=p86ja4hdj3}: AssertionError: effectorReturnsString expected equalTo Not the string I expected but found Goodbye World!
2018-12-28 12:45:01,475 INFO  - TESTNG PASSED: "Surefire test" - org.apache.brooklyn.test.framework.TestEffectorTest.testEffectorTimeoutAppliesOnlyToCallAndNotToAssertionCheck() finished in 102 ms
2018-12-28 12:45:01,476 INFO  - TESTNG INVOKING CONFIGURATION: "Surefire test" - @AfterMethod org.apache.brooklyn.core.test.BrooklynMgmtUnitTestSupport.tearDown()
2018-12-28 12:45:01,500 INFO  - TESTNG PASSED CONFIGURATION: "Surefire test" - @AfterMethod org.apache.brooklyn.core.test.BrooklynMgmtUnitTestSupport.tearDown() finished in 24 ms
2018-12-28 12:45:01,501 INFO  - TESTNG INVOKING CONFIGURATION: "Surefire test" - @BeforeMethod org.apache.brooklyn.test.framework.TestEffectorTest.setUp()
2018-12-28 12:45:01,501 INFO  - Added external config supplier named 'brooklyn-demo-sample': org.apache.brooklyn.core.config.external.InPlaceExternalConfigSupplier@6cc64028
2018-12-28 12:45:01,538 INFO  - TESTNG PASSED CONFIGURATION: "Surefire test" - @BeforeMethod org.apache.brooklyn.test.framework.TestEffectorTest.setUp() finished in 37 ms
2018-12-28 12:45:01,538 INFO  - TESTNG INVOKING: "Surefire test" - org.apache.brooklyn.test.framework.TestEffectorTest.testFailFastIfNoEffector()
2018-12-28 12:45:01,562 WARN  hSwhaG7J-[kdm9q9ggc3,d1xv76lfel,ezbkstipou] Error invoking start at TestEffectorImpl{id=ezbkstipou}: NullPointerException: config effector[ConfigKey:java.lang.String] must not be null
2018-12-28 12:45:01,569 WARN  nTHAksL1-[kdm9q9ggc3,d1xv76lfel] Error invoking start at TestCaseImpl{id=d1xv76lfel}: Error invoking start at TestEffectorImpl{id=ezbkstipou}: NullPointerException: config effector[ConfigKey:java.lang.String] must not be null
2018-12-28 12:45:01,581 WARN  fP7gfneg-[kdm9q9ggc3] Setting Application[m9q9ggc3] on-fire due to problems when expected running, up=false, not-up-indicators: {service.state=Application starting, service-lifecycle-indicators-from-children-and-members=TestCaseImpl{id=d1xv76lfel} is not up}
2018-12-28 12:45:01,587 WARN  fP7gfneg-[kdm9q9ggc3] Error invoking start at Application[m9q9ggc3]: ProblemStartingChildrenException: org.apache.brooklyn.util.exceptions.PropagatedRuntimeException: Error invoking start at TestCaseImpl{id=d1xv76lfel}: Error invoking start at TestEffectorImpl{id=ezbkstipou}: NullPointerException: config effector[ConfigKey:java.lang.String] must not be null
2018-12-28 12:45:01,607 INFO  - TESTNG PASSED: "Surefire test" - org.apache.brooklyn.test.framework.TestEffectorTest.testFailFastIfNoEffector() finished in 69 ms
2018-12-28 12:45:01,607 INFO  - TESTNG INVOKING CONFIGURATION: "Surefire test" - @AfterMethod org.apache.brooklyn.core.test.BrooklynMgmtUnitTestSupport.tearDown()
2018-12-28 12:45:01,628 INFO  - TESTNG PASSED CONFIGURATION: "Surefire test" - @AfterMethod org.apache.brooklyn.core.test.BrooklynMgmtUnitTestSupport.tearDown() finished in 21 ms
2018-12-28 12:45:01,630 INFO  - TESTNG INVOKING CONFIGURATION: "Surefire test" - @BeforeMethod org.apache.brooklyn.test.framework.TestEffectorTest.setUp()
2018-12-28 12:45:01,633 INFO  - Added external config supplier named 'brooklyn-demo-sample': org.apache.brooklyn.core.config.external.InPlaceExternalConfigSupplier@6b27b2d0
2018-12-28 12:45:01,672 INFO  - TESTNG PASSED CONFIGURATION: "Surefire test" - @BeforeMethod org.apache.brooklyn.test.framework.TestEffectorTest.setUp() finished in 42 ms
2018-12-28 12:45:01,675 INFO  - TESTNG INVOKING: "Surefire test" - org.apache.brooklyn.test.framework.TestEffectorTest.testFailFastIfNoTargetEntity()
2018-12-28 12:45:01,692 WARN  Cq4eZRPu-[dqbro7c2nx,gn2bxbm1a9,spwxdl39z3] Error invoking start at TestEffectorImpl{id=spwxdl39z3}: Cannot resolve target entity
2018-12-28 12:45:01,696 WARN  ADvmQWcb-[dqbro7c2nx,gn2bxbm1a9] Error invoking start at TestCaseImpl{id=gn2bxbm1a9}: Error invoking start at TestEffectorImpl{id=spwxdl39z3}: Cannot resolve target entity
2018-12-28 12:45:01,702 WARN  vRSvXFqW-[dqbro7c2nx] Setting Application[bro7c2nx] on-fire due to problems when expected running, up=false, problems: {service-lifecycle-indicators-from-children-and-members=Required entity not healthy: TestCase:gn2b (gn2bxbm1a9)}
2018-12-28 12:45:01,702 WARN  - Setting Application[bro7c2nx] on-fire due to problems when expected running, up=false, problems: {service-lifecycle-indicators-from-children-and-members=Required entity not healthy: TestCase:gn2b (gn2bxbm1a9)}
2018-12-28 12:45:01,708 WARN  vRSvXFqW-[dqbro7c2nx] Error invoking start at Application[bro7c2nx]: ProblemStartingChildrenException: org.apache.brooklyn.util.exceptions.PropagatedRuntimeException: Error invoking start at TestCaseImpl{id=gn2bxbm1a9}: Error invoking start at TestEffectorImpl{id=spwxdl39z3}: Cannot resolve target entity
2018-12-28 12:45:01,714 INFO  - TESTNG PASSED: "Surefire test" - org.apache.brooklyn.test.framework.TestEffectorTest.testFailFastIfNoTargetEntity() finished in 42 ms
2018-12-28 12:45:01,714 INFO  - TESTNG INVOKING CONFIGURATION: "Surefire test" - @AfterMethod org.apache.brooklyn.core.test.BrooklynMgmtUnitTestSupport.tearDown()
2018-12-28 12:45:01,730 INFO  - TESTNG PASSED CONFIGURATION: "Surefire test" - @AfterMethod org.apache.brooklyn.core.test.BrooklynMgmtUnitTestSupport.tearDown() finished in 16 ms
2018-12-28 12:45:01,731 INFO  - TESTNG INVOKING CONFIGURATION: "Surefire test" - @BeforeMethod org.apache.brooklyn.test.framework.TestEffectorTest.setUp()
2018-12-28 12:45:01,731 INFO  - Added external config supplier named 'brooklyn-demo-sample': org.apache.brooklyn.core.config.external.InPlaceExternalConfigSupplier@4b9c411
2018-12-28 12:45:01,755 INFO  - TESTNG PASSED CONFIGURATION: "Surefire test" - @BeforeMethod org.apache.brooklyn.test.framework.TestEffectorTest.setUp() finished in 24 ms
2018-12-28 12:45:01,757 INFO  - TESTNG INVOKING: "Surefire test" - org.apache.brooklyn.test.framework.TestEffectorTest.testSimpleEffector()
2018-12-28 12:45:01,785 INFO  - TESTNG PASSED: "Surefire test" - org.apache.brooklyn.test.framework.TestEffectorTest.testSimpleEffector() finished in 30 ms
2018-12-28 12:45:01,785 INFO  - TESTNG INVOKING CONFIGURATION: "Surefire test" - @AfterMethod org.apache.brooklyn.core.test.BrooklynMgmtUnitTestSupport.tearDown()
2018-12-28 12:45:01,796 INFO  - TESTNG PASSED CONFIGURATION: "Surefire test" - @AfterMethod org.apache.brooklyn.core.test.BrooklynMgmtUnitTestSupport.tearDown() finished in 11 ms
2018-12-28 12:45:01,859 INFO  - TESTNG 
===============================================
    Surefire test
    Tests run: 235, Failures: 1, Skips: 0
===============================================
Tests run: 235, Failures: 1, Errors: 0, Skipped: 0, Time elapsed: 22.191 sec <<< FAILURE! - in TestSuite
testEffectorFailureRetriedUpToMaxAttempts(org.apache.brooklyn.test.framework.TestEffectorTest)  Time elapsed: 0.153 sec  <<< FAILURE!
java.lang.AssertionError: expected [2] but found [1]
	at org.apache.brooklyn.test.framework.TestEffectorTest.testEffectorFailureRetriedUpToMaxAttempts(TestEffectorTest.java:247)


Results :

Failed tests: 
  TestEffectorTest.testEffectorFailureRetriedUpToMaxAttempts:247 expected [2] but found [1]

Tests run: 235, Failures: 1, Errors: 0, Skipped: 0

[INFO] ------------------------------------------------------------------------
[INFO] Reactor Summary:
[INFO] 
[INFO] Brooklyn Server Root ............................... SUCCESS [  8.882 s]
[INFO] Brooklyn Parent Project ............................ SUCCESS [  9.688 s]
[INFO] Brooklyn Test Support Utilities .................... SUCCESS [ 10.809 s]
[INFO] Brooklyn Logback Includable Configuration .......... SUCCESS [  0.674 s]
[INFO] Brooklyn Common Utilities .......................... SUCCESS [ 36.055 s]
[INFO] Brooklyn API ....................................... SUCCESS [  4.694 s]
[INFO] CAMP Server Parent Project ......................... SUCCESS [  0.149 s]
[INFO] CAMP Base .......................................... SUCCESS [  4.843 s]
[INFO] Brooklyn Test Support .............................. SUCCESS [  2.703 s]
[INFO] Brooklyn REST Swagger Apidoc Utilities ............. SUCCESS [ 18.252 s]
[INFO] Brooklyn Logback Configuration ..................... SUCCESS [  0.309 s]
[INFO] CAMP Server ........................................ SUCCESS [ 18.952 s]
[INFO] Brooklyn Felix Runtime ............................. SUCCESS [  3.667 s]
[INFO] Brooklyn Groovy Utilities .......................... SUCCESS [  2.405 s]
[INFO] Brooklyn Core ...................................... SUCCESS [04:44 min]
[INFO] Brooklyn Policies .................................. SUCCESS [ 36.359 s]
[INFO] Brooklyn WinRM Software Entities ................... SUCCESS [ 25.404 s]
[INFO] Brooklyn Secure JMXMP Agent ........................ SUCCESS [  8.352 s]
[INFO] Brooklyn JMX RMI Agent ............................. SUCCESS [  0.374 s]
[INFO] Brooklyn Jclouds Location Targets .................. SUCCESS [01:26 min]
[INFO] Brooklyn Software Base ............................. SUCCESS [01:35 min]
[INFO] Brooklyn CAMP ...................................... SUCCESS [02:51 min]
[INFO] Brooklyn Launcher Common ........................... SUCCESS [  4.164 s]
[INFO] Brooklyn REST API .................................. SUCCESS [ 11.708 s]
[INFO] Brooklyn REST Resources ............................ SUCCESS [ 57.588 s]
[INFO] Brooklyn REST Server ............................... SUCCESS [ 23.551 s]
[INFO] Brooklyn Launcher .................................. SUCCESS [04:22 min]
[INFO] Brooklyn Container Location Targets ................ SUCCESS [ 15.472 s]
[INFO] Brooklyn Command Line Interface .................... SUCCESS [ 12.793 s]
[INFO] Brooklyn Test Framework ............................ FAILURE [ 28.204 s]
[INFO] Brooklyn OSGi init ................................. SKIPPED
[INFO] Brooklyn OSGi start ................................ SKIPPED
[INFO] Brooklyn Karaf ..................................... SKIPPED
[INFO] Jetty config fragment .............................. SKIPPED
[INFO] Apache Http Component extension .................... SKIPPED
[INFO] Brooklyn Karaf Features ............................ SKIPPED
[INFO] Brooklyn Karaf Shell Commands ...................... SKIPPED
[INFO] Brooklyn UI :: Parent .............................. SKIPPED
[INFO] Brooklyn UI :: Modularity Server (parent) .......... SKIPPED
[INFO] Brooklyn UI :: Modularity Server :: UI Module API .. SKIPPED
[INFO] Brooklyn UI :: Modularity Server :: UI Module Registry SKIPPED
[INFO] Brooklyn UI :: Modularity Server :: UI Proxy ....... SKIPPED
[INFO] Brooklyn UI :: Modularity Server :: UI Metadata Registry SKIPPED
[INFO] Brooklyn UI :: Modularity Server :: External UI Modules Registration Hooks SKIPPED
[INFO] Brooklyn UI :: Modularity Server :: Features ....... SKIPPED
[INFO] Brooklyn UI :: Modules (parent) .................... SKIPPED
[INFO] Brooklyn UI :: Modules - UI Utils .................. SKIPPED
[INFO] Brooklyn UI :: Modules - Home ...................... SKIPPED
[INFO] Brooklyn UI :: Modules - App inspector ............. SKIPPED
[INFO] Brooklyn UI :: Modules - Blueprint composer ........ SKIPPED
[INFO] Brooklyn UI :: Modules - Blueprint importer ........ SKIPPED
[INFO] Brooklyn UI :: Modules - Catalog ................... SKIPPED
[INFO] Brooklyn UI :: Modules - Location manager .......... SKIPPED
[INFO] Brooklyn UI :: Modules - REST API Docs ............. SKIPPED
[INFO] Brooklyn UI :: Modules - Groovy console ............ SKIPPED
[INFO] Brooklyn UI :: Modules - Logout .................... SKIPPED
[INFO] Brooklyn UI :: Modules - Features .................. SKIPPED
[INFO] Brooklyn UI :: Features ............................ SKIPPED
[INFO] Brooklyn Library Root .............................. SKIPPED
[INFO] Brooklyn CM Chef ................................... SKIPPED
[INFO] Brooklyn CM SaltStack .............................. SKIPPED
[INFO] Brooklyn CM Ansible ................................ SKIPPED
[INFO] Brooklyn CM Integration Root ....................... SKIPPED
[INFO] Brooklyn Network Software Entities ................. SKIPPED
[INFO] Brooklyn OSGi Software Entities .................... SKIPPED
[INFO] Brooklyn Database Software Entities ................ SKIPPED
[INFO] Brooklyn Web App Software Entities ................. SKIPPED
[INFO] Brooklyn Messaging Software Entities ............... SKIPPED
[INFO] Brooklyn NoSQL Data Store Software Entities ........ SKIPPED
[INFO] Brooklyn Monitoring Software Entities .............. SKIPPED
[INFO] Brooklyn Web App Software Entities ................. SKIPPED
[INFO] Brooklyn QA ........................................ SKIPPED
[INFO] Brooklyn Examples Aggregator Project ............... SKIPPED
[INFO] Brooklyn Examples Aggregator Project - Webapps ..... SKIPPED
[INFO] hello-world-webapp Maven Webapp .................... SKIPPED
[INFO] hello-world-sql-webapp Maven Webapp ................ SKIPPED
[INFO] Brooklyn Simple Web Cluster Example ................ SKIPPED
[INFO] Brooklyn Library Karaf integration ................. SKIPPED
[INFO] Brooklyn Library Catalog ........................... SKIPPED
[INFO] Brooklyn Library Karaf Features .................... SKIPPED
[INFO] Brooklyn Client .................................... SKIPPED
[INFO] Brooklyn Client Command Line Interface ............. SKIPPED
[INFO] Brooklyn REST java Client .......................... SKIPPED
[INFO] Brooklyn Downstream Project Parent ................. SKIPPED
[INFO] Brooklyn Dist Root ................................. SKIPPED
[INFO] Brooklyn All Things ................................ SKIPPED
[INFO] Brooklyn Distribution .............................. SKIPPED
[INFO] Brooklyn Karaf Distribution Parent ................. SKIPPED
[INFO] Brooklyn Karaf Server Configuration ................ SKIPPED
[INFO] Brooklyn Dist Karaf Features ....................... SKIPPED
[INFO] Brooklyn Karaf Distribution ........................ SKIPPED
[INFO] Brooklyn Karaf pax-exam itest ...................... SKIPPED
[INFO] Brooklyn Vagrant Getting Started Environment ....... SKIPPED
[INFO] Brooklyn Quick-Start Project Archetype ............. SKIPPED
[INFO] Brooklyn Shared Package Files ...................... SKIPPED
[INFO] Brooklyn RPM Package ............................... SKIPPED
[INFO] Brooklyn DEB Package ............................... SKIPPED
[INFO] Brooklyn Root 1.0.0-SNAPSHOT ....................... SKIPPED
[INFO] ------------------------------------------------------------------------
[INFO] BUILD FAILURE
[INFO] ------------------------------------------------------------------------
[INFO] Total time: 21:38 min
[INFO] Finished at: 2018-12-28T12:45:02Z
[INFO] ------------------------------------------------------------------------
[ERROR] Failed to execute goal org.apache.maven.plugins:maven-surefire-plugin:2.19.1:test (default-test) on project brooklyn-test-framework: There are test failures.
[ERROR] 
[ERROR] Please refer to /usr/build/brooklyn-server/test-framework/target/surefire-reports for the individual test results.
[ERROR] -> [Help 1]
[ERROR] 
[ERROR] To see the full stack trace of the errors, re-run Maven with the -e switch.
[ERROR] Re-run Maven using the -X switch to enable full debug logging.
[ERROR] 
[ERROR] For more information about the errors and possible solutions, please read the following articles:
[ERROR] [Help 1] http://cwiki.apache.org/confluence/display/MAVEN/MojoFailureException
[ERROR] 
[ERROR] After correcting the problems, you can resume the build with the command
[ERROR]   mvn <goals> -rf :brooklyn-test-framework
Build step 'Execute shell' marked build as failure
Recording test results
TestNG Reports Processing: START
Looking for TestNG results report in workspace using pattern: **/testng-results.xml
Saving reports...
Processing '/x1/jenkins/jenkins-home/jobs/brooklyn-master-build-docker/builds/1210/testng/testng-results-1.xml'
Processing '/x1/jenkins/jenkins-home/jobs/brooklyn-master-build-docker/builds/1210/testng/testng-results-10.xml'
Processing '/x1/jenkins/jenkins-home/jobs/brooklyn-master-build-docker/builds/1210/testng/testng-results-11.xml'
Processing '/x1/jenkins/jenkins-home/jobs/brooklyn-master-build-docker/builds/1210/testng/testng-results-12.xml'
Processing '/x1/jenkins/jenkins-home/jobs/brooklyn-master-build-docker/builds/1210/testng/testng-results-13.xml'
Processing '/x1/jenkins/jenkins-home/jobs/brooklyn-master-build-docker/builds/1210/testng/testng-results-14.xml'
Processing '/x1/jenkins/jenkins-home/jobs/brooklyn-master-build-docker/builds/1210/testng/testng-results-15.xml'
Processing '/x1/jenkins/jenkins-home/jobs/brooklyn-master-build-docker/builds/1210/testng/testng-results-16.xml'
Processing '/x1/jenkins/jenkins-home/jobs/brooklyn-master-build-docker/builds/1210/testng/testng-results-17.xml'
Processing '/x1/jenkins/jenkins-home/jobs/brooklyn-master-build-docker/builds/1210/testng/testng-results-18.xml'
Processing '/x1/jenkins/jenkins-home/jobs/brooklyn-master-build-docker/builds/1210/testng/testng-results-19.xml'
Processing '/x1/jenkins/jenkins-home/jobs/brooklyn-master-build-docker/builds/1210/testng/testng-results-2.xml'
Processing '/x1/jenkins/jenkins-home/jobs/brooklyn-master-build-docker/builds/1210/testng/testng-results-20.xml'
Processing '/x1/jenkins/jenkins-home/jobs/brooklyn-master-build-docker/builds/1210/testng/testng-results-3.xml'
Processing '/x1/jenkins/jenkins-home/jobs/brooklyn-master-build-docker/builds/1210/testng/testng-results-4.xml'
Processing '/x1/jenkins/jenkins-home/jobs/brooklyn-master-build-docker/builds/1210/testng/testng-results-5.xml'
Processing '/x1/jenkins/jenkins-home/jobs/brooklyn-master-build-docker/builds/1210/testng/testng-results-6.xml'
Processing '/x1/jenkins/jenkins-home/jobs/brooklyn-master-build-docker/builds/1210/testng/testng-results-7.xml'
Processing '/x1/jenkins/jenkins-home/jobs/brooklyn-master-build-docker/builds/1210/testng/testng-results-8.xml'
Processing '/x1/jenkins/jenkins-home/jobs/brooklyn-master-build-docker/builds/1210/testng/testng-results-9.xml'
Processing '/x1/jenkins/jenkins-home/jobs/brooklyn-master-build-docker/builds/1210/testng/testng-results.xml'
0.019782% of tests failed, which exceeded threshold of 0%. Marking build as UNSTABLE
TestNG Reports Processing: FINISH