osdir.com


[Date Prev][Date Next][Thread Prev][Thread Next][Date Index][Thread Index]

Build failed in Jenkins: brooklyn-master-build-docker-pipeline #91


See <https://builds.apache.org/job/brooklyn-master-build-docker-pipeline/91/display/redirect>

------------------------------------------
[...truncated 8.04 MB...]
2018-12-17 23:17:00,367 INFO  hXmFWElK-[o8abrj7kj8,gs336i36ga] Stopping VanillaJavaAppImpl{id=gs336i36ga} in [SshMachineLocation[SshMachineLocation:kjkw:jenkins@localhost/127.0.0.1:22(id=kjkwj9cdc7)]]
2018-12-17 23:17:00,383 INFO  - TESTNG PASSED CONFIGURATION: "Surefire test" - @AfterMethod org.apache.brooklyn.entity.java.JavaOptsTest.tearDown() finished in 20 ms
2018-12-17 23:17:00,383 INFO  - TESTNG INVOKING CONFIGURATION: "Surefire test" - @BeforeMethod org.apache.brooklyn.entity.java.JavaOptsTest.setUp()
2018-12-17 23:17:00,384 INFO  - Added external config supplier named 'brooklyn-demo-sample': org.apache.brooklyn.core.config.external.InPlaceExternalConfigSupplier@679886ad
2018-12-17 23:17:00,392 INFO  - TESTNG PASSED CONFIGURATION: "Surefire test" - @BeforeMethod org.apache.brooklyn.entity.java.JavaOptsTest.setUp() finished in 9 ms
2018-12-17 23:17:00,392 INFO  - TESTNG INVOKING: "Surefire test" - org.apache.brooklyn.entity.java.JavaOptsTest.testPassesJavaOptsObeyingMutualExclusions()
2018-12-17 23:17:00,427 INFO  - Starting TestingJavaOptsVanillaJavaAppImpl{id=cjfzf35ea0} on machine SshMachineLocation[SshMachineLocation:vsp8:null@localhost/127.0.0.1:22(id=vsp849vjgw)]
[GC (Allocation Failure)  225006K->62917K(738816K), 0.0141923 secs]
2018-12-17 23:17:00,587 INFO  - No valid management node found for choosing new master: contender={zULMNqhl=BasicManagementNodeSyncRecord{nodeId=zULMNqhl, status=TERMINATED}, mn4B6zyO=BasicManagementNodeSyncRecord{nodeId=mn4B6zyO, status=TERMINATED}}
2018-12-17 23:17:00,588 INFO  - Management node mn4B6zyO detected master change, from zULMNqhl(1545088602000 / 18.6s ago) to <none>
2018-12-17 23:17:00,597 INFO  - TESTNG PASSED: "Surefire test" - org.apache.brooklyn.entity.java.JavaOptsTest.testPassesJavaOptsObeyingMutualExclusions() finished in 205 ms
2018-12-17 23:17:00,598 INFO  - TESTNG INVOKING CONFIGURATION: "Surefire test" - @AfterMethod org.apache.brooklyn.entity.java.JavaOptsTest.tearDown()
2018-12-17 23:17:00,600 INFO  FhipbxnN-[yub04vd4o7,cjfzf35ea0] Stopping TestingJavaOptsVanillaJavaAppImpl{id=cjfzf35ea0} in [SshMachineLocation[SshMachineLocation:vsp8:jenkins@localhost/127.0.0.1:22(id=vsp849vjgw)]]
2018-12-17 23:17:00,608 INFO  - TESTNG PASSED CONFIGURATION: "Surefire test" - @AfterMethod org.apache.brooklyn.entity.java.JavaOptsTest.tearDown() finished in 10 ms
2018-12-17 23:17:00,609 INFO  - TESTNG INVOKING CONFIGURATION: "Surefire test" - @BeforeMethod org.apache.brooklyn.entity.java.JavaOptsTest.setUp()
2018-12-17 23:17:00,609 INFO  - Added external config supplier named 'brooklyn-demo-sample': org.apache.brooklyn.core.config.external.InPlaceExternalConfigSupplier@207f7baa
2018-12-17 23:17:00,622 INFO  - TESTNG PASSED CONFIGURATION: "Surefire test" - @BeforeMethod org.apache.brooklyn.entity.java.JavaOptsTest.setUp() finished in 13 ms
2018-12-17 23:17:00,624 INFO  - TESTNG INVOKING: "Surefire test" - org.apache.brooklyn.entity.java.JavaOptsTest.testPassesJavaOptsOverridingDefaults()
2018-12-17 23:17:00,644 INFO  - Starting VanillaJavaAppImpl{id=u99svk036e} on machine SshMachineLocation[SshMachineLocation:gdzk:null@localhost/127.0.0.1:22(id=gdzkl6flas)]
2018-12-17 23:17:00,827 INFO  - TESTNG PASSED: "Surefire test" - org.apache.brooklyn.entity.java.JavaOptsTest.testPassesJavaOptsOverridingDefaults() finished in 203 ms
2018-12-17 23:17:00,828 INFO  - TESTNG INVOKING CONFIGURATION: "Surefire test" - @AfterMethod org.apache.brooklyn.entity.java.JavaOptsTest.tearDown()
2018-12-17 23:17:00,833 INFO  Ya4ZolP3-[xtrtuxb9lr,u99svk036e] Stopping VanillaJavaAppImpl{id=u99svk036e} in [SshMachineLocation[SshMachineLocation:gdzk:jenkins@localhost/127.0.0.1:22(id=gdzkl6flas)]]
2018-12-17 23:17:00,842 INFO  - TESTNG PASSED CONFIGURATION: "Surefire test" - @AfterMethod org.apache.brooklyn.entity.java.JavaOptsTest.tearDown() finished in 14 ms
2018-12-17 23:17:00,842 INFO  - TESTNG INVOKING CONFIGURATION: "Surefire test" - @BeforeMethod org.apache.brooklyn.entity.java.JavaOptsTest.setUp()
2018-12-17 23:17:00,843 INFO  - Added external config supplier named 'brooklyn-demo-sample': org.apache.brooklyn.core.config.external.InPlaceExternalConfigSupplier@2f70d78c
2018-12-17 23:17:00,857 INFO  - TESTNG PASSED CONFIGURATION: "Surefire test" - @BeforeMethod org.apache.brooklyn.entity.java.JavaOptsTest.setUp() finished in 15 ms
2018-12-17 23:17:00,858 INFO  - TESTNG INVOKING: "Surefire test" - org.apache.brooklyn.entity.java.JavaOptsTest.testPassesJavaSysProps()
2018-12-17 23:17:00,881 INFO  - Starting VanillaJavaAppImpl{id=hogweandd0} on machine SshMachineLocation[SshMachineLocation:r3hd:null@localhost/127.0.0.1:22(id=r3hdlm2jqr)]
2018-12-17 23:17:01,044 INFO  - TESTNG PASSED: "Surefire test" - org.apache.brooklyn.entity.java.JavaOptsTest.testPassesJavaSysProps() finished in 185 ms
2018-12-17 23:17:01,044 INFO  - TESTNG INVOKING CONFIGURATION: "Surefire test" - @AfterMethod org.apache.brooklyn.entity.java.JavaOptsTest.tearDown()
2018-12-17 23:17:01,046 INFO  XyhxpqgI-[zihav8eidu,hogweandd0] Stopping VanillaJavaAppImpl{id=hogweandd0} in [SshMachineLocation[SshMachineLocation:r3hd:jenkins@localhost/127.0.0.1:22(id=r3hdlm2jqr)]]
2018-12-17 23:17:01,057 INFO  - TESTNG PASSED CONFIGURATION: "Surefire test" - @AfterMethod org.apache.brooklyn.entity.java.JavaOptsTest.tearDown() finished in 13 ms
2018-12-17 23:17:01,057 INFO  - TESTNG INVOKING CONFIGURATION: "Surefire test" - @BeforeMethod org.apache.brooklyn.entity.java.JavaOptsTest.setUp()
2018-12-17 23:17:01,058 INFO  - Added external config supplier named 'brooklyn-demo-sample': org.apache.brooklyn.core.config.external.InPlaceExternalConfigSupplier@3f2feab7
2018-12-17 23:17:01,071 INFO  - TESTNG PASSED CONFIGURATION: "Surefire test" - @BeforeMethod org.apache.brooklyn.entity.java.JavaOptsTest.setUp() finished in 14 ms
2018-12-17 23:17:01,072 INFO  - TESTNG INVOKING: "Surefire test" - org.apache.brooklyn.entity.java.JavaOptsTest.testSecureJmxConfigFromDefault()
2018-12-17 23:17:01,092 INFO  - Starting TestingNoSensorsVanillaJavaAppImpl{id=rws2jv16jh} on machine SshMachineLocation[SshMachineLocation:xwow:null@localhost/127.0.0.1:22(id=xwowlge1nz)]
2018-12-17 23:17:01,117 INFO  - Creating PortForwardManager(scope=global)
2018-12-17 23:17:01,476 INFO  - TESTNG PASSED: "Surefire test" - org.apache.brooklyn.entity.java.JavaOptsTest.testSecureJmxConfigFromDefault() finished in 404 ms
2018-12-17 23:17:01,476 INFO  - TESTNG INVOKING CONFIGURATION: "Surefire test" - @AfterMethod org.apache.brooklyn.entity.java.JavaOptsTest.tearDown()
2018-12-17 23:17:01,478 INFO  kVh7wZ0s-[ugytlpdv0j,rws2jv16jh] Stopping TestingNoSensorsVanillaJavaAppImpl{id=rws2jv16jh} in [SshMachineLocation[SshMachineLocation:xwow:jenkins@localhost/127.0.0.1:22(id=xwowlge1nz)]]
2018-12-17 23:17:01,492 INFO  - TESTNG PASSED CONFIGURATION: "Surefire test" - @AfterMethod org.apache.brooklyn.entity.java.JavaOptsTest.tearDown() finished in 16 ms
2018-12-17 23:17:01,492 INFO  - TESTNG INVOKING CONFIGURATION: "Surefire test" - @BeforeMethod org.apache.brooklyn.entity.java.JavaOptsTest.setUp()
2018-12-17 23:17:01,493 INFO  - Added external config supplier named 'brooklyn-demo-sample': org.apache.brooklyn.core.config.external.InPlaceExternalConfigSupplier@40e7aea9
2018-12-17 23:17:01,505 INFO  - TESTNG PASSED CONFIGURATION: "Surefire test" - @BeforeMethod org.apache.brooklyn.entity.java.JavaOptsTest.setUp() finished in 13 ms
2018-12-17 23:17:01,507 INFO  - TESTNG INVOKING: "Surefire test" - org.apache.brooklyn.entity.java.JavaOptsTest.testSimpleLaunchesJavaProcess()
2018-12-17 23:17:01,526 INFO  - Starting VanillaJavaAppImpl{id=prd3osxgzn} on machine SshMachineLocation[SshMachineLocation:as5m:null@localhost/127.0.0.1:22(id=as5mdu3bs8)]
2018-12-17 23:17:01,595 INFO  - No valid management node found for choosing new master: contender={zULMNqhl=BasicManagementNodeSyncRecord{nodeId=zULMNqhl, status=TERMINATED}, mn4B6zyO=BasicManagementNodeSyncRecord{nodeId=mn4B6zyO, status=TERMINATED}}
2018-12-17 23:17:01,595 INFO  - Management node mn4B6zyO detected master change, from zULMNqhl(1545088602000 / 19.6s ago) to <none>
2018-12-17 23:17:01,688 INFO  - TESTNG PASSED: "Surefire test" - org.apache.brooklyn.entity.java.JavaOptsTest.testSimpleLaunchesJavaProcess() finished in 181 ms
2018-12-17 23:17:01,689 INFO  - TESTNG INVOKING CONFIGURATION: "Surefire test" - @AfterMethod org.apache.brooklyn.entity.java.JavaOptsTest.tearDown()
2018-12-17 23:17:01,691 INFO  bPxkwO1W-[ur9u1k7ggg,prd3osxgzn] Stopping VanillaJavaAppImpl{id=prd3osxgzn} in [SshMachineLocation[SshMachineLocation:as5m:jenkins@localhost/127.0.0.1:22(id=as5mdu3bs8)]]
2018-12-17 23:17:01,698 INFO  - TESTNG PASSED CONFIGURATION: "Surefire test" - @AfterMethod org.apache.brooklyn.entity.java.JavaOptsTest.tearDown() finished in 10 ms
2018-12-17 23:17:01,699 INFO  - TESTNG INVOKING: "Surefire test" - org.apache.brooklyn.entity.java.JmxSupportTest.testCoerceStringtoJmxAgentModes()
2018-12-17 23:17:01,700 INFO  - TESTNG PASSED: "Surefire test" - org.apache.brooklyn.entity.java.JmxSupportTest.testCoerceStringtoJmxAgentModes() finished in 1 ms
2018-12-17 23:17:01,700 INFO  - TESTNG INVOKING CONFIGURATION: "Surefire test" - @AfterMethod org.apache.brooklyn.entity.java.JmxSupportTest.tearDown()
2018-12-17 23:17:01,701 INFO  - TESTNG PASSED CONFIGURATION: "Surefire test" - @AfterMethod org.apache.brooklyn.entity.java.JmxSupportTest.tearDown() finished in 1 ms
2018-12-17 23:17:01,702 INFO  - TESTNG INVOKING: "Surefire test" - org.apache.brooklyn.entity.java.JmxSupportTest.testJmxAutodetect()
2018-12-17 23:17:01,702 INFO  - Added external config supplier named 'brooklyn-demo-sample': org.apache.brooklyn.core.config.external.InPlaceExternalConfigSupplier@47b71556
2018-12-17 23:17:01,720 INFO  - TESTNG PASSED: "Surefire test" - org.apache.brooklyn.entity.java.JmxSupportTest.testJmxAutodetect() finished in 18 ms
2018-12-17 23:17:01,720 INFO  - TESTNG INVOKING CONFIGURATION: "Surefire test" - @AfterMethod org.apache.brooklyn.entity.java.JmxSupportTest.tearDown()
2018-12-17 23:17:01,725 INFO  - TESTNG PASSED CONFIGURATION: "Surefire test" - @AfterMethod org.apache.brooklyn.entity.java.JmxSupportTest.tearDown() finished in 5 ms
2018-12-17 23:17:01,726 INFO  - TESTNG INVOKING: "Surefire test" - org.apache.brooklyn.entity.java.JmxSupportTest.testJmxmpJarExistence()
2018-12-17 23:17:01,728 INFO  - Added external config supplier named 'brooklyn-demo-sample': org.apache.brooklyn.core.config.external.InPlaceExternalConfigSupplier@3fae357f
2018-12-17 23:17:01,740 INFO  - TESTNG PASSED: "Surefire test" - org.apache.brooklyn.entity.java.JmxSupportTest.testJmxmpJarExistence() finished in 14 ms
2018-12-17 23:17:01,740 INFO  - TESTNG INVOKING CONFIGURATION: "Surefire test" - @AfterMethod org.apache.brooklyn.entity.java.JmxSupportTest.tearDown()
2018-12-17 23:17:01,745 INFO  - TESTNG PASSED CONFIGURATION: "Surefire test" - @AfterMethod org.apache.brooklyn.entity.java.JmxSupportTest.tearDown() finished in 5 ms
2018-12-17 23:17:01,746 INFO  - TESTNG INVOKING: "Surefire test" - org.apache.brooklyn.entity.java.JmxSupportTest.testJmxrmiJarExistence()
2018-12-17 23:17:01,748 INFO  - Added external config supplier named 'brooklyn-demo-sample': org.apache.brooklyn.core.config.external.InPlaceExternalConfigSupplier@7f36cd8f
2018-12-17 23:17:01,757 INFO  - TESTNG PASSED: "Surefire test" - org.apache.brooklyn.entity.java.JmxSupportTest.testJmxrmiJarExistence() finished in 11 ms
2018-12-17 23:17:01,758 INFO  - TESTNG INVOKING CONFIGURATION: "Surefire test" - @AfterMethod org.apache.brooklyn.entity.java.JmxSupportTest.tearDown()
2018-12-17 23:17:01,762 INFO  - TESTNG PASSED CONFIGURATION: "Surefire test" - @AfterMethod org.apache.brooklyn.entity.java.JmxSupportTest.tearDown() finished in 4 ms
2018-12-17 23:17:01,852 INFO  - TESTNG 
===============================================
    Surefire test
    Tests run: 234, Failures: 0, Skips: 12
    Configuration Failures: 1, Skips: 0
===============================================
[GC (Allocation Failure)  230853K->61627K(737792K), 0.0080534 secs]
Tests run: 235, Failures: 1, Errors: 0, Skipped: 12, Time elapsed: 68.85 sec <<< FAILURE! - in TestSuite
tearDown(org.apache.brooklyn.entity.software.base.SoftwareProcessRebindNotRunningEntityTest)  Time elapsed: 0.245 sec  <<< FAILURE!
java.lang.IllegalStateException: onManagementStopping encountered different management context for Application[h8wlvb47] (no longer deployed): null; expected LocalManagementContext[uORcESLd-mn4B6zyO] (may be a pre-registered entity which was never properly managed)
	at org.apache.brooklyn.entity.software.base.SoftwareProcessRebindNotRunningEntityTest.tearDown(SoftwareProcessRebindNotRunningEntityTest.java:133)


Results :

Failed tests: 
  SoftwareProcessRebindNotRunningEntityTest.tearDown:133->RebindTestFixture.tearDown:230 » IllegalState

Tests run: 229, Failures: 1, Errors: 0, Skipped: 6

[INFO] ------------------------------------------------------------------------
[INFO] Reactor Summary:
[INFO] 
[INFO] Brooklyn Server Root ............................... SUCCESS [  8.890 s]
[INFO] Brooklyn Parent Project ............................ SUCCESS [ 10.392 s]
[INFO] Brooklyn Test Support Utilities .................... SUCCESS [ 10.324 s]
[INFO] Brooklyn Logback Includable Configuration .......... SUCCESS [  0.395 s]
[INFO] Brooklyn Common Utilities .......................... SUCCESS [ 32.233 s]
[INFO] Brooklyn API ....................................... SUCCESS [  4.256 s]
[INFO] CAMP Server Parent Project ......................... SUCCESS [  0.147 s]
[INFO] CAMP Base .......................................... SUCCESS [  4.216 s]
[INFO] Brooklyn Test Support .............................. SUCCESS [  2.198 s]
[INFO] Brooklyn REST Swagger Apidoc Utilities ............. SUCCESS [ 18.192 s]
[INFO] Brooklyn Logback Configuration ..................... SUCCESS [  0.157 s]
[INFO] CAMP Server ........................................ SUCCESS [ 18.138 s]
[INFO] Brooklyn Felix Runtime ............................. SUCCESS [  3.484 s]
[INFO] Brooklyn Groovy Utilities .......................... SUCCESS [  2.025 s]
[INFO] Brooklyn Core ...................................... SUCCESS [03:58 min]
[INFO] Brooklyn Policies .................................. SUCCESS [ 32.453 s]
[INFO] Brooklyn WinRM Software Entities ................... SUCCESS [ 24.216 s]
[INFO] Brooklyn Secure JMXMP Agent ........................ SUCCESS [  8.446 s]
[INFO] Brooklyn JMX RMI Agent ............................. SUCCESS [  0.350 s]
[INFO] Brooklyn Jclouds Location Targets .................. SUCCESS [01:25 min]
[INFO] Brooklyn Software Base ............................. FAILURE [01:19 min]
[INFO] Brooklyn CAMP ...................................... SKIPPED
[INFO] Brooklyn Launcher Common ........................... SKIPPED
[INFO] Brooklyn REST API .................................. SKIPPED
[INFO] Brooklyn REST Resources ............................ SKIPPED
[INFO] Brooklyn REST Server ............................... SKIPPED
[INFO] Brooklyn Launcher .................................. SKIPPED
[INFO] Brooklyn Container Location Targets ................ SKIPPED
[INFO] Brooklyn Command Line Interface .................... SKIPPED
[INFO] Brooklyn Test Framework ............................ SKIPPED
[INFO] Brooklyn OSGi init ................................. SKIPPED
[INFO] Brooklyn OSGi start ................................ SKIPPED
[INFO] Brooklyn Karaf ..................................... SKIPPED
[INFO] Jetty config fragment .............................. SKIPPED
[INFO] Apache Http Component extension .................... SKIPPED
[INFO] Brooklyn Karaf Features ............................ SKIPPED
[INFO] Brooklyn Karaf Shell Commands ...................... SKIPPED
[INFO] Brooklyn UI :: Parent .............................. SKIPPED
[INFO] Brooklyn UI :: Modularity Server (parent) .......... SKIPPED
[INFO] Brooklyn UI :: Modularity Server :: UI Module API .. SKIPPED
[INFO] Brooklyn UI :: Modularity Server :: UI Module Registry SKIPPED
[INFO] Brooklyn UI :: Modularity Server :: UI Proxy ....... SKIPPED
[INFO] Brooklyn UI :: Modularity Server :: UI Metadata Registry SKIPPED
[INFO] Brooklyn UI :: Modularity Server :: External UI Modules Registration Hooks SKIPPED
[INFO] Brooklyn UI :: Modularity Server :: Features ....... SKIPPED
[INFO] Brooklyn UI :: Modules (parent) .................... SKIPPED
[INFO] Brooklyn UI :: Modules - UI Utils .................. SKIPPED
[INFO] Brooklyn UI :: Modules - Home ...................... SKIPPED
[INFO] Brooklyn UI :: Modules - App inspector ............. SKIPPED
[INFO] Brooklyn UI :: Modules - Blueprint composer ........ SKIPPED
[INFO] Brooklyn UI :: Modules - Blueprint importer ........ SKIPPED
[INFO] Brooklyn UI :: Modules - Catalog ................... SKIPPED
[INFO] Brooklyn UI :: Modules - Location manager .......... SKIPPED
[INFO] Brooklyn UI :: Modules - REST API Docs ............. SKIPPED
[INFO] Brooklyn UI :: Modules - Groovy console ............ SKIPPED
[INFO] Brooklyn UI :: Modules - Logout .................... SKIPPED
[INFO] Brooklyn UI :: Modules - Features .................. SKIPPED
[INFO] Brooklyn UI :: Features ............................ SKIPPED
[INFO] Brooklyn Library Root .............................. SKIPPED
[INFO] Brooklyn CM Chef ................................... SKIPPED
[INFO] Brooklyn CM SaltStack .............................. SKIPPED
[INFO] Brooklyn CM Ansible ................................ SKIPPED
[INFO] Brooklyn CM Integration Root ....................... SKIPPED
[INFO] Brooklyn Network Software Entities ................. SKIPPED
[INFO] Brooklyn OSGi Software Entities .................... SKIPPED
[INFO] Brooklyn Database Software Entities ................ SKIPPED
[INFO] Brooklyn Web App Software Entities ................. SKIPPED
[INFO] Brooklyn Messaging Software Entities ............... SKIPPED
[INFO] Brooklyn NoSQL Data Store Software Entities ........ SKIPPED
[INFO] Brooklyn Monitoring Software Entities .............. SKIPPED
[INFO] Brooklyn Web App Software Entities ................. SKIPPED
[INFO] Brooklyn QA ........................................ SKIPPED
[INFO] Brooklyn Examples Aggregator Project ............... SKIPPED
[INFO] Brooklyn Examples Aggregator Project - Webapps ..... SKIPPED
[INFO] hello-world-webapp Maven Webapp .................... SKIPPED
[INFO] hello-world-sql-webapp Maven Webapp ................ SKIPPED
[INFO] Brooklyn Simple Web Cluster Example ................ SKIPPED
[INFO] Brooklyn Library Karaf integration ................. SKIPPED
[INFO] Brooklyn Library Catalog ........................... SKIPPED
[INFO] Brooklyn Library Karaf Features .................... SKIPPED
[INFO] Brooklyn Client .................................... SKIPPED
[INFO] Brooklyn Client Command Line Interface ............. SKIPPED
[INFO] Brooklyn REST java Client .......................... SKIPPED
[INFO] Brooklyn Downstream Project Parent ................. SKIPPED
[INFO] Brooklyn Dist Root ................................. SKIPPED
[INFO] Brooklyn All Things ................................ SKIPPED
[INFO] Brooklyn Distribution .............................. SKIPPED
[INFO] Brooklyn Karaf Distribution Parent ................. SKIPPED
[INFO] Brooklyn Karaf Server Configuration ................ SKIPPED
[INFO] Brooklyn Dist Karaf Features ....................... SKIPPED
[INFO] Brooklyn Karaf Distribution ........................ SKIPPED
[INFO] Brooklyn Karaf pax-exam itest ...................... SKIPPED
[INFO] Brooklyn Vagrant Getting Started Environment ....... SKIPPED
[INFO] Brooklyn Quick-Start Project Archetype ............. SKIPPED
[INFO] Brooklyn Shared Package Files ...................... SKIPPED
[INFO] Brooklyn RPM Package ............................... SKIPPED
[INFO] Brooklyn DEB Package ............................... SKIPPED
[INFO] Brooklyn Root 1.0.0-SNAPSHOT ....................... SKIPPED
[INFO] ------------------------------------------------------------------------
[INFO] BUILD FAILURE
[INFO] ------------------------------------------------------------------------
[INFO] Total time: 10:34 min
[INFO] Finished at: 2018-12-17T23:17:02Z
[INFO] ------------------------------------------------------------------------
[ERROR] Failed to execute goal org.apache.maven.plugins:maven-surefire-plugin:2.19.1:test (default-test) on project brooklyn-software-base: There are test failures.
[ERROR] 
[ERROR] Please refer to /home/jenkins/jenkins-slave/workspace/brooklyn-master-build-docker-pipeline/brooklyn-server/software/base/target/surefire-reports for the individual test results.
[ERROR] -> [Help 1]
[ERROR] 
[ERROR] To see the full stack trace of the errors, re-run Maven with the -e switch.
[ERROR] Re-run Maven using the -X switch to enable full debug logging.
[ERROR] 
[ERROR] For more information about the errors and possible solutions, please read the following articles:
[ERROR] [Help 1] http://cwiki.apache.org/confluence/display/MAVEN/MojoFailureException
[ERROR] 
[ERROR] After correcting the problems, you can resume the build with the command
[ERROR]   mvn <goals> -rf :brooklyn-software-base
[Pipeline] }
$ docker stop --time=1 f3e45b3fc4bc8e6a934e9e36cb51e97578486f3047ee1f2018001515c530b734
$ docker rm -f f3e45b3fc4bc8e6a934e9e36cb51e97578486f3047ee1f2018001515c530b734
[Pipeline] // withDockerContainer
[Pipeline] }
[Pipeline] // stage
[Pipeline] }
[Pipeline] // withEnv
[Pipeline] }
ERROR: script returned exit code 1
[Pipeline] // catchError
[Pipeline] stage
[Pipeline] { (Publish test results)
[Pipeline] junit
Recording test results
[Pipeline] step
TestNG Reports Processing: START
Looking for TestNG results report in workspace using pattern: **/testng-results.xml
Saving reports...
Processing '/x1/jenkins/jenkins-home/jobs/brooklyn-master-build-docker-pipeline/builds/91/testng/testng-results-1.xml'
Processing '/x1/jenkins/jenkins-home/jobs/brooklyn-master-build-docker-pipeline/builds/91/testng/testng-results-10.xml'
Processing '/x1/jenkins/jenkins-home/jobs/brooklyn-master-build-docker-pipeline/builds/91/testng/testng-results-11.xml'
Processing '/x1/jenkins/jenkins-home/jobs/brooklyn-master-build-docker-pipeline/builds/91/testng/testng-results-2.xml'
Processing '/x1/jenkins/jenkins-home/jobs/brooklyn-master-build-docker-pipeline/builds/91/testng/testng-results-3.xml'
Processing '/x1/jenkins/jenkins-home/jobs/brooklyn-master-build-docker-pipeline/builds/91/testng/testng-results-4.xml'
Processing '/x1/jenkins/jenkins-home/jobs/brooklyn-master-build-docker-pipeline/builds/91/testng/testng-results-5.xml'
Processing '/x1/jenkins/jenkins-home/jobs/brooklyn-master-build-docker-pipeline/builds/91/testng/testng-results-6.xml'
Processing '/x1/jenkins/jenkins-home/jobs/brooklyn-master-build-docker-pipeline/builds/91/testng/testng-results-7.xml'
Processing '/x1/jenkins/jenkins-home/jobs/brooklyn-master-build-docker-pipeline/builds/91/testng/testng-results-8.xml'
Processing '/x1/jenkins/jenkins-home/jobs/brooklyn-master-build-docker-pipeline/builds/91/testng/testng-results-9.xml'
Processing '/x1/jenkins/jenkins-home/jobs/brooklyn-master-build-docker-pipeline/builds/91/testng/testng-results.xml'
TestNG Reports Processing: FINISH
[Pipeline] }
[Pipeline] // stage
[Pipeline] stage
[Pipeline] { (Send notifications)
[Pipeline] step