osdir.com

[Date Prev][Date Next][Thread Prev][Thread Next][Date Index][Thread Index]

Build failed in Jenkins: brooklyn-master-build-docker #1133


See <https://builds.apache.org/job/brooklyn-master-build-docker/1133/display/redirect>

------------------------------------------
[...truncated 11.13 MB...]
2018-12-10 19:12:32,851 INFO  - TESTNG INVOKING: "Surefire test" - org.apache.brooklyn.rest.resources.ApplicationResourceTest.testDeploymentUsesAppId()
2018-12-10 19:12:32,877 INFO  - Launched from YAML: { name: simple-app-yaml, services: [ { type: org.apache.brooklyn.entity.stock.BasicApplication } ] } -> BasicApplicationImpl{id=myidtestdeploymentuidisset} (Task[start]@o5SGFZ1B)
2018-12-10 19:12:32,882 INFO  - TESTNG PASSED: "Surefire test" - org.apache.brooklyn.rest.resources.ApplicationResourceTest.testDeploymentUsesAppId() finished in 31 ms
2018-12-10 19:12:32,882 INFO  - TESTNG INVOKING CONFIGURATION: "Surefire test" - @AfterMethod org.apache.brooklyn.rest.testing.BrooklynRestApiTest.tearDownMethod()
2018-12-10 19:12:32,883 INFO  - TESTNG PASSED CONFIGURATION: "Surefire test" - @AfterMethod org.apache.brooklyn.rest.testing.BrooklynRestApiTest.tearDownMethod() finished in 1 ms
2018-12-10 19:12:32,883 INFO  - TESTNG INVOKING CONFIGURATION: "Surefire test" - @BeforeMethod org.apache.brooklyn.rest.testing.BrooklynRestApiTest.setUpMethod()
2018-12-10 19:12:32,883 INFO  - TESTNG PASSED CONFIGURATION: "Surefire test" - @BeforeMethod org.apache.brooklyn.rest.testing.BrooklynRestApiTest.setUpMethod() finished in 0 ms
2018-12-10 19:12:32,883 INFO  - TESTNG INVOKING: "Surefire test" - org.apache.brooklyn.rest.resources.ApplicationResourceTest.testTriggerSampleEffector()
2018-12-10 19:12:32,891 INFO  o5SGFZ1B-[myidtestdeploymentuidisset] Started application BasicApplicationImpl{id=myidtestdeploymentuidisset}
2018-12-10 19:12:32,891 INFO  - REST invocation of RestMockSimpleEntity{id=ibfh2vqhre}.sampleEffector[param1,param2] {param1=foo, param2=4} (no user info available)
2018-12-10 19:12:32,893 INFO  KqrjcmWn-[lewnqws4xi,ibfh2vqhre] Invoked sampleEffector(foo,4)
2018-12-10 19:12:32,895 INFO  - TESTNG PASSED: "Surefire test" - org.apache.brooklyn.rest.resources.ApplicationResourceTest.testTriggerSampleEffector() finished in 12 ms
2018-12-10 19:12:32,895 INFO  - TESTNG INVOKING CONFIGURATION: "Surefire test" - @AfterMethod org.apache.brooklyn.rest.testing.BrooklynRestApiTest.tearDownMethod()
2018-12-10 19:12:32,895 INFO  - TESTNG PASSED CONFIGURATION: "Surefire test" - @AfterMethod org.apache.brooklyn.rest.testing.BrooklynRestApiTest.tearDownMethod() finished in 0 ms
2018-12-10 19:12:32,895 INFO  - TESTNG INVOKING CONFIGURATION: "Surefire test" - @BeforeMethod org.apache.brooklyn.rest.testing.BrooklynRestApiTest.setUpMethod()
2018-12-10 19:12:32,895 INFO  - TESTNG PASSED CONFIGURATION: "Surefire test" - @BeforeMethod org.apache.brooklyn.rest.testing.BrooklynRestApiTest.setUpMethod() finished in 0 ms
2018-12-10 19:12:32,895 INFO  - TESTNG INVOKING: "Surefire test" - org.apache.brooklyn.rest.resources.ApplicationResourceTest.testTriggerSampleEffectorWithFormData()
2018-12-10 19:12:32,899 INFO  - REST invocation of RestMockSimpleEntity{id=ibfh2vqhre}.sampleEffector[param1,param2] {param1=foo, param2=4} (no user info available)
2018-12-10 19:12:32,901 INFO  rl4ejFeA-[lewnqws4xi,ibfh2vqhre] Invoked sampleEffector(foo,4)
2018-12-10 19:12:32,906 INFO  - TESTNG PASSED: "Surefire test" - org.apache.brooklyn.rest.resources.ApplicationResourceTest.testTriggerSampleEffectorWithFormData() finished in 11 ms
2018-12-10 19:12:32,907 INFO  - TESTNG INVOKING CONFIGURATION: "Surefire test" - @AfterMethod org.apache.brooklyn.rest.testing.BrooklynRestApiTest.tearDownMethod()
2018-12-10 19:12:32,907 INFO  - TESTNG PASSED CONFIGURATION: "Surefire test" - @AfterMethod org.apache.brooklyn.rest.testing.BrooklynRestApiTest.tearDownMethod() finished in 0 ms
2018-12-10 19:12:32,907 INFO  - TESTNG INVOKING CONFIGURATION: "Surefire test" - @BeforeMethod org.apache.brooklyn.rest.testing.BrooklynRestApiTest.setUpMethod()
2018-12-10 19:12:32,908 INFO  - TESTNG PASSED CONFIGURATION: "Surefire test" - @BeforeMethod org.apache.brooklyn.rest.testing.BrooklynRestApiTest.setUpMethod() finished in 1 ms
2018-12-10 19:12:32,908 INFO  - TESTNG INVOKING: "Surefire test" - org.apache.brooklyn.rest.resources.ApplicationResourceTest.testBatchSensorValues()
2018-12-10 19:12:32,921 INFO  - TESTNG PASSED: "Surefire test" - org.apache.brooklyn.rest.resources.ApplicationResourceTest.testBatchSensorValues() finished in 13 ms
2018-12-10 19:12:32,923 INFO  - TESTNG INVOKING CONFIGURATION: "Surefire test" - @AfterMethod org.apache.brooklyn.rest.testing.BrooklynRestApiTest.tearDownMethod()
2018-12-10 19:12:32,923 INFO  - TESTNG PASSED CONFIGURATION: "Surefire test" - @AfterMethod org.apache.brooklyn.rest.testing.BrooklynRestApiTest.tearDownMethod() finished in 0 ms
2018-12-10 19:12:32,924 INFO  - TESTNG INVOKING CONFIGURATION: "Surefire test" - @BeforeMethod org.apache.brooklyn.rest.testing.BrooklynRestApiTest.setUpMethod()
2018-12-10 19:12:32,924 INFO  - TESTNG PASSED CONFIGURATION: "Surefire test" - @BeforeMethod org.apache.brooklyn.rest.testing.BrooklynRestApiTest.setUpMethod() finished in 0 ms
2018-12-10 19:12:32,924 INFO  - TESTNG INVOKING: "Surefire test" - org.apache.brooklyn.rest.resources.ApplicationResourceTest.testPolicyWhichCapitalizes()
2018-12-10 19:12:32,947 INFO  - POLICY CREATED: drmcgr85p2
2018-12-10 19:12:32,975 INFO  - POLICY STATUS: running
2018-12-10 19:12:33,073 INFO  - POLICY STATUS RESPONSE AFTER DESTROY: 404
2018-12-10 19:12:33,123 INFO  - TESTNG PASSED: "Surefire test" - org.apache.brooklyn.rest.resources.ApplicationResourceTest.testPolicyWhichCapitalizes() finished in 196 ms
2018-12-10 19:12:33,125 INFO  - TESTNG INVOKING CONFIGURATION: "Surefire test" - @AfterMethod org.apache.brooklyn.rest.testing.BrooklynRestApiTest.tearDownMethod()
2018-12-10 19:12:33,126 INFO  - TESTNG PASSED CONFIGURATION: "Surefire test" - @AfterMethod org.apache.brooklyn.rest.testing.BrooklynRestApiTest.tearDownMethod() finished in 2 ms
2018-12-10 19:12:33,131 INFO  - TESTNG INVOKING CONFIGURATION: "Surefire test" - @BeforeMethod org.apache.brooklyn.rest.testing.BrooklynRestApiTest.setUpMethod()
2018-12-10 19:12:33,132 INFO  - TESTNG PASSED CONFIGURATION: "Surefire test" - @BeforeMethod org.apache.brooklyn.rest.testing.BrooklynRestApiTest.setUpMethod() finished in 2 ms
2018-12-10 19:12:33,133 INFO  - TESTNG INVOKING: "Surefire test" - org.apache.brooklyn.rest.resources.ApplicationResourceTest.testReadEachSensor()
2018-12-10 19:12:33,640 INFO  - TESTNG PASSED: "Surefire test" - org.apache.brooklyn.rest.resources.ApplicationResourceTest.testReadEachSensor() finished in 506 ms
2018-12-10 19:12:33,642 INFO  - TESTNG INVOKING CONFIGURATION: "Surefire test" - @AfterMethod org.apache.brooklyn.rest.testing.BrooklynRestApiTest.tearDownMethod()
2018-12-10 19:12:33,644 INFO  - TESTNG PASSED CONFIGURATION: "Surefire test" - @AfterMethod org.apache.brooklyn.rest.testing.BrooklynRestApiTest.tearDownMethod() finished in 2 ms
2018-12-10 19:12:33,661 INFO  - TESTNG INVOKING CONFIGURATION: "Surefire test" - @BeforeMethod org.apache.brooklyn.rest.testing.BrooklynRestApiTest.setUpMethod()
2018-12-10 19:12:33,663 INFO  - TESTNG PASSED CONFIGURATION: "Surefire test" - @BeforeMethod org.apache.brooklyn.rest.testing.BrooklynRestApiTest.setUpMethod() finished in 4 ms
2018-12-10 19:12:33,669 INFO  - TESTNG INVOKING: "Surefire test" - org.apache.brooklyn.rest.resources.ApplicationResourceTest.testDeleteApplication()
2018-12-10 19:12:33,769 INFO  - Deleting simple-app from [BasicApplicationImpl{id=lewnqws4xi}, BasicApplicationImpl{id=a6oosr7fs5}, BasicApplicationImpl{id=fq8ebyv7tn}, BasicApplicationImpl{id=1234567890}, BasicApplicationImpl{id=myuiddifferent}, BasicApplicationImpl{id=aaaaaaaaaaaaaaaaaaaaaaaaaaaaaaaaaaaaaaaaaaaaaaaaaaaaaaaaaaaaaaa}, BasicApplicationImpl{id=abcdefghijkl}, BasicApplicationImpl{id=myidtestdeploymentuidisset}, BasicApplicationImpl{id=myuidtestdeploymentuidfailsonduplicate}]
2018-12-10 19:12:33,827 INFO  - App appears gone, apps are: [BasicApplicationImpl{id=a6oosr7fs5}, BasicApplicationImpl{id=fq8ebyv7tn}, BasicApplicationImpl{id=1234567890}, BasicApplicationImpl{id=myuiddifferent}, BasicApplicationImpl{id=aaaaaaaaaaaaaaaaaaaaaaaaaaaaaaaaaaaaaaaaaaaaaaaaaaaaaaaaaaaaaaa}, BasicApplicationImpl{id=abcdefghijkl}, BasicApplicationImpl{id=myidtestdeploymentuidisset}, BasicApplicationImpl{id=myuidtestdeploymentuidfailsonduplicate}]
2018-12-10 19:12:33,828 INFO  - TESTNG PASSED: "Surefire test" - org.apache.brooklyn.rest.resources.ApplicationResourceTest.testDeleteApplication() finished in 162 ms
2018-12-10 19:12:33,828 INFO  - TESTNG INVOKING CONFIGURATION: "Surefire test" - @AfterMethod org.apache.brooklyn.rest.testing.BrooklynRestApiTest.tearDownMethod()
2018-12-10 19:12:33,828 INFO  - TESTNG PASSED CONFIGURATION: "Surefire test" - @AfterMethod org.apache.brooklyn.rest.testing.BrooklynRestApiTest.tearDownMethod() finished in 0 ms
2018-12-10 19:12:33,830 INFO  - TESTNG INVOKING CONFIGURATION: "Surefire test" - @BeforeMethod org.apache.brooklyn.rest.testing.BrooklynRestApiTest.setUpMethod()
2018-12-10 19:12:33,831 INFO  - TESTNG PASSED CONFIGURATION: "Surefire test" - @BeforeMethod org.apache.brooklyn.rest.testing.BrooklynRestApiTest.setUpMethod() finished in 1 ms
2018-12-10 19:12:33,831 INFO  - TESTNG INVOKING: "Surefire test" - org.apache.brooklyn.rest.resources.ApplicationResourceTest.testDeployApplicationImpl()
2018-12-10 19:12:33,851 INFO  - Entity type 'org.apache.brooklyn.rest.testing.mocks.RestMockApp' not defined in catalog but is on classpath; continuing
2018-12-10 19:12:33,852 WARN  - Using deprecated functionality (as of 0.9.0), ApplicationSpec style (pre CAMP plans). Transition to actively supported spec plans.
2018-12-10 19:12:33,853 INFO  - Catalog does not contain item for type org.apache.brooklyn.rest.testing.mocks.RestMockApp; loaded class directly instead
2018-12-10 19:12:33,853 INFO  - REST placing 'simple-app-impl' under management
2018-12-10 19:12:33,907 INFO  Fnz4m2tN-[rwrgzgv6fs] Started application RestMockApp{id=rwrgzgv6fs}
2018-12-10 19:12:33,933 INFO  - TESTNG PASSED: "Surefire test" - org.apache.brooklyn.rest.resources.ApplicationResourceTest.testDeployApplicationImpl() finished in 101 ms
2018-12-10 19:12:33,933 INFO  - TESTNG INVOKING CONFIGURATION: "Surefire test" - @AfterMethod org.apache.brooklyn.rest.testing.BrooklynRestApiTest.tearDownMethod()
2018-12-10 19:12:33,933 INFO  - TESTNG PASSED CONFIGURATION: "Surefire test" - @AfterMethod org.apache.brooklyn.rest.testing.BrooklynRestApiTest.tearDownMethod() finished in 0 ms
2018-12-10 19:12:33,933 INFO  - TESTNG INVOKING CONFIGURATION: "Surefire test" - @AfterClass org.apache.brooklyn.rest.testing.BrooklynRestApiTest.tearDownClass()
2018-12-10 19:12:33,934 INFO  BNEcWxTv-[a6oosr7fs5] Stopping application BasicApplicationImpl{id=a6oosr7fs5}
2018-12-10 19:12:33,937 INFO  fXsMqZMb-[1234567890] Stopping application BasicApplicationImpl{id=1234567890}
2018-12-10 19:12:33,937 INFO  ND8Mw5qB-[fq8ebyv7tn] Stopping application BasicApplicationImpl{id=fq8ebyv7tn}
2018-12-10 19:12:33,937 INFO  BNEcWxTv-[a6oosr7fs5] Stopped application BasicApplicationImpl{id=a6oosr7fs5}
2018-12-10 19:12:33,938 INFO  fXsMqZMb-[1234567890] Stopped application BasicApplicationImpl{id=1234567890}
2018-12-10 19:12:33,939 INFO  ND8Mw5qB-[fq8ebyv7tn] Stopped application BasicApplicationImpl{id=fq8ebyv7tn}
2018-12-10 19:12:33,939 INFO  llVjWlXh-[myuiddifferent] Stopping application BasicApplicationImpl{id=myuiddifferent}
2018-12-10 19:12:33,943 INFO  epRzgdlF-[aaaaaaaaaaaaaaaaaaaaaaaaaaaaaaaaaaaaaaaaaaaaaaaaaaaaaaaaaaaaaaa] Stopping application BasicApplicationImpl{id=aaaaaaaaaaaaaaaaaaaaaaaaaaaaaaaaaaaaaaaaaaaaaaaaaaaaaaaaaaaaaaa}
2018-12-10 19:12:33,944 INFO  epRzgdlF-[aaaaaaaaaaaaaaaaaaaaaaaaaaaaaaaaaaaaaaaaaaaaaaaaaaaaaaaaaaaaaaa] Stopped application BasicApplicationImpl{id=aaaaaaaaaaaaaaaaaaaaaaaaaaaaaaaaaaaaaaaaaaaaaaaaaaaaaaaaaaaaaaa}
2018-12-10 19:12:33,944 INFO  Tetmk76W-[abcdefghijkl] Stopping application BasicApplicationImpl{id=abcdefghijkl}
2018-12-10 19:12:33,945 INFO  llVjWlXh-[myuiddifferent] Stopped application BasicApplicationImpl{id=myuiddifferent}
2018-12-10 19:12:33,946 INFO  by9r52Lf-[rwrgzgv6fs] Stopping application RestMockApp{id=rwrgzgv6fs}
2018-12-10 19:12:33,946 INFO  Tetmk76W-[abcdefghijkl] Stopped application BasicApplicationImpl{id=abcdefghijkl}
2018-12-10 19:12:33,948 INFO  by9r52Lf-[rwrgzgv6fs] Stopped application RestMockApp{id=rwrgzgv6fs}
2018-12-10 19:12:33,953 INFO  WyqMs8wx-[myidtestdeploymentuidisset] Stopping application BasicApplicationImpl{id=myidtestdeploymentuidisset}
2018-12-10 19:12:33,954 INFO  WyqMs8wx-[myidtestdeploymentuidisset] Stopped application BasicApplicationImpl{id=myidtestdeploymentuidisset}
2018-12-10 19:12:33,961 INFO  mMJbTedh-[myuidtestdeploymentuidfailsonduplicate] Stopping application BasicApplicationImpl{id=myuidtestdeploymentuidfailsonduplicate}
2018-12-10 19:12:33,962 INFO  mMJbTedh-[myuidtestdeploymentuidfailsonduplicate] Stopped application BasicApplicationImpl{id=myuidtestdeploymentuidfailsonduplicate}
2018-12-10 19:12:33,976 INFO  - TESTNG PASSED CONFIGURATION: "Surefire test" - @AfterClass org.apache.brooklyn.rest.testing.BrooklynRestApiTest.tearDownClass() finished in 43 ms
2018-12-10 19:12:33,983 INFO  - TESTNG 
===============================================
    Surefire test
    Tests run: 247, Failures: 1, Skips: 0
===============================================
2018-12-10 19:12:33,984 INFO  - TESTNG RUNNING: Suite: "Surefire test" containing "0" Tests (config: null)
2018-12-10 19:12:33,985 INFO  - TESTNG 
===============================================
    Surefire test
    Tests run: 247, Failures: 1, Skips: 0
===============================================
Tests run: 247, Failures: 1, Errors: 0, Skipped: 0, Time elapsed: 55.445 sec <<< FAILURE! - in TestSuite
testInvokeEffectorWithTimeoutTimesOut(org.apache.brooklyn.rest.resources.EffectorResourceTest)  Time elapsed: 0.124 sec  <<< FAILURE!
java.lang.AssertionError: responseMap={id=uqIMerMn, displayName=sleepEffector, description=Invoking effector sleepEffector on TestEntity:uh4n with parameters {duration=5m}, entityId=uh4nfr12jv, entityDisplayName=TestEntity:uh4n, tags=[EFFECTOR, {type=org.apache.brooklyn.api.mgmt.ManagementContext}, {entityId=uh4nfr12jv, effectorName=sleepEffector}, {wrappingType=targetEntity, entity={type=org.apache.brooklyn.api.entity.Entity, id=uh4nfr12jv}}, {wrappingType=contextEntity, entity={type=org.apache.brooklyn.api.entity.Entity, id=uh4nfr12jv}}], submitTimeUtc=1.544469110093E12, startTimeUtc=null, endTimeUtc=null, currentStatus=Submitted for execution, result=null, isError=false, isCancelled=false, children=[], submittedByTask=null, detailedStatus=Submitted for execution 17875d 19h ago, streams={}, links={self=/activities/uqIMerMn, children=/activities/uqIMerMn/children, entity=/applications/bqg7roxh8k/entities/uh4nfr12jv}} expected [true] but found [false]
	at org.apache.brooklyn.rest.resources.EffectorResourceTest.testInvokeEffectorWithTimeoutTimesOut(EffectorResourceTest.java:162)


Results :

Failed tests: 
  EffectorResourceTest.testInvokeEffectorWithTimeoutTimesOut:162 responseMap={id=uqIMerMn, displayName=sleepEffector, description=Invoking effector sleepEffector on TestEntity:uh4n with parameters {duration=5m}, entityId=uh4nfr12jv, entityDisplayName=TestEntity:uh4n, tags=[EFFECTOR, {type=org.apache.brooklyn.api.mgmt.ManagementContext}, {entityId=uh4nfr12jv, effectorName=sleepEffector}, {wrappingType=targetEntity, entity={type=org.apache.brooklyn.api.entity.Entity, id=uh4nfr12jv}}, {wrappingType=contextEntity, entity={type=org.apache.brooklyn.api.entity.Entity, id=uh4nfr12jv}}], submitTimeUtc=1.544469110093E12, startTimeUtc=null, endTimeUtc=null, currentStatus=Submitted for execution, result=null, isError=false, isCancelled=false, children=[], submittedByTask=null, detailedStatus=Submitted for execution 17875d 19h ago, streams={}, links={self=/activities/uqIMerMn, children=/activities/uqIMerMn/children, entity=/applications/bqg7roxh8k/entities/uh4nfr12jv}} expected [true] but found [false]

Tests run: 247, Failures: 1, Errors: 0, Skipped: 0

[INFO] ------------------------------------------------------------------------
[INFO] Reactor Summary:
[INFO] 
[INFO] Brooklyn Server Root ............................... SUCCESS [  8.634 s]
[INFO] Brooklyn Parent Project ............................ SUCCESS [  9.135 s]
[INFO] Brooklyn Test Support Utilities .................... SUCCESS [  9.678 s]
[INFO] Brooklyn Logback Includable Configuration .......... SUCCESS [  0.505 s]
[INFO] Brooklyn Common Utilities .......................... SUCCESS [ 33.896 s]
[INFO] Brooklyn API ....................................... SUCCESS [  4.048 s]
[INFO] CAMP Server Parent Project ......................... SUCCESS [  0.257 s]
[INFO] CAMP Base .......................................... SUCCESS [  4.204 s]
[INFO] Brooklyn Test Support .............................. SUCCESS [  2.337 s]
[INFO] Brooklyn REST Swagger Apidoc Utilities ............. SUCCESS [ 17.964 s]
[INFO] Brooklyn Logback Configuration ..................... SUCCESS [  0.173 s]
[INFO] CAMP Server ........................................ SUCCESS [ 16.079 s]
[INFO] Brooklyn Felix Runtime ............................. SUCCESS [  4.041 s]
[INFO] Brooklyn Groovy Utilities .......................... SUCCESS [  1.981 s]
[INFO] Brooklyn Core ...................................... SUCCESS [04:43 min]
[INFO] Brooklyn Policies .................................. SUCCESS [ 36.225 s]
[INFO] Brooklyn WinRM Software Entities ................... SUCCESS [ 26.636 s]
[INFO] Brooklyn Secure JMXMP Agent ........................ SUCCESS [ 10.110 s]
[INFO] Brooklyn JMX RMI Agent ............................. SUCCESS [  0.657 s]
[INFO] Brooklyn Jclouds Location Targets .................. SUCCESS [01:26 min]
[INFO] Brooklyn Software Base ............................. SUCCESS [01:27 min]
[INFO] Brooklyn CAMP ...................................... SUCCESS [02:43 min]
[INFO] Brooklyn Launcher Common ........................... SUCCESS [  4.615 s]
[INFO] Brooklyn REST API .................................. SUCCESS [ 18.225 s]
[INFO] Brooklyn REST Resources ............................ FAILURE [01:08 min]
[INFO] Brooklyn REST Server ............................... SKIPPED
[INFO] Brooklyn Launcher .................................. SKIPPED
[INFO] Brooklyn Container Location Targets ................ SKIPPED
[INFO] Brooklyn Command Line Interface .................... SKIPPED
[INFO] Brooklyn Test Framework ............................ SKIPPED
[INFO] Brooklyn OSGi init ................................. SKIPPED
[INFO] Brooklyn OSGi start ................................ SKIPPED
[INFO] Brooklyn Karaf ..................................... SKIPPED
[INFO] Jetty config fragment .............................. SKIPPED
[INFO] Apache Http Component extension .................... SKIPPED
[INFO] Brooklyn Karaf Features ............................ SKIPPED
[INFO] Brooklyn Karaf Shell Commands ...................... SKIPPED
[INFO] Brooklyn UI :: Parent .............................. SKIPPED
[INFO] Brooklyn UI :: Modularity Server (parent) .......... SKIPPED
[INFO] Brooklyn UI :: Modularity Server :: UI Module API .. SKIPPED
[INFO] Brooklyn UI :: Modularity Server :: UI Module Registry SKIPPED
[INFO] Brooklyn UI :: Modularity Server :: UI Proxy ....... SKIPPED
[INFO] Brooklyn UI :: Modularity Server :: UI Metadata Registry SKIPPED
[INFO] Brooklyn UI :: Modularity Server :: External UI Modules Registration Hooks SKIPPED
[INFO] Brooklyn UI :: Modularity Server :: Features ....... SKIPPED
[INFO] Brooklyn UI :: Modules (parent) .................... SKIPPED
[INFO] Brooklyn UI :: Modules - UI Utils .................. SKIPPED
[INFO] Brooklyn UI :: Modules - Home ...................... SKIPPED
[INFO] Brooklyn UI :: Modules - App inspector ............. SKIPPED
[INFO] Brooklyn UI :: Modules - Blueprint composer ........ SKIPPED
[INFO] Brooklyn UI :: Modules - Blueprint importer ........ SKIPPED
[INFO] Brooklyn UI :: Modules - Catalog ................... SKIPPED
[INFO] Brooklyn UI :: Modules - Location manager .......... SKIPPED
[INFO] Brooklyn UI :: Modules - REST API Docs ............. SKIPPED
[INFO] Brooklyn UI :: Modules - Groovy console ............ SKIPPED
[INFO] Brooklyn UI :: Modules - Logout .................... SKIPPED
[INFO] Brooklyn UI :: Modules - Features .................. SKIPPED
[INFO] Brooklyn UI :: Features ............................ SKIPPED
[INFO] Brooklyn Library Root .............................. SKIPPED
[INFO] Brooklyn CM Chef ................................... SKIPPED
[INFO] Brooklyn CM SaltStack .............................. SKIPPED
[INFO] Brooklyn CM Ansible ................................ SKIPPED
[INFO] Brooklyn CM Integration Root ....................... SKIPPED
[INFO] Brooklyn Network Software Entities ................. SKIPPED
[INFO] Brooklyn OSGi Software Entities .................... SKIPPED
[INFO] Brooklyn Database Software Entities ................ SKIPPED
[INFO] Brooklyn Web App Software Entities ................. SKIPPED
[INFO] Brooklyn Messaging Software Entities ............... SKIPPED
[INFO] Brooklyn NoSQL Data Store Software Entities ........ SKIPPED
[INFO] Brooklyn Monitoring Software Entities .............. SKIPPED
[INFO] Brooklyn Web App Software Entities ................. SKIPPED
[INFO] Brooklyn QA ........................................ SKIPPED
[INFO] Brooklyn Examples Aggregator Project ............... SKIPPED
[INFO] Brooklyn Examples Aggregator Project - Webapps ..... SKIPPED
[INFO] hello-world-webapp Maven Webapp .................... SKIPPED
[INFO] hello-world-sql-webapp Maven Webapp ................ SKIPPED
[INFO] Brooklyn Simple Web Cluster Example ................ SKIPPED
[INFO] Brooklyn Library Karaf integration ................. SKIPPED
[INFO] Brooklyn Library Catalog ........................... SKIPPED
[INFO] Brooklyn Library Karaf Features .................... SKIPPED
[INFO] Brooklyn Client .................................... SKIPPED
[INFO] Brooklyn Client Command Line Interface ............. SKIPPED
[INFO] Brooklyn REST java Client .......................... SKIPPED
[INFO] Brooklyn Downstream Project Parent ................. SKIPPED
[INFO] Brooklyn Dist Root ................................. SKIPPED
[INFO] Brooklyn All Things ................................ SKIPPED
[INFO] Brooklyn Distribution .............................. SKIPPED
[INFO] Brooklyn Karaf Distribution Parent ................. SKIPPED
[INFO] Brooklyn Karaf Server Configuration ................ SKIPPED
[INFO] Brooklyn Dist Karaf Features ....................... SKIPPED
[INFO] Brooklyn Karaf Distribution ........................ SKIPPED
[INFO] Brooklyn Karaf pax-exam itest ...................... SKIPPED
[INFO] Brooklyn Vagrant Getting Started Environment ....... SKIPPED
[INFO] Brooklyn Quick-Start Project Archetype ............. SKIPPED
[INFO] Brooklyn Shared Package Files ...................... SKIPPED
[INFO] Brooklyn RPM Package ............................... SKIPPED
[INFO] Brooklyn DEB Package ............................... SKIPPED
[INFO] Brooklyn Root 1.0.0-SNAPSHOT ....................... SKIPPED
[INFO] ------------------------------------------------------------------------
[INFO] BUILD FAILURE
[INFO] ------------------------------------------------------------------------
[INFO] Total time: 15:43 min
[INFO] Finished at: 2018-12-10T19:12:35Z
[INFO] ------------------------------------------------------------------------
[ERROR] Failed to execute goal org.apache.maven.plugins:maven-surefire-plugin:2.19.1:test (default-test) on project brooklyn-rest-resources: There are test failures.
[ERROR] 
[ERROR] Please refer to /usr/build/brooklyn-server/rest/rest-resources/target/surefire-reports for the individual test results.
[ERROR] -> [Help 1]
[ERROR] 
[ERROR] To see the full stack trace of the errors, re-run Maven with the -e switch.
[ERROR] Re-run Maven using the -X switch to enable full debug logging.
[ERROR] 
[ERROR] For more information about the errors and possible solutions, please read the following articles:
[ERROR] [Help 1] http://cwiki.apache.org/confluence/display/MAVEN/MojoFailureException
[ERROR] 
[ERROR] After correcting the problems, you can resume the build with the command
[ERROR]   mvn <goals> -rf :brooklyn-rest-resources
Build step 'Execute shell' marked build as failure
Recording test results
TestNG Reports Processing: START
Looking for TestNG results report in workspace using pattern: **/testng-results.xml
Saving reports...
Processing '/x1/jenkins/jenkins-home/jobs/brooklyn-master-build-docker/builds/1133/testng/testng-results-1.xml'
Processing '/x1/jenkins/jenkins-home/jobs/brooklyn-master-build-docker/builds/1133/testng/testng-results-10.xml'
Processing '/x1/jenkins/jenkins-home/jobs/brooklyn-master-build-docker/builds/1133/testng/testng-results-11.xml'
Processing '/x1/jenkins/jenkins-home/jobs/brooklyn-master-build-docker/builds/1133/testng/testng-results-12.xml'
Processing '/x1/jenkins/jenkins-home/jobs/brooklyn-master-build-docker/builds/1133/testng/testng-results-13.xml'
Processing '/x1/jenkins/jenkins-home/jobs/brooklyn-master-build-docker/builds/1133/testng/testng-results-14.xml'
Processing '/x1/jenkins/jenkins-home/jobs/brooklyn-master-build-docker/builds/1133/testng/testng-results-15.xml'
Processing '/x1/jenkins/jenkins-home/jobs/brooklyn-master-build-docker/builds/1133/testng/testng-results-2.xml'
Processing '/x1/jenkins/jenkins-home/jobs/brooklyn-master-build-docker/builds/1133/testng/testng-results-3.xml'
Processing '/x1/jenkins/jenkins-home/jobs/brooklyn-master-build-docker/builds/1133/testng/testng-results-4.xml'
Processing '/x1/jenkins/jenkins-home/jobs/brooklyn-master-build-docker/builds/1133/testng/testng-results-5.xml'
Processing '/x1/jenkins/jenkins-home/jobs/brooklyn-master-build-docker/builds/1133/testng/testng-results-6.xml'
Processing '/x1/jenkins/jenkins-home/jobs/brooklyn-master-build-docker/builds/1133/testng/testng-results-7.xml'
Processing '/x1/jenkins/jenkins-home/jobs/brooklyn-master-build-docker/builds/1133/testng/testng-results-8.xml'
Processing '/x1/jenkins/jenkins-home/jobs/brooklyn-master-build-docker/builds/1133/testng/testng-results-9.xml'
Processing '/x1/jenkins/jenkins-home/jobs/brooklyn-master-build-docker/builds/1133/testng/testng-results.xml'
0.021589% of tests failed, which exceeded threshold of 0%. Marking build as UNSTABLE
TestNG Reports Processing: FINISH