osdir.com

[Date Prev][Date Next][Thread Prev][Thread Next][Date Index][Thread Index]

Build failed in Jenkins: brooklyn-master-build-docker #1100


See <https://builds.apache.org/job/brooklyn-master-build-docker/1100/display/redirect>

------------------------------------------
[...truncated 8.19 MB...]
2018-12-04 16:13:17,512 INFO  - TESTNG INVOKING CONFIGURATION: "Surefire test" - @AfterMethod org.apache.brooklyn.entity.java.JavaOptsTest.tearDown()
2018-12-04 16:13:17,514 INFO  pGSfR5HS-[undgf9t144,d4tl8whuzw] Stopping TestingNoSensorsVanillaJavaAppImpl{id=d4tl8whuzw} in [SshMachineLocation[SshMachineLocation:nqg4:root@localhost/127.0.0.1:22(id=nqg4q6ej0v)]]
2018-12-04 16:13:17,528 INFO  - TESTNG PASSED CONFIGURATION: "Surefire test" - @AfterMethod org.apache.brooklyn.entity.java.JavaOptsTest.tearDown() finished in 16 ms
2018-12-04 16:13:17,529 INFO  - TESTNG INVOKING CONFIGURATION: "Surefire test" - @BeforeMethod org.apache.brooklyn.entity.java.JavaOptsTest.setUp()
2018-12-04 16:13:17,529 INFO  - Added external config supplier named 'brooklyn-demo-sample': org.apache.brooklyn.core.config.external.InPlaceExternalConfigSupplier@669b8190
2018-12-04 16:13:17,547 INFO  - TESTNG PASSED CONFIGURATION: "Surefire test" - @BeforeMethod org.apache.brooklyn.entity.java.JavaOptsTest.setUp() finished in 18 ms
2018-12-04 16:13:17,547 INFO  - TESTNG INVOKING: "Surefire test" - org.apache.brooklyn.entity.java.JavaOptsTest.testPassesJavaArgs()
2018-12-04 16:13:17,575 INFO  - Starting VanillaJavaAppImpl{id=xjpuwm10a9} on machine SshMachineLocation[SshMachineLocation:xy49:null@localhost/127.0.0.1:22(id=xy499o2uaz)]
2018-12-04 16:13:17,748 INFO  - TESTNG PASSED: "Surefire test" - org.apache.brooklyn.entity.java.JavaOptsTest.testPassesJavaArgs() finished in 201 ms
2018-12-04 16:13:17,748 INFO  - TESTNG INVOKING CONFIGURATION: "Surefire test" - @AfterMethod org.apache.brooklyn.entity.java.JavaOptsTest.tearDown()
2018-12-04 16:13:17,751 INFO  HscmRfFH-[wcgs9vnbq2,xjpuwm10a9] Stopping VanillaJavaAppImpl{id=xjpuwm10a9} in [SshMachineLocation[SshMachineLocation:xy49:root@localhost/127.0.0.1:22(id=xy499o2uaz)]]
2018-12-04 16:13:17,758 INFO  - TESTNG PASSED CONFIGURATION: "Surefire test" - @AfterMethod org.apache.brooklyn.entity.java.JavaOptsTest.tearDown() finished in 10 ms
2018-12-04 16:13:17,759 INFO  - TESTNG INVOKING CONFIGURATION: "Surefire test" - @BeforeMethod org.apache.brooklyn.entity.java.JavaOptsTest.setUp()
2018-12-04 16:13:17,759 INFO  - Added external config supplier named 'brooklyn-demo-sample': org.apache.brooklyn.core.config.external.InPlaceExternalConfigSupplier@282079b9
2018-12-04 16:13:17,776 INFO  - TESTNG PASSED CONFIGURATION: "Surefire test" - @BeforeMethod org.apache.brooklyn.entity.java.JavaOptsTest.setUp() finished in 17 ms
2018-12-04 16:13:17,776 INFO  - TESTNG INVOKING: "Surefire test" - org.apache.brooklyn.entity.java.JavaOptsTest.testPassesJavaOpts()
2018-12-04 16:13:17,792 INFO  - Starting VanillaJavaAppImpl{id=wesg298sno} on machine SshMachineLocation[SshMachineLocation:mgc9:null@localhost/127.0.0.1:22(id=mgc98xriok)]
2018-12-04 16:13:18,025 INFO  - TESTNG PASSED: "Surefire test" - org.apache.brooklyn.entity.java.JavaOptsTest.testPassesJavaOpts() finished in 249 ms
2018-12-04 16:13:18,026 INFO  - TESTNG INVOKING CONFIGURATION: "Surefire test" - @AfterMethod org.apache.brooklyn.entity.java.JavaOptsTest.tearDown()
2018-12-04 16:13:18,028 INFO  NYL50Ugw-[j4ufmlc1pw,wesg298sno] Stopping VanillaJavaAppImpl{id=wesg298sno} in [SshMachineLocation[SshMachineLocation:mgc9:root@localhost/127.0.0.1:22(id=mgc98xriok)]]
2018-12-04 16:13:18,035 INFO  - TESTNG PASSED CONFIGURATION: "Surefire test" - @AfterMethod org.apache.brooklyn.entity.java.JavaOptsTest.tearDown() finished in 10 ms
2018-12-04 16:13:18,035 INFO  - TESTNG INVOKING CONFIGURATION: "Surefire test" - @BeforeMethod org.apache.brooklyn.entity.java.JavaOptsTest.setUp()
2018-12-04 16:13:18,035 INFO  - Added external config supplier named 'brooklyn-demo-sample': org.apache.brooklyn.core.config.external.InPlaceExternalConfigSupplier@643f8ebe
2018-12-04 16:13:18,047 INFO  - TESTNG PASSED CONFIGURATION: "Surefire test" - @BeforeMethod org.apache.brooklyn.entity.java.JavaOptsTest.setUp() finished in 12 ms
2018-12-04 16:13:18,047 INFO  - TESTNG INVOKING: "Surefire test" - org.apache.brooklyn.entity.java.JavaOptsTest.testPassesJavaOptsObeyingMutualExclusions()
2018-12-04 16:13:18,078 INFO  - Starting TestingJavaOptsVanillaJavaAppImpl{id=pwk5mpgeg2} on machine SshMachineLocation[SshMachineLocation:u9m9:null@localhost/127.0.0.1:22(id=u9m92l7dlg)]
2018-12-04 16:13:18,233 INFO  - TESTNG PASSED: "Surefire test" - org.apache.brooklyn.entity.java.JavaOptsTest.testPassesJavaOptsObeyingMutualExclusions() finished in 186 ms
2018-12-04 16:13:18,233 INFO  - TESTNG INVOKING CONFIGURATION: "Surefire test" - @AfterMethod org.apache.brooklyn.entity.java.JavaOptsTest.tearDown()
2018-12-04 16:13:18,240 INFO  TZCOjJoO-[j2l7wbxcid,pwk5mpgeg2] Stopping TestingJavaOptsVanillaJavaAppImpl{id=pwk5mpgeg2} in [SshMachineLocation[SshMachineLocation:u9m9:root@localhost/127.0.0.1:22(id=u9m92l7dlg)]]
2018-12-04 16:13:18,254 INFO  - TESTNG PASSED CONFIGURATION: "Surefire test" - @AfterMethod org.apache.brooklyn.entity.java.JavaOptsTest.tearDown() finished in 21 ms
2018-12-04 16:13:18,255 INFO  - TESTNG INVOKING CONFIGURATION: "Surefire test" - @BeforeMethod org.apache.brooklyn.entity.java.JavaOptsTest.setUp()
2018-12-04 16:13:18,256 INFO  - Added external config supplier named 'brooklyn-demo-sample': org.apache.brooklyn.core.config.external.InPlaceExternalConfigSupplier@1722ede1
2018-12-04 16:13:18,268 INFO  - TESTNG PASSED CONFIGURATION: "Surefire test" - @BeforeMethod org.apache.brooklyn.entity.java.JavaOptsTest.setUp() finished in 13 ms
2018-12-04 16:13:18,268 INFO  - TESTNG INVOKING: "Surefire test" - org.apache.brooklyn.entity.java.JavaOptsTest.testPassesJavaOptsOverridingDefaults()
2018-12-04 16:13:18,291 INFO  - Starting VanillaJavaAppImpl{id=t8rt27xr25} on machine SshMachineLocation[SshMachineLocation:kx55:null@localhost/127.0.0.1:22(id=kx55r44qjb)]
2018-12-04 16:13:18,455 INFO  - TESTNG PASSED: "Surefire test" - org.apache.brooklyn.entity.java.JavaOptsTest.testPassesJavaOptsOverridingDefaults() finished in 187 ms
2018-12-04 16:13:18,455 INFO  - TESTNG INVOKING CONFIGURATION: "Surefire test" - @AfterMethod org.apache.brooklyn.entity.java.JavaOptsTest.tearDown()
2018-12-04 16:13:18,468 INFO  Dz2tjSjt-[eg0gh70hd9,t8rt27xr25] Stopping VanillaJavaAppImpl{id=t8rt27xr25} in [SshMachineLocation[SshMachineLocation:kx55:root@localhost/127.0.0.1:22(id=kx55r44qjb)]]
2018-12-04 16:13:18,488 INFO  - TESTNG PASSED CONFIGURATION: "Surefire test" - @AfterMethod org.apache.brooklyn.entity.java.JavaOptsTest.tearDown() finished in 33 ms
2018-12-04 16:13:18,489 INFO  - TESTNG INVOKING CONFIGURATION: "Surefire test" - @BeforeMethod org.apache.brooklyn.entity.java.JavaOptsTest.setUp()
2018-12-04 16:13:18,491 INFO  - Added external config supplier named 'brooklyn-demo-sample': org.apache.brooklyn.core.config.external.InPlaceExternalConfigSupplier@4b477121
2018-12-04 16:13:18,503 INFO  - TESTNG PASSED CONFIGURATION: "Surefire test" - @BeforeMethod org.apache.brooklyn.entity.java.JavaOptsTest.setUp() finished in 14 ms
2018-12-04 16:13:18,504 INFO  - TESTNG INVOKING: "Surefire test" - org.apache.brooklyn.entity.java.JavaOptsTest.testPassesJavaSysProps()
2018-12-04 16:13:18,536 INFO  - Starting VanillaJavaAppImpl{id=ey6ye6p9gu} on machine SshMachineLocation[SshMachineLocation:vuq3:null@localhost/127.0.0.1:22(id=vuq3rskxsl)]
2018-12-04 16:13:18,714 INFO  - TESTNG PASSED: "Surefire test" - org.apache.brooklyn.entity.java.JavaOptsTest.testPassesJavaSysProps() finished in 210 ms
2018-12-04 16:13:18,714 INFO  - TESTNG INVOKING CONFIGURATION: "Surefire test" - @AfterMethod org.apache.brooklyn.entity.java.JavaOptsTest.tearDown()
2018-12-04 16:13:18,720 INFO  gBwBhBD1-[msh7i8hvmk,ey6ye6p9gu] Stopping VanillaJavaAppImpl{id=ey6ye6p9gu} in [SshMachineLocation[SshMachineLocation:vuq3:root@localhost/127.0.0.1:22(id=vuq3rskxsl)]]
2018-12-04 16:13:18,732 INFO  - TESTNG PASSED CONFIGURATION: "Surefire test" - @AfterMethod org.apache.brooklyn.entity.java.JavaOptsTest.tearDown() finished in 18 ms
2018-12-04 16:13:18,733 INFO  - TESTNG INVOKING CONFIGURATION: "Surefire test" - @BeforeMethod org.apache.brooklyn.entity.java.JavaOptsTest.setUp()
2018-12-04 16:13:18,734 INFO  - Added external config supplier named 'brooklyn-demo-sample': org.apache.brooklyn.core.config.external.InPlaceExternalConfigSupplier@4f09d998
2018-12-04 16:13:18,751 INFO  - TESTNG PASSED CONFIGURATION: "Surefire test" - @BeforeMethod org.apache.brooklyn.entity.java.JavaOptsTest.setUp() finished in 18 ms
2018-12-04 16:13:18,753 INFO  - TESTNG INVOKING: "Surefire test" - org.apache.brooklyn.entity.java.JavaOptsTest.testSecureJmxConfigFromDefault()
2018-12-04 16:13:18,773 INFO  - Starting TestingNoSensorsVanillaJavaAppImpl{id=b4e8qjto02} on machine SshMachineLocation[SshMachineLocation:d8na:null@localhost/127.0.0.1:22(id=d8natv0pr3)]
2018-12-04 16:13:18,821 INFO  - Creating PortForwardManager(scope=global)
2018-12-04 16:13:19,140 INFO  - TESTNG PASSED: "Surefire test" - org.apache.brooklyn.entity.java.JavaOptsTest.testSecureJmxConfigFromDefault() finished in 388 ms
2018-12-04 16:13:19,140 INFO  - TESTNG INVOKING CONFIGURATION: "Surefire test" - @AfterMethod org.apache.brooklyn.entity.java.JavaOptsTest.tearDown()
2018-12-04 16:13:19,143 INFO  tUJHkOsP-[v8hioq3rcd,b4e8qjto02] Stopping TestingNoSensorsVanillaJavaAppImpl{id=b4e8qjto02} in [SshMachineLocation[SshMachineLocation:d8na:root@localhost/127.0.0.1:22(id=d8natv0pr3)]]
2018-12-04 16:13:19,152 INFO  - TESTNG PASSED CONFIGURATION: "Surefire test" - @AfterMethod org.apache.brooklyn.entity.java.JavaOptsTest.tearDown() finished in 12 ms
2018-12-04 16:13:19,152 INFO  - TESTNG INVOKING CONFIGURATION: "Surefire test" - @BeforeMethod org.apache.brooklyn.entity.java.JavaOptsTest.setUp()
2018-12-04 16:13:19,154 INFO  - Added external config supplier named 'brooklyn-demo-sample': org.apache.brooklyn.core.config.external.InPlaceExternalConfigSupplier@1b641c97
2018-12-04 16:13:19,175 INFO  - TESTNG PASSED CONFIGURATION: "Surefire test" - @BeforeMethod org.apache.brooklyn.entity.java.JavaOptsTest.setUp() finished in 23 ms
2018-12-04 16:13:19,175 INFO  - TESTNG INVOKING: "Surefire test" - org.apache.brooklyn.entity.java.JavaOptsTest.testSimpleLaunchesJavaProcess()
2018-12-04 16:13:19,197 INFO  - Starting VanillaJavaAppImpl{id=jod8yt4wz7} on machine SshMachineLocation[SshMachineLocation:s4nn:null@localhost/127.0.0.1:22(id=s4nndwo2ty)]
2018-12-04 16:13:19,415 INFO  - TESTNG PASSED: "Surefire test" - org.apache.brooklyn.entity.java.JavaOptsTest.testSimpleLaunchesJavaProcess() finished in 240 ms
2018-12-04 16:13:19,415 INFO  - TESTNG INVOKING CONFIGURATION: "Surefire test" - @AfterMethod org.apache.brooklyn.entity.java.JavaOptsTest.tearDown()
2018-12-04 16:13:19,418 INFO  caXUOP6E-[ffnxbuek92,jod8yt4wz7] Stopping VanillaJavaAppImpl{id=jod8yt4wz7} in [SshMachineLocation[SshMachineLocation:s4nn:root@localhost/127.0.0.1:22(id=s4nndwo2ty)]]
2018-12-04 16:13:19,432 INFO  - TESTNG PASSED CONFIGURATION: "Surefire test" - @AfterMethod org.apache.brooklyn.entity.java.JavaOptsTest.tearDown() finished in 17 ms
2018-12-04 16:13:19,432 INFO  - TESTNG INVOKING: "Surefire test" - org.apache.brooklyn.entity.java.JmxSupportTest.testCoerceStringtoJmxAgentModes()
2018-12-04 16:13:19,433 INFO  - TESTNG PASSED: "Surefire test" - org.apache.brooklyn.entity.java.JmxSupportTest.testCoerceStringtoJmxAgentModes() finished in 1 ms
2018-12-04 16:13:19,433 INFO  - TESTNG INVOKING CONFIGURATION: "Surefire test" - @AfterMethod org.apache.brooklyn.entity.java.JmxSupportTest.tearDown()
2018-12-04 16:13:19,433 INFO  - TESTNG PASSED CONFIGURATION: "Surefire test" - @AfterMethod org.apache.brooklyn.entity.java.JmxSupportTest.tearDown() finished in 0 ms
2018-12-04 16:13:19,434 INFO  - TESTNG INVOKING: "Surefire test" - org.apache.brooklyn.entity.java.JmxSupportTest.testJmxAutodetect()
2018-12-04 16:13:19,434 INFO  - Added external config supplier named 'brooklyn-demo-sample': org.apache.brooklyn.core.config.external.InPlaceExternalConfigSupplier@75f9a35a
2018-12-04 16:13:19,455 INFO  - TESTNG PASSED: "Surefire test" - org.apache.brooklyn.entity.java.JmxSupportTest.testJmxAutodetect() finished in 21 ms
2018-12-04 16:13:19,455 INFO  - TESTNG INVOKING CONFIGURATION: "Surefire test" - @AfterMethod org.apache.brooklyn.entity.java.JmxSupportTest.tearDown()
2018-12-04 16:13:19,461 INFO  - TESTNG PASSED CONFIGURATION: "Surefire test" - @AfterMethod org.apache.brooklyn.entity.java.JmxSupportTest.tearDown() finished in 6 ms
2018-12-04 16:13:19,461 INFO  - TESTNG INVOKING: "Surefire test" - org.apache.brooklyn.entity.java.JmxSupportTest.testJmxmpJarExistence()
2018-12-04 16:13:19,461 INFO  - Added external config supplier named 'brooklyn-demo-sample': org.apache.brooklyn.core.config.external.InPlaceExternalConfigSupplier@5257123d
2018-12-04 16:13:19,474 INFO  - TESTNG PASSED: "Surefire test" - org.apache.brooklyn.entity.java.JmxSupportTest.testJmxmpJarExistence() finished in 13 ms
2018-12-04 16:13:19,474 INFO  - TESTNG INVOKING CONFIGURATION: "Surefire test" - @AfterMethod org.apache.brooklyn.entity.java.JmxSupportTest.tearDown()
2018-12-04 16:13:19,480 INFO  - TESTNG PASSED CONFIGURATION: "Surefire test" - @AfterMethod org.apache.brooklyn.entity.java.JmxSupportTest.tearDown() finished in 6 ms
2018-12-04 16:13:19,480 INFO  - TESTNG INVOKING: "Surefire test" - org.apache.brooklyn.entity.java.JmxSupportTest.testJmxrmiJarExistence()
2018-12-04 16:13:19,480 INFO  - Added external config supplier named 'brooklyn-demo-sample': org.apache.brooklyn.core.config.external.InPlaceExternalConfigSupplier@17e725fb
2018-12-04 16:13:19,492 INFO  - TESTNG PASSED: "Surefire test" - org.apache.brooklyn.entity.java.JmxSupportTest.testJmxrmiJarExistence() finished in 11 ms
2018-12-04 16:13:19,493 INFO  - TESTNG INVOKING CONFIGURATION: "Surefire test" - @AfterMethod org.apache.brooklyn.entity.java.JmxSupportTest.tearDown()
2018-12-04 16:13:19,500 INFO  - TESTNG PASSED CONFIGURATION: "Surefire test" - @AfterMethod org.apache.brooklyn.entity.java.JmxSupportTest.tearDown() finished in 8 ms
2018-12-04 16:13:19,610 INFO  - TESTNG 
===============================================
    Surefire test
    Tests run: 234, Failures: 1, Skips: 0
===============================================
[GC (Allocation Failure)  262707K->71446K(752128K), 0.0234772 secs]
Tests run: 234, Failures: 1, Errors: 0, Skipped: 0, Time elapsed: 211.316 sec <<< FAILURE! - in TestSuite
testUseSshMonitoringDisabled(org.apache.brooklyn.entity.software.base.VanillaSoftwareProcessTest)  Time elapsed: 120.641 sec  <<< FAILURE!
org.apache.brooklyn.core.mgmt.internal.EffectorUtils$EffectorCallPropagatedRuntimeException: Error invoking start at VanillaSoftwareProcessImpl{id=rcc2wc4rdd}
	at org.apache.brooklyn.entity.software.base.VanillaSoftwareProcessTest.testUseSshMonitoringDisabled(VanillaSoftwareProcessTest.java:381)
Caused by: org.apache.brooklyn.util.exceptions.PropagatedRuntimeException: 
	at org.apache.brooklyn.entity.software.base.VanillaSoftwareProcessTest.testUseSshMonitoringDisabled(VanillaSoftwareProcessTest.java:381)
Caused by: java.util.concurrent.ExecutionException: java.lang.IllegalStateException: Timeout waiting for SERVICE_UP on VanillaSoftwareProcessImpl{id=rcc2wc4rdd}
	at org.apache.brooklyn.entity.software.base.VanillaSoftwareProcessTest.testUseSshMonitoringDisabled(VanillaSoftwareProcessTest.java:381)
Caused by: java.lang.IllegalStateException: Timeout waiting for SERVICE_UP on VanillaSoftwareProcessImpl{id=rcc2wc4rdd}


Results :

Failed tests: 
  VanillaSoftwareProcessTest.testUseSshMonitoringDisabled:381 » EffectorCallPropagatedRuntime

Tests run: 234, Failures: 1, Errors: 0, Skipped: 0

[INFO] ------------------------------------------------------------------------
[INFO] Reactor Summary:
[INFO] 
[INFO] Brooklyn Server Root ............................... SUCCESS [  6.550 s]
[INFO] Brooklyn Parent Project ............................ SUCCESS [  7.930 s]
[INFO] Brooklyn Test Support Utilities .................... SUCCESS [ 10.861 s]
[INFO] Brooklyn Logback Includable Configuration .......... SUCCESS [  0.742 s]
[INFO] Brooklyn Common Utilities .......................... SUCCESS [ 40.482 s]
[INFO] Brooklyn API ....................................... SUCCESS [  4.456 s]
[INFO] CAMP Server Parent Project ......................... SUCCESS [  0.201 s]
[INFO] CAMP Base .......................................... SUCCESS [  4.783 s]
[INFO] Brooklyn Test Support .............................. SUCCESS [  3.071 s]
[INFO] Brooklyn REST Swagger Apidoc Utilities ............. SUCCESS [ 18.075 s]
[INFO] Brooklyn Logback Configuration ..................... SUCCESS [  0.257 s]
[INFO] CAMP Server ........................................ SUCCESS [ 17.179 s]
[INFO] Brooklyn Felix Runtime ............................. SUCCESS [  4.904 s]
[INFO] Brooklyn Groovy Utilities .......................... SUCCESS [  2.617 s]
[INFO] Brooklyn Core ...................................... SUCCESS [05:13 min]
[INFO] Brooklyn Policies .................................. SUCCESS [ 44.770 s]
[INFO] Brooklyn WinRM Software Entities ................... SUCCESS [ 26.426 s]
[INFO] Brooklyn Secure JMXMP Agent ........................ SUCCESS [  8.756 s]
[INFO] Brooklyn JMX RMI Agent ............................. SUCCESS [  0.356 s]
[INFO] Brooklyn Jclouds Location Targets .................. SUCCESS [01:26 min]
[INFO] Brooklyn Software Base ............................. FAILURE [03:47 min]
[INFO] Brooklyn CAMP ...................................... SKIPPED
[INFO] Brooklyn Launcher Common ........................... SKIPPED
[INFO] Brooklyn REST API .................................. SKIPPED
[INFO] Brooklyn REST Resources ............................ SKIPPED
[INFO] Brooklyn REST Server ............................... SKIPPED
[INFO] Brooklyn Launcher .................................. SKIPPED
[INFO] Brooklyn Container Location Targets ................ SKIPPED
[INFO] Brooklyn Command Line Interface .................... SKIPPED
[INFO] Brooklyn Test Framework ............................ SKIPPED
[INFO] Brooklyn OSGi init ................................. SKIPPED
[INFO] Brooklyn OSGi start ................................ SKIPPED
[INFO] Brooklyn Karaf ..................................... SKIPPED
[INFO] Jetty config fragment .............................. SKIPPED
[INFO] Apache Http Component extension .................... SKIPPED
[INFO] Brooklyn Karaf Features ............................ SKIPPED
[INFO] Brooklyn Karaf Shell Commands ...................... SKIPPED
[INFO] Brooklyn UI :: Parent .............................. SKIPPED
[INFO] Brooklyn UI :: Modularity Server (parent) .......... SKIPPED
[INFO] Brooklyn UI :: Modularity Server :: UI Module API .. SKIPPED
[INFO] Brooklyn UI :: Modularity Server :: UI Module Registry SKIPPED
[INFO] Brooklyn UI :: Modularity Server :: UI Proxy ....... SKIPPED
[INFO] Brooklyn UI :: Modularity Server :: UI Metadata Registry SKIPPED
[INFO] Brooklyn UI :: Modularity Server :: External UI Modules Registration Hooks SKIPPED
[INFO] Brooklyn UI :: Modularity Server :: Features ....... SKIPPED
[INFO] Brooklyn UI :: Modules (parent) .................... SKIPPED
[INFO] Brooklyn UI :: Modules - UI Utils .................. SKIPPED
[INFO] Brooklyn UI :: Modules - Home ...................... SKIPPED
[INFO] Brooklyn UI :: Modules - App inspector ............. SKIPPED
[INFO] Brooklyn UI :: Modules - Blueprint composer ........ SKIPPED
[INFO] Brooklyn UI :: Modules - Blueprint importer ........ SKIPPED
[INFO] Brooklyn UI :: Modules - Catalog ................... SKIPPED
[INFO] Brooklyn UI :: Modules - Location manager .......... SKIPPED
[INFO] Brooklyn UI :: Modules - REST API Docs ............. SKIPPED
[INFO] Brooklyn UI :: Modules - Groovy console ............ SKIPPED
[INFO] Brooklyn UI :: Modules - Logout .................... SKIPPED
[INFO] Brooklyn UI :: Modules - Features .................. SKIPPED
[INFO] Brooklyn UI :: Features ............................ SKIPPED
[INFO] Brooklyn Library Root .............................. SKIPPED
[INFO] Brooklyn CM Chef ................................... SKIPPED
[INFO] Brooklyn CM SaltStack .............................. SKIPPED
[INFO] Brooklyn CM Ansible ................................ SKIPPED
[INFO] Brooklyn CM Integration Root ....................... SKIPPED
[INFO] Brooklyn Network Software Entities ................. SKIPPED
[INFO] Brooklyn OSGi Software Entities .................... SKIPPED
[INFO] Brooklyn Database Software Entities ................ SKIPPED
[INFO] Brooklyn Web App Software Entities ................. SKIPPED
[INFO] Brooklyn Messaging Software Entities ............... SKIPPED
[INFO] Brooklyn NoSQL Data Store Software Entities ........ SKIPPED
[INFO] Brooklyn Monitoring Software Entities .............. SKIPPED
[INFO] Brooklyn Web App Software Entities ................. SKIPPED
[INFO] Brooklyn QA ........................................ SKIPPED
[INFO] Brooklyn Examples Aggregator Project ............... SKIPPED
[INFO] Brooklyn Examples Aggregator Project - Webapps ..... SKIPPED
[INFO] hello-world-webapp Maven Webapp .................... SKIPPED
[INFO] hello-world-sql-webapp Maven Webapp ................ SKIPPED
[INFO] Brooklyn Simple Web Cluster Example ................ SKIPPED
[INFO] Brooklyn Library Karaf integration ................. SKIPPED
[INFO] Brooklyn Library Catalog ........................... SKIPPED
[INFO] Brooklyn Library Karaf Features .................... SKIPPED
[INFO] Brooklyn Client .................................... SKIPPED
[INFO] Brooklyn Client Command Line Interface ............. SKIPPED
[INFO] Brooklyn REST java Client .......................... SKIPPED
[INFO] Brooklyn Downstream Project Parent ................. SKIPPED
[INFO] Brooklyn Dist Root ................................. SKIPPED
[INFO] Brooklyn All Things ................................ SKIPPED
[INFO] Brooklyn Distribution .............................. SKIPPED
[INFO] Brooklyn Karaf Distribution Parent ................. SKIPPED
[INFO] Brooklyn Karaf Server Configuration ................ SKIPPED
[INFO] Brooklyn Dist Karaf Features ....................... SKIPPED
[INFO] Brooklyn Karaf Distribution ........................ SKIPPED
[INFO] Brooklyn Karaf pax-exam itest ...................... SKIPPED
[INFO] Brooklyn Vagrant Getting Started Environment ....... SKIPPED
[INFO] Brooklyn Quick-Start Project Archetype ............. SKIPPED
[INFO] Brooklyn Shared Package Files ...................... SKIPPED
[INFO] Brooklyn RPM Package ............................... SKIPPED
[INFO] Brooklyn DEB Package ............................... SKIPPED
[INFO] Brooklyn Root 1.0.0-SNAPSHOT ....................... SKIPPED
[INFO] ------------------------------------------------------------------------
[INFO] BUILD FAILURE
[INFO] ------------------------------------------------------------------------
[INFO] Total time: 14:25 min
[INFO] Finished at: 2018-12-04T16:13:20Z
[INFO] ------------------------------------------------------------------------
[ERROR] Failed to execute goal org.apache.maven.plugins:maven-surefire-plugin:2.19.1:test (default-test) on project brooklyn-software-base: There are test failures.
[ERROR] 
[ERROR] Please refer to /usr/build/brooklyn-server/software/base/target/surefire-reports for the individual test results.
[ERROR] -> [Help 1]
[ERROR] 
[ERROR] To see the full stack trace of the errors, re-run Maven with the -e switch.
[ERROR] Re-run Maven using the -X switch to enable full debug logging.
[ERROR] 
[ERROR] For more information about the errors and possible solutions, please read the following articles:
[ERROR] [Help 1] http://cwiki.apache.org/confluence/display/MAVEN/MojoFailureException
[ERROR] 
[ERROR] After correcting the problems, you can resume the build with the command
[ERROR]   mvn <goals> -rf :brooklyn-software-base
Build step 'Execute shell' marked build as failure
Recording test results
TestNG Reports Processing: START
Looking for TestNG results report in workspace using pattern: **/testng-results.xml
Saving reports...
Processing '/x1/jenkins/jenkins-home/jobs/brooklyn-master-build-docker/builds/1100/testng/testng-results-1.xml'
Processing '/x1/jenkins/jenkins-home/jobs/brooklyn-master-build-docker/builds/1100/testng/testng-results-10.xml'
Processing '/x1/jenkins/jenkins-home/jobs/brooklyn-master-build-docker/builds/1100/testng/testng-results-11.xml'
Processing '/x1/jenkins/jenkins-home/jobs/brooklyn-master-build-docker/builds/1100/testng/testng-results-2.xml'
Processing '/x1/jenkins/jenkins-home/jobs/brooklyn-master-build-docker/builds/1100/testng/testng-results-3.xml'
Processing '/x1/jenkins/jenkins-home/jobs/brooklyn-master-build-docker/builds/1100/testng/testng-results-4.xml'
Processing '/x1/jenkins/jenkins-home/jobs/brooklyn-master-build-docker/builds/1100/testng/testng-results-5.xml'
Processing '/x1/jenkins/jenkins-home/jobs/brooklyn-master-build-docker/builds/1100/testng/testng-results-6.xml'
Processing '/x1/jenkins/jenkins-home/jobs/brooklyn-master-build-docker/builds/1100/testng/testng-results-7.xml'
Processing '/x1/jenkins/jenkins-home/jobs/brooklyn-master-build-docker/builds/1100/testng/testng-results-8.xml'
Processing '/x1/jenkins/jenkins-home/jobs/brooklyn-master-build-docker/builds/1100/testng/testng-results-9.xml'
Processing '/x1/jenkins/jenkins-home/jobs/brooklyn-master-build-docker/builds/1100/testng/testng-results.xml'
0.028185% of tests failed, which exceeded threshold of 0%. Marking build as UNSTABLE
TestNG Reports Processing: FINISH