osdir.com

[Date Prev][Date Next][Thread Prev][Thread Next][Date Index][Thread Index]

Build failed in Jenkins: brooklyn-server-master-docker #211


See <https://builds.apache.org/job/brooklyn-server-master-docker/211/display/redirect>

------------------------------------------
[...truncated 7.42 MB...]
2018-11-26 06:23:59,888 INFO  - TESTNG INVOKING CONFIGURATION: "Surefire test" - @AfterMethod org.apache.brooklyn.feed.jmx.JmxHelperTest.tearDown()
2018-11-26 06:23:59,890 INFO  - JMX tester service stopped (127.0.0.1:11479)
2018-11-26 06:23:59,891 INFO  - TESTNG PASSED CONFIGURATION: "Surefire test" - @AfterMethod org.apache.brooklyn.feed.jmx.JmxHelperTest.tearDown() finished in 2 ms
2018-11-26 06:23:59,891 INFO  - TESTNG INVOKING CONFIGURATION: "Surefire test" - @BeforeMethod org.apache.brooklyn.feed.jmx.JmxHelperTest.setUp()
2018-11-26 06:23:59,897 INFO  - JMX tester service started at URL service:jmx:rmi:///jndi/rmi://127.0.0.1:11403/jmxrmi
2018-11-26 06:23:59,903 INFO  - TESTNG PASSED CONFIGURATION: "Surefire test" - @BeforeMethod org.apache.brooklyn.feed.jmx.JmxHelperTest.setUp() finished in 11 ms
2018-11-26 06:23:59,903 INFO  - TESTNG INVOKING: "Surefire test" - org.apache.brooklyn.feed.jmx.JmxHelperTest.testGetAttributeUsingObjectNameWildcard()
2018-11-26 06:23:59,908 INFO  - TESTNG PASSED: "Surefire test" - org.apache.brooklyn.feed.jmx.JmxHelperTest.testGetAttributeUsingObjectNameWildcard() finished in 5 ms
2018-11-26 06:23:59,908 INFO  - TESTNG INVOKING CONFIGURATION: "Surefire test" - @AfterMethod org.apache.brooklyn.feed.jmx.JmxHelperTest.tearDown()
2018-11-26 06:23:59,910 INFO  - JMX tester service stopped (127.0.0.1:11403)
2018-11-26 06:23:59,910 INFO  - TESTNG PASSED CONFIGURATION: "Surefire test" - @AfterMethod org.apache.brooklyn.feed.jmx.JmxHelperTest.tearDown() finished in 2 ms
2018-11-26 06:23:59,911 INFO  - TESTNG INVOKING CONFIGURATION: "Surefire test" - @BeforeMethod org.apache.brooklyn.feed.jmx.JmxHelperTest.setUp()
2018-11-26 06:23:59,918 INFO  - JMX tester service started at URL service:jmx:rmi:///jndi/rmi://127.0.0.1:11050/jmxrmi
2018-11-26 06:23:59,924 INFO  - TESTNG PASSED CONFIGURATION: "Surefire test" - @BeforeMethod org.apache.brooklyn.feed.jmx.JmxHelperTest.setUp() finished in 13 ms
2018-11-26 06:23:59,924 INFO  - TESTNG INVOKING: "Surefire test" - org.apache.brooklyn.feed.jmx.JmxHelperTest.testInvokeOperationUsingObjectNameWildcard()
2018-11-26 06:23:59,928 INFO  - TESTNG PASSED: "Surefire test" - org.apache.brooklyn.feed.jmx.JmxHelperTest.testInvokeOperationUsingObjectNameWildcard() finished in 4 ms
2018-11-26 06:23:59,928 INFO  - TESTNG INVOKING CONFIGURATION: "Surefire test" - @AfterMethod org.apache.brooklyn.feed.jmx.JmxHelperTest.tearDown()
2018-11-26 06:23:59,930 INFO  - JMX tester service stopped (127.0.0.1:11050)
2018-11-26 06:23:59,931 INFO  - TESTNG PASSED CONFIGURATION: "Surefire test" - @AfterMethod org.apache.brooklyn.feed.jmx.JmxHelperTest.tearDown() finished in 2 ms
2018-11-26 06:23:59,931 INFO  - TESTNG INVOKING CONFIGURATION: "Surefire test" - @BeforeMethod org.apache.brooklyn.feed.jmx.JmxHelperTest.setUp()
2018-11-26 06:23:59,936 INFO  - JMX tester service started at URL service:jmx:rmi:///jndi/rmi://127.0.0.1:11065/jmxrmi
2018-11-26 06:23:59,941 INFO  - TESTNG PASSED CONFIGURATION: "Surefire test" - @BeforeMethod org.apache.brooklyn.feed.jmx.JmxHelperTest.setUp() finished in 10 ms
2018-11-26 06:23:59,941 INFO  - TESTNG INVOKING: "Surefire test" - org.apache.brooklyn.feed.jmx.JmxHelperTest.testInvokeOperationWithArgs()
2018-11-26 06:23:59,943 INFO  - TESTNG PASSED: "Surefire test" - org.apache.brooklyn.feed.jmx.JmxHelperTest.testInvokeOperationWithArgs() finished in 2 ms
2018-11-26 06:23:59,943 INFO  - TESTNG INVOKING CONFIGURATION: "Surefire test" - @AfterMethod org.apache.brooklyn.feed.jmx.JmxHelperTest.tearDown()
2018-11-26 06:23:59,945 INFO  - JMX tester service stopped (127.0.0.1:11065)
2018-11-26 06:23:59,945 INFO  - TESTNG PASSED CONFIGURATION: "Surefire test" - @AfterMethod org.apache.brooklyn.feed.jmx.JmxHelperTest.tearDown() finished in 2 ms
2018-11-26 06:23:59,945 INFO  - TESTNG INVOKING CONFIGURATION: "Surefire test" - @BeforeMethod org.apache.brooklyn.feed.jmx.JmxHelperTest.setUp()
2018-11-26 06:23:59,950 INFO  - JMX tester service started at URL service:jmx:rmi:///jndi/rmi://127.0.0.1:11003/jmxrmi
2018-11-26 06:23:59,955 INFO  - TESTNG PASSED CONFIGURATION: "Surefire test" - @BeforeMethod org.apache.brooklyn.feed.jmx.JmxHelperTest.setUp() finished in 10 ms
2018-11-26 06:23:59,955 INFO  - TESTNG INVOKING: "Surefire test" - org.apache.brooklyn.feed.jmx.JmxHelperTest.testInvokeOperationWithNoArgs()
2018-11-26 06:23:59,957 INFO  - TESTNG PASSED: "Surefire test" - org.apache.brooklyn.feed.jmx.JmxHelperTest.testInvokeOperationWithNoArgs() finished in 2 ms
2018-11-26 06:23:59,957 INFO  - TESTNG INVOKING CONFIGURATION: "Surefire test" - @AfterMethod org.apache.brooklyn.feed.jmx.JmxHelperTest.tearDown()
2018-11-26 06:23:59,959 INFO  - JMX tester service stopped (127.0.0.1:11003)
2018-11-26 06:23:59,959 INFO  - TESTNG PASSED CONFIGURATION: "Surefire test" - @AfterMethod org.apache.brooklyn.feed.jmx.JmxHelperTest.tearDown() finished in 2 ms
2018-11-26 06:23:59,960 INFO  - TESTNG INVOKING CONFIGURATION: "Surefire test" - @BeforeMethod org.apache.brooklyn.feed.jmx.JmxHelperTest.setUp()
2018-11-26 06:23:59,967 INFO  - JMX tester service started at URL service:jmx:rmi:///jndi/rmi://127.0.0.1:11389/jmxrmi
2018-11-26 06:23:59,973 INFO  - TESTNG PASSED CONFIGURATION: "Surefire test" - @BeforeMethod org.apache.brooklyn.feed.jmx.JmxHelperTest.setUp() finished in 13 ms
2018-11-26 06:23:59,973 INFO  - TESTNG INVOKING: "Surefire test" - org.apache.brooklyn.feed.jmx.JmxHelperTest.testJmxCheckInstanceExistsEventuallyThrowsIfNotFound()
2018-11-26 06:23:59,977 INFO  - TESTNG PASSED: "Surefire test" - org.apache.brooklyn.feed.jmx.JmxHelperTest.testJmxCheckInstanceExistsEventuallyThrowsIfNotFound() finished in 4 ms
2018-11-26 06:23:59,977 INFO  - TESTNG INVOKING CONFIGURATION: "Surefire test" - @AfterMethod org.apache.brooklyn.feed.jmx.JmxHelperTest.tearDown()
2018-11-26 06:23:59,979 INFO  - JMX tester service stopped (127.0.0.1:11389)
2018-11-26 06:23:59,979 INFO  - TESTNG PASSED CONFIGURATION: "Surefire test" - @AfterMethod org.apache.brooklyn.feed.jmx.JmxHelperTest.tearDown() finished in 2 ms
2018-11-26 06:23:59,979 INFO  - TESTNG INVOKING CONFIGURATION: "Surefire test" - @BeforeMethod org.apache.brooklyn.feed.jmx.JmxHelperTest.setUp()
2018-11-26 06:23:59,985 INFO  - JMX tester service started at URL service:jmx:rmi:///jndi/rmi://127.0.0.1:11124/jmxrmi
2018-11-26 06:23:59,990 INFO  - TESTNG PASSED CONFIGURATION: "Surefire test" - @BeforeMethod org.apache.brooklyn.feed.jmx.JmxHelperTest.setUp() finished in 11 ms
2018-11-26 06:23:59,990 INFO  - TESTNG INVOKING: "Surefire test" - org.apache.brooklyn.feed.jmx.JmxHelperTest.testJmxObjectCheckExistsEventuallyReturnsIfCreatedDuringPolling()
2018-11-26 06:24:00,495 INFO  - TESTNG PASSED: "Surefire test" - org.apache.brooklyn.feed.jmx.JmxHelperTest.testJmxObjectCheckExistsEventuallyReturnsIfCreatedDuringPolling() finished in 504 ms
2018-11-26 06:24:00,495 INFO  - TESTNG INVOKING CONFIGURATION: "Surefire test" - @AfterMethod org.apache.brooklyn.feed.jmx.JmxHelperTest.tearDown()
2018-11-26 06:24:00,499 INFO  - JMX tester service stopped (127.0.0.1:11124)
2018-11-26 06:24:00,499 INFO  - TESTNG PASSED CONFIGURATION: "Surefire test" - @AfterMethod org.apache.brooklyn.feed.jmx.JmxHelperTest.tearDown() finished in 4 ms
2018-11-26 06:24:00,499 INFO  - TESTNG INVOKING CONFIGURATION: "Surefire test" - @BeforeMethod org.apache.brooklyn.feed.jmx.JmxHelperTest.setUp()
2018-11-26 06:24:00,506 INFO  - JMX tester service started at URL service:jmx:rmi:///jndi/rmi://127.0.0.1:11291/jmxrmi
2018-11-26 06:24:00,512 INFO  - TESTNG PASSED CONFIGURATION: "Surefire test" - @BeforeMethod org.apache.brooklyn.feed.jmx.JmxHelperTest.setUp() finished in 13 ms
2018-11-26 06:24:00,512 INFO  - TESTNG INVOKING: "Surefire test" - org.apache.brooklyn.feed.jmx.JmxHelperTest.testJmxObjectCheckExistsEventuallyReturnsIfFoundImmediately()
2018-11-26 06:24:00,514 INFO  - TESTNG PASSED: "Surefire test" - org.apache.brooklyn.feed.jmx.JmxHelperTest.testJmxObjectCheckExistsEventuallyReturnsIfFoundImmediately() finished in 2 ms
2018-11-26 06:24:00,514 INFO  - TESTNG INVOKING CONFIGURATION: "Surefire test" - @AfterMethod org.apache.brooklyn.feed.jmx.JmxHelperTest.tearDown()
2018-11-26 06:24:00,517 INFO  - JMX tester service stopped (127.0.0.1:11291)
2018-11-26 06:24:00,517 INFO  - TESTNG PASSED CONFIGURATION: "Surefire test" - @AfterMethod org.apache.brooklyn.feed.jmx.JmxHelperTest.tearDown() finished in 3 ms
2018-11-26 06:24:00,517 INFO  - TESTNG INVOKING CONFIGURATION: "Surefire test" - @BeforeMethod org.apache.brooklyn.feed.jmx.JmxHelperTest.setUp()
2018-11-26 06:24:00,522 INFO  - JMX tester service started at URL service:jmx:rmi:///jndi/rmi://127.0.0.1:11448/jmxrmi
2018-11-26 06:24:00,527 INFO  - TESTNG PASSED CONFIGURATION: "Surefire test" - @BeforeMethod org.apache.brooklyn.feed.jmx.JmxHelperTest.setUp() finished in 10 ms
2018-11-26 06:24:00,527 INFO  - TESTNG INVOKING: "Surefire test" - org.apache.brooklyn.feed.jmx.JmxHelperTest.testJmxObjectCheckExistsEventuallyTakingLongReturnsIfFoundImmediately()
2018-11-26 06:24:00,529 INFO  - TESTNG PASSED: "Surefire test" - org.apache.brooklyn.feed.jmx.JmxHelperTest.testJmxObjectCheckExistsEventuallyTakingLongReturnsIfFoundImmediately() finished in 2 ms
2018-11-26 06:24:00,529 INFO  - TESTNG INVOKING CONFIGURATION: "Surefire test" - @AfterMethod org.apache.brooklyn.feed.jmx.JmxHelperTest.tearDown()
2018-11-26 06:24:00,532 INFO  - JMX tester service stopped (127.0.0.1:11448)
2018-11-26 06:24:00,532 INFO  - TESTNG PASSED CONFIGURATION: "Surefire test" - @AfterMethod org.apache.brooklyn.feed.jmx.JmxHelperTest.tearDown() finished in 3 ms
2018-11-26 06:24:00,532 INFO  - TESTNG INVOKING CONFIGURATION: "Surefire test" - @BeforeMethod org.apache.brooklyn.feed.jmx.JmxHelperTest.setUp()
2018-11-26 06:24:00,539 INFO  - JMX tester service started at URL service:jmx:rmi:///jndi/rmi://127.0.0.1:11493/jmxrmi
2018-11-26 06:24:00,544 INFO  - TESTNG PASSED CONFIGURATION: "Surefire test" - @BeforeMethod org.apache.brooklyn.feed.jmx.JmxHelperTest.setUp() finished in 12 ms
2018-11-26 06:24:00,544 INFO  - TESTNG INVOKING: "Surefire test" - org.apache.brooklyn.feed.jmx.JmxHelperTest.testMBeanNotFoundLoggedOnlyOncePerUrl()
2018-11-26 06:24:00,545 WARN  - JMX object DoesNotExist:type=DoesNotExist not found at service:jmx:rmi:///jndi/rmi://127.0.0.1:11493/jmxrmi
2018-11-26 06:24:00,553 INFO  - JMX tester service stopped (127.0.0.1:11493)
2018-11-26 06:24:00,559 INFO  - JMX tester service started at URL service:jmx:rmi:///jndi/rmi://127.0.0.1:11488/jmxrmi
2018-11-26 06:24:00,565 WARN  - JMX object DoesNotExist:type=DoesNotExist not found at service:jmx:rmi:///jndi/rmi://127.0.0.1:11488/jmxrmi
2018-11-26 06:24:00,570 INFO  - TESTNG PASSED: "Surefire test" - org.apache.brooklyn.feed.jmx.JmxHelperTest.testMBeanNotFoundLoggedOnlyOncePerUrl() finished in 26 ms
2018-11-26 06:24:00,571 INFO  - TESTNG INVOKING CONFIGURATION: "Surefire test" - @AfterMethod org.apache.brooklyn.feed.jmx.JmxHelperTest.tearDown()
2018-11-26 06:24:00,572 INFO  - JMX tester service stopped (127.0.0.1:11488)
2018-11-26 06:24:00,572 INFO  - TESTNG PASSED CONFIGURATION: "Surefire test" - @AfterMethod org.apache.brooklyn.feed.jmx.JmxHelperTest.tearDown() finished in 2 ms
2018-11-26 06:24:00,573 INFO  - TESTNG INVOKING CONFIGURATION: "Surefire test" - @BeforeMethod org.apache.brooklyn.feed.jmx.JmxHelperTest.setUp()
2018-11-26 06:24:00,577 INFO  - JMX tester service started at URL service:jmx:rmi:///jndi/rmi://127.0.0.1:11426/jmxrmi
2018-11-26 06:24:00,580 INFO  - TESTNG PASSED CONFIGURATION: "Surefire test" - @BeforeMethod org.apache.brooklyn.feed.jmx.JmxHelperTest.setUp() finished in 7 ms
2018-11-26 06:24:00,581 INFO  - TESTNG INVOKING: "Surefire test" - org.apache.brooklyn.feed.jmx.JmxHelperTest.testReconnectsOnJmxServerTemporaryFailure()
2018-11-26 06:24:00,584 INFO  - JMX tester service stopped (127.0.0.1:11426)
2018-11-26 06:24:00,598 INFO  - JMX tester service started at URL service:jmx:rmi:///jndi/rmi://127.0.0.1:11426/jmxrmi
2018-11-26 06:24:00,603 INFO  - TESTNG PASSED: "Surefire test" - org.apache.brooklyn.feed.jmx.JmxHelperTest.testReconnectsOnJmxServerTemporaryFailure() finished in 22 ms
2018-11-26 06:24:00,603 INFO  - TESTNG INVOKING CONFIGURATION: "Surefire test" - @AfterMethod org.apache.brooklyn.feed.jmx.JmxHelperTest.tearDown()
2018-11-26 06:24:00,604 INFO  - JMX tester service stopped (127.0.0.1:11426)
2018-11-26 06:24:00,605 INFO  - TESTNG PASSED CONFIGURATION: "Surefire test" - @AfterMethod org.apache.brooklyn.feed.jmx.JmxHelperTest.tearDown() finished in 2 ms
2018-11-26 06:24:00,605 INFO  - TESTNG INVOKING CONFIGURATION: "Surefire test" - @BeforeMethod org.apache.brooklyn.feed.jmx.JmxHelperTest.setUp()
2018-11-26 06:24:00,609 INFO  - JMX tester service started at URL service:jmx:rmi:///jndi/rmi://127.0.0.1:11302/jmxrmi
2018-11-26 06:24:00,614 INFO  - TESTNG PASSED CONFIGURATION: "Surefire test" - @BeforeMethod org.apache.brooklyn.feed.jmx.JmxHelperTest.setUp() finished in 9 ms
2018-11-26 06:24:00,614 INFO  - TESTNG INVOKING: "Surefire test" - org.apache.brooklyn.feed.jmx.JmxHelperTest.testSetAttribute()
2018-11-26 06:24:00,617 INFO  - TESTNG PASSED: "Surefire test" - org.apache.brooklyn.feed.jmx.JmxHelperTest.testSetAttribute() finished in 3 ms
2018-11-26 06:24:00,617 INFO  - TESTNG INVOKING CONFIGURATION: "Surefire test" - @AfterMethod org.apache.brooklyn.feed.jmx.JmxHelperTest.tearDown()
2018-11-26 06:24:00,619 INFO  - JMX tester service stopped (127.0.0.1:11302)
2018-11-26 06:24:00,619 INFO  - TESTNG PASSED CONFIGURATION: "Surefire test" - @AfterMethod org.apache.brooklyn.feed.jmx.JmxHelperTest.tearDown() finished in 2 ms
2018-11-26 06:24:00,619 INFO  - TESTNG INVOKING CONFIGURATION: "Surefire test" - @BeforeMethod org.apache.brooklyn.feed.jmx.JmxHelperTest.setUp()
2018-11-26 06:24:00,623 INFO  - JMX tester service started at URL service:jmx:rmi:///jndi/rmi://127.0.0.1:11205/jmxrmi
2018-11-26 06:24:00,627 INFO  - TESTNG PASSED CONFIGURATION: "Surefire test" - @BeforeMethod org.apache.brooklyn.feed.jmx.JmxHelperTest.setUp() finished in 8 ms
2018-11-26 06:24:00,628 INFO  - TESTNG INVOKING: "Surefire test" - org.apache.brooklyn.feed.jmx.JmxHelperTest.testSetAttributeUsingObjectNameWildcard()
2018-11-26 06:24:00,630 INFO  - TESTNG PASSED: "Surefire test" - org.apache.brooklyn.feed.jmx.JmxHelperTest.testSetAttributeUsingObjectNameWildcard() finished in 2 ms
2018-11-26 06:24:00,630 INFO  - TESTNG INVOKING CONFIGURATION: "Surefire test" - @AfterMethod org.apache.brooklyn.feed.jmx.JmxHelperTest.tearDown()
2018-11-26 06:24:00,632 INFO  - JMX tester service stopped (127.0.0.1:11205)
2018-11-26 06:24:00,632 INFO  - TESTNG PASSED CONFIGURATION: "Surefire test" - @AfterMethod org.apache.brooklyn.feed.jmx.JmxHelperTest.tearDown() finished in 2 ms
2018-11-26 06:24:00,632 INFO  - TESTNG INVOKING CONFIGURATION: "Surefire test" - @BeforeMethod org.apache.brooklyn.feed.jmx.JmxHelperTest.setUp()
2018-11-26 06:24:00,637 INFO  - JMX tester service started at URL service:jmx:rmi:///jndi/rmi://127.0.0.1:11359/jmxrmi
2018-11-26 06:24:00,641 INFO  - TESTNG PASSED CONFIGURATION: "Surefire test" - @BeforeMethod org.apache.brooklyn.feed.jmx.JmxHelperTest.setUp() finished in 9 ms
2018-11-26 06:24:00,641 INFO  - TESTNG INVOKING: "Surefire test" - org.apache.brooklyn.feed.jmx.JmxHelperTest.testSubscribeToJmxNotificationsDirectlyWithJmxHelper()
2018-11-26 06:24:00,648 INFO  - TESTNG PASSED: "Surefire test" - org.apache.brooklyn.feed.jmx.JmxHelperTest.testSubscribeToJmxNotificationsDirectlyWithJmxHelper() finished in 7 ms
2018-11-26 06:24:00,648 INFO  - TESTNG INVOKING CONFIGURATION: "Surefire test" - @AfterMethod org.apache.brooklyn.feed.jmx.JmxHelperTest.tearDown()
2018-11-26 06:24:00,651 INFO  - JMX tester service stopped (127.0.0.1:11359)
2018-11-26 06:24:00,651 INFO  - TESTNG PASSED CONFIGURATION: "Surefire test" - @AfterMethod org.apache.brooklyn.feed.jmx.JmxHelperTest.tearDown() finished in 3 ms
2018-11-26 06:24:00,651 INFO  - TESTNG INVOKING CONFIGURATION: "Surefire test" - @BeforeMethod org.apache.brooklyn.feed.jmx.RebindJmxFeedTest.setUp()
2018-11-26 06:24:00,653 INFO  - Added external config supplier named 'brooklyn-demo-sample': org.apache.brooklyn.core.config.external.InPlaceExternalConfigSupplier@73eaae1e
2018-11-26 06:24:00,659 INFO  - Rebind check: no existing state; will persist new items to /tmp/RebindJmxFeedTest-mURg
2018-11-26 06:24:00,661 INFO  - No Camp-YAML parser registered for parsing catalog item DSL; skipping DSL-parsing
2018-11-26 06:24:00,677 INFO  - Test class org.apache.brooklyn.feed.jmx.RebindJmxFeedTest persisting to /tmp/RebindJmxFeedTest-mURg
2018-11-26 06:24:00,677 INFO  - TESTNG PASSED CONFIGURATION: "Surefire test" - @BeforeMethod org.apache.brooklyn.feed.jmx.RebindJmxFeedTest.setUp() finished in 26 ms
2018-11-26 06:24:00,677 INFO  - TESTNG INVOKING: "Surefire test" - org.apache.brooklyn.feed.jmx.RebindJmxFeedTest.testJmxFeedIsPersisted()
2018-11-26 06:24:00,696 INFO  vhKo3enL-[j2qybw4hh2,rvv85yjxza] Creating PortForwardManager(scope=global)
2018-11-26 06:24:00,708 INFO  - JMX tester service started at URL service:jmx:rmi:///jndi/rmi://localhost:40123/jmxrmi
2018-11-26 06:24:00,839 INFO  - Added external config supplier named 'brooklyn-demo-sample': org.apache.brooklyn.core.config.external.InPlaceExternalConfigSupplier@7842260f
2018-11-26 06:24:00,851 INFO  - Rebinding app, using mementoDir /tmp/RebindJmxFeedTest-mURg; object store null
2018-11-26 06:24:00,867 INFO  - Rebinding from /tmp/RebindJmxFeedTest-mURg for master wNKaOZyP...
2018-11-26 06:24:00,869 INFO  - No Camp-YAML parser registered for parsing catalog item DSL; skipping DSL-parsing
2018-11-26 06:24:00,909 INFO  - Rebind complete (MASTER) in 57ms: 1 app, 2 entities, 1 location, 0 policies, 2 enrichers, 1 feed, 0 catalog items, 0 catalog bundles
2018-11-26 06:24:01,060 INFO  - Back-up of persisted state created on promotion, in /root/.brooklyn/brooklyn-persisted-state/backups/2018-11-26-0624-wNKaOZyP-promotion-MgPS
2018-11-26 06:24:01,067 INFO  - TESTNG PASSED: "Surefire test" - org.apache.brooklyn.feed.jmx.RebindJmxFeedTest.testJmxFeedIsPersisted() finished in 390 ms
2018-11-26 06:24:01,067 INFO  - TESTNG INVOKING CONFIGURATION: "Surefire test" - @AfterMethod org.apache.brooklyn.feed.jmx.RebindJmxFeedTest.tearDown()
2018-11-26 06:24:01,069 INFO  - JMX tester service stopped (localhost:40123)
2018-11-26 06:24:01,092 INFO  - TESTNG PASSED CONFIGURATION: "Surefire test" - @AfterMethod org.apache.brooklyn.feed.jmx.RebindJmxFeedTest.tearDown() finished in 25 ms
2018-11-26 06:24:01,093 INFO  - TESTNG INVOKING CONFIGURATION: "Surefire test" - @BeforeMethod org.apache.brooklyn.feed.jmx.RebindJmxFeedTest.setUp()
2018-11-26 06:24:01,093 INFO  - Added external config supplier named 'brooklyn-demo-sample': org.apache.brooklyn.core.config.external.InPlaceExternalConfigSupplier@74120029
2018-11-26 06:24:01,100 INFO  - Rebind check: no existing state; will persist new items to /tmp/RebindJmxFeedTest-B5r6
2018-11-26 06:24:01,103 INFO  - No Camp-YAML parser registered for parsing catalog item DSL; skipping DSL-parsing
2018-11-26 06:24:01,123 INFO  - Test class org.apache.brooklyn.feed.jmx.RebindJmxFeedTest persisting to /tmp/RebindJmxFeedTest-B5r6
2018-11-26 06:24:01,123 INFO  - TESTNG PASSED CONFIGURATION: "Surefire test" - @BeforeMethod org.apache.brooklyn.feed.jmx.RebindJmxFeedTest.setUp() finished in 31 ms
2018-11-26 06:24:01,123 INFO  - TESTNG INVOKING: "Surefire test" - org.apache.brooklyn.feed.jmx.RebindJmxFeedTest.testJmxFeedIsPersistedWithPreCreatedJmxHelper()
2018-11-26 06:24:01,144 INFO  ymqL1gNI-[zzql6lnau5,a1onco40lq] Creating PortForwardManager(scope=global)
2018-11-26 06:24:01,157 INFO  - JMX tester service started at URL service:jmx:rmi:///jndi/rmi://localhost:40124/jmxrmi
2018-11-26 06:24:01,287 INFO  - Added external config supplier named 'brooklyn-demo-sample': org.apache.brooklyn.core.config.external.InPlaceExternalConfigSupplier@3b9c386d
2018-11-26 06:24:01,305 INFO  - Rebinding app, using mementoDir /tmp/RebindJmxFeedTest-B5r6; object store null
[GC (Allocation Failure)  252915K->72829K(751104K), 0.0383921 secs]
2018-11-26 06:24:01,365 INFO  - Rebinding from /tmp/RebindJmxFeedTest-B5r6 for master atiocwAg...
2018-11-26 06:24:01,368 INFO  - No Camp-YAML parser registered for parsing catalog item DSL; skipping DSL-parsing
2018-11-26 06:24:01,415 INFO  - Rebind complete (MASTER) in 109ms: 1 app, 2 entities, 1 location, 0 policies, 2 enrichers, 1 feed, 0 catalog items, 0 catalog bundles
2018-11-26 06:24:01,555 INFO  - Back-up of persisted state created on promotion, in /root/.brooklyn/brooklyn-persisted-state/backups/2018-11-26-0624-atiocwAg-promotion-jdjM
2018-11-26 06:24:01,573 INFO  - TESTNG PASSED: "Surefire test" - org.apache.brooklyn.feed.jmx.RebindJmxFeedTest.testJmxFeedIsPersistedWithPreCreatedJmxHelper() finished in 450 ms
2018-11-26 06:24:01,574 INFO  - TESTNG INVOKING CONFIGURATION: "Surefire test" - @AfterMethod org.apache.brooklyn.feed.jmx.RebindJmxFeedTest.tearDown()
2018-11-26 06:24:01,575 INFO  - JMX tester service stopped (localhost:40124)
2018-11-26 06:24:01,599 INFO  - TESTNG PASSED CONFIGURATION: "Surefire test" - @AfterMethod org.apache.brooklyn.feed.jmx.RebindJmxFeedTest.tearDown() finished in 25 ms
2018-11-26 06:24:01,679 INFO  - TESTNG 
===============================================
    Surefire test
    Tests run: 234, Failures: 1, Skips: 0
===============================================
Tests run: 234, Failures: 1, Errors: 0, Skipped: 0, Time elapsed: 81.401 sec <<< FAILURE! - in TestSuite
testDoubleStopEntity(org.apache.brooklyn.entity.software.base.SoftwareProcessEntityTest)  Time elapsed: 0.178 sec  <<< FAILURE!
java.lang.AssertionError: entity=EmptySoftwareProcessImpl{id=a6q4bf7xjm}; attribute=Sensor: service.state (org.apache.brooklyn.core.entity.lifecycle.Lifecycle) expected [stopped] but found [stopping]
	at org.apache.brooklyn.entity.software.base.SoftwareProcessEntityTest.testDoubleStopEntity(SoftwareProcessEntityTest.java:493)


Results :

Failed tests: 
  SoftwareProcessEntityTest.testDoubleStopEntity:493 entity=EmptySoftwareProcessImpl{id=a6q4bf7xjm}; attribute=Sensor: service.state (org.apache.brooklyn.core.entity.lifecycle.Lifecycle) expected [stopped] but found [stopping]

Tests run: 234, Failures: 1, Errors: 0, Skipped: 0

[INFO] ------------------------------------------------------------------------
[INFO] Reactor Summary:
[INFO] 
[INFO] Brooklyn Server Root ............................... SUCCESS [  3.970 s]
[INFO] Brooklyn Parent Project ............................ SUCCESS [  5.340 s]
[INFO] Brooklyn Test Support Utilities .................... SUCCESS [  7.721 s]
[INFO] Brooklyn Logback Includable Configuration .......... SUCCESS [  0.440 s]
[INFO] Brooklyn Common Utilities .......................... SUCCESS [ 27.282 s]
[INFO] Brooklyn API ....................................... SUCCESS [  3.111 s]
[INFO] CAMP Server Parent Project ......................... SUCCESS [  0.129 s]
[INFO] CAMP Base .......................................... SUCCESS [  3.334 s]
[INFO] Brooklyn Test Support .............................. SUCCESS [  2.266 s]
[INFO] Brooklyn REST Swagger Apidoc Utilities ............. SUCCESS [ 10.606 s]
[INFO] Brooklyn Logback Configuration ..................... SUCCESS [  0.206 s]
[INFO] CAMP Server ........................................ SUCCESS [ 12.181 s]
[INFO] Brooklyn Felix Runtime ............................. SUCCESS [  3.287 s]
[INFO] Brooklyn Groovy Utilities .......................... SUCCESS [  2.437 s]
[INFO] Brooklyn Core ...................................... SUCCESS [04:39 min]
[INFO] Brooklyn Policies .................................. SUCCESS [ 35.725 s]
[INFO] Brooklyn WinRM Software Entities ................... SUCCESS [ 19.209 s]
[INFO] Brooklyn Secure JMXMP Agent ........................ SUCCESS [  9.791 s]
[INFO] Brooklyn JMX RMI Agent ............................. SUCCESS [  0.399 s]
[INFO] Brooklyn Jclouds Location Targets .................. SUCCESS [01:00 min]
[INFO] Brooklyn Software Base ............................. FAILURE [01:30 min]
[INFO] Brooklyn CAMP ...................................... SKIPPED
[INFO] Brooklyn Launcher Common ........................... SKIPPED
[INFO] Brooklyn REST API .................................. SKIPPED
[INFO] Brooklyn REST Resources ............................ SKIPPED
[INFO] Brooklyn REST Server ............................... SKIPPED
[INFO] Brooklyn Launcher .................................. SKIPPED
[INFO] Brooklyn Container Location Targets ................ SKIPPED
[INFO] Brooklyn Command Line Interface .................... SKIPPED
[INFO] Brooklyn Test Framework ............................ SKIPPED
[INFO] Brooklyn OSGi init ................................. SKIPPED
[INFO] Brooklyn OSGi start ................................ SKIPPED
[INFO] Brooklyn Karaf ..................................... SKIPPED
[INFO] Jetty config fragment .............................. SKIPPED
[INFO] Apache Http Component extension .................... SKIPPED
[INFO] Brooklyn Karaf Features ............................ SKIPPED
[INFO] Brooklyn Karaf Shell Commands ...................... SKIPPED
[INFO] ------------------------------------------------------------------------
[INFO] BUILD FAILURE
[INFO] ------------------------------------------------------------------------
[INFO] Total time: 09:49 min
[INFO] Finished at: 2018-11-26T06:24:02Z
[INFO] Final Memory: 103M/797M
[INFO] ------------------------------------------------------------------------
[ERROR] Failed to execute goal org.apache.maven.plugins:maven-surefire-plugin:2.19.1:test (default-test) on project brooklyn-software-base: There are test failures.
[ERROR] 
[ERROR] Please refer to /usr/build/software/base/target/surefire-reports for the individual test results.
[ERROR] -> [Help 1]
[ERROR] 
[ERROR] To see the full stack trace of the errors, re-run Maven with the -e switch.
[ERROR] Re-run Maven using the -X switch to enable full debug logging.
[ERROR] 
[ERROR] For more information about the errors and possible solutions, please read the following articles:
[ERROR] [Help 1] http://cwiki.apache.org/confluence/display/MAVEN/MojoFailureException
[ERROR] 
[ERROR] After correcting the problems, you can resume the build with the command
[ERROR]   mvn <goals> -rf :brooklyn-software-base
Build step 'Execute shell' marked build as failure
Recording test results
TestNG Reports Processing: START
Looking for TestNG results report in workspace using pattern: **/testng-results.xml
Saving reports...
Processing '/x1/jenkins/jenkins-home/jobs/brooklyn-server-master-docker/builds/211/testng/testng-results-1.xml'
Processing '/x1/jenkins/jenkins-home/jobs/brooklyn-server-master-docker/builds/211/testng/testng-results-10.xml'
Processing '/x1/jenkins/jenkins-home/jobs/brooklyn-server-master-docker/builds/211/testng/testng-results-11.xml'
Processing '/x1/jenkins/jenkins-home/jobs/brooklyn-server-master-docker/builds/211/testng/testng-results-2.xml'
Processing '/x1/jenkins/jenkins-home/jobs/brooklyn-server-master-docker/builds/211/testng/testng-results-3.xml'
Processing '/x1/jenkins/jenkins-home/jobs/brooklyn-server-master-docker/builds/211/testng/testng-results-4.xml'
Processing '/x1/jenkins/jenkins-home/jobs/brooklyn-server-master-docker/builds/211/testng/testng-results-5.xml'
Processing '/x1/jenkins/jenkins-home/jobs/brooklyn-server-master-docker/builds/211/testng/testng-results-6.xml'
Processing '/x1/jenkins/jenkins-home/jobs/brooklyn-server-master-docker/builds/211/testng/testng-results-7.xml'
Processing '/x1/jenkins/jenkins-home/jobs/brooklyn-server-master-docker/builds/211/testng/testng-results-8.xml'
Processing '/x1/jenkins/jenkins-home/jobs/brooklyn-server-master-docker/builds/211/testng/testng-results-9.xml'
Processing '/x1/jenkins/jenkins-home/jobs/brooklyn-server-master-docker/builds/211/testng/testng-results.xml'
0.028185% of tests failed, which exceeded threshold of 0%. Marking build as UNSTABLE
TestNG Reports Processing: FINISH