osdir.com

[Date Prev][Date Next][Thread Prev][Thread Next][Date Index][Thread Index]

Build failed in Jenkins: brooklyn-master-build-docker #998


See <https://builds.apache.org/job/brooklyn-master-build-docker/998/display/redirect>

------------------------------------------
[...truncated 6.17 MB...]
2018-11-16 18:58:31,398 INFO  - in-mem-test-mMKA requesting list enrichers -->10; totals: out=15.4 kB in=115 B
2018-11-16 18:58:31,398 INFO  - in-mem-test-mMKA receiving list enrichers <--132; totals: out=15.4 kB in=247 B
2018-11-16 18:58:31,399 INFO  - in-mem-test-mMKA requesting list feeds -->6; totals: out=15.5 kB in=247 B
2018-11-16 18:58:31,399 INFO  - in-mem-test-mMKA receiving list feeds <--2; totals: out=15.5 kB in=249 B
2018-11-16 18:58:31,399 INFO  - in-mem-test-mMKA requesting list catalog -->8; totals: out=15.5 kB in=249 B
2018-11-16 18:58:31,399 INFO  - in-mem-test-mMKA receiving list catalog <--2; totals: out=15.5 kB in=251 B
2018-11-16 18:58:31,399 INFO  - in-mem-test-mMKA requesting list bundles -->8; totals: out=15.5 kB in=251 B
2018-11-16 18:58:31,399 INFO  - in-mem-test-mMKA receiving list bundles <--2; totals: out=15.5 kB in=253 B
2018-11-16 18:58:31,399 INFO  - in-mem-test-mMKA requesting planeId -->7; totals: out=15.5 kB in=253 B
2018-11-16 18:58:31,399 INFO  - in-mem-test-mMKA reading planeId <--8; totals: out=15.5 kB in=261 B
2018-11-16 18:58:31,399 INFO  - in-mem-test-mMKA requesting entities/nci9gl2pxn -->19; totals: out=15.5 kB in=261 B
2018-11-16 18:58:31,399 INFO  - in-mem-test-mMKA requesting locations/pss1i16isi -->20; totals: out=15.5 kB in=261 B
2018-11-16 18:58:31,399 INFO  - in-mem-test-mMKA requesting entities/pvqcljppv9 -->19; totals: out=15.5 kB in=261 B
2018-11-16 18:58:31,399 INFO  - in-mem-test-mMKA requesting policies/hwrgcp5q6y -->19; totals: out=15.6 kB in=261 B
2018-11-16 18:58:31,399 INFO  - in-mem-test-mMKA requesting enrichers/h0kkk3ojpw -->20; totals: out=15.6 kB in=1249 B
2018-11-16 18:58:31,399 INFO  - in-mem-test-mMKA requesting enrichers/f7pxfpwj6z -->20; totals: out=15.6 kB in=261 B
2018-11-16 18:58:31,400 INFO  - in-mem-test-mMKA reading locations/pss1i16isi <--988; totals: out=15.7 kB in=4.86 kB
2018-11-16 18:58:31,400 INFO  - in-mem-test-mMKA reading entities/nci9gl2pxn <--3075; totals: out=15.7 kB in=4.86 kB
2018-11-16 18:58:31,400 INFO  - in-mem-test-mMKA requesting enrichers/ra79f60l1j -->20; totals: out=15.7 kB in=8.54 kB
2018-11-16 18:58:31,400 INFO  - in-mem-test-mMKA reading entities/pvqcljppv9 <--532; totals: out=15.7 kB in=9.09 kB
2018-11-16 18:58:31,399 INFO  - in-mem-test-mMKA requesting enrichers/z3nkyx2prl -->20; totals: out=15.6 kB in=261 B
2018-11-16 18:58:31,400 INFO  - in-mem-test-mMKA reading enrichers/f7pxfpwj6z <--553; totals: out=15.7 kB in=9.09 kB
2018-11-16 18:58:31,400 INFO  - in-mem-test-mMKA reading enrichers/ra79f60l1j <--553; totals: out=15.7 kB in=9.64 kB
2018-11-16 18:58:31,400 INFO  - in-mem-test-mMKA reading enrichers/h0kkk3ojpw <--3303; totals: out=15.7 kB in=9.09 kB
2018-11-16 18:58:31,400 INFO  - in-mem-test-mMKA reading policies/hwrgcp5q6y <--377; totals: out=15.7 kB in=9.09 kB
2018-11-16 18:58:31,399 INFO  - in-mem-test-mMKA requesting enrichers/y2d68n2pj6 -->20; totals: out=15.7 kB in=261 B
2018-11-16 18:58:31,400 INFO  - in-mem-test-mMKA reading enrichers/z3nkyx2prl <--698; totals: out=15.7 kB in=10.3 kB
2018-11-16 18:58:31,400 INFO  - in-mem-test-mMKA reading enrichers/y2d68n2pj6 <--3303; totals: out=15.7 kB in=13.6 kB
2018-11-16 18:58:31,399 INFO  - in-mem-test-mMKA requesting enrichers/uf0zo9helr -->20; totals: out=15.6 kB in=261 B
2018-11-16 18:58:31,400 INFO  - in-mem-test-mMKA reading enrichers/uf0zo9helr <--1787; totals: out=15.7 kB in=15.4 kB
2018-11-16 18:58:31,413 INFO  - in-mem-test-mMKA requesting planeId -->7; totals: out=15.7 kB in=15.4 kB
2018-11-16 18:58:31,413 INFO  - in-mem-test-mMKA writing entities/nci9gl2pxn -->3075; totals: out=19.3 kB in=15.4 kB
2018-11-16 18:58:31,413 INFO  - in-mem-test-mMKA writing entities/pvqcljppv9 -->532; totals: out=19.3 kB in=15.4 kB
2018-11-16 18:58:31,414 INFO  - in-mem-test-mMKA writing policies/hwrgcp5q6y -->377; totals: out=19.7 kB in=15.4 kB
2018-11-16 18:58:31,414 INFO  - in-mem-test-mMKA reading planeId <--8; totals: out=27.5 kB in=15.4 kB
2018-11-16 18:58:31,414 INFO  - in-mem-test-mMKA writing enrichers/f7pxfpwj6z -->553; totals: out=23.7 kB in=15.4 kB
2018-11-16 18:58:31,414 INFO  - in-mem-test-mMKA writing enrichers/h0kkk3ojpw -->3303; totals: out=27.0 kB in=15.4 kB
2018-11-16 18:58:31,414 INFO  - in-mem-test-mMKA writing enrichers/z3nkyx2prl -->698; totals: out=21.3 kB in=15.4 kB
2018-11-16 18:58:31,414 INFO  - in-mem-test-mMKA writing enrichers/y2d68n2pj6 -->3303; totals: out=30.8 kB in=15.4 kB
2018-11-16 18:58:31,414 INFO  - in-mem-test-mMKA writing locations/pss1i16isi -->988; totals: out=21.3 kB in=15.4 kB
2018-11-16 18:58:31,414 INFO  - in-mem-test-mMKA writing enrichers/ra79f60l1j -->553; totals: out=27.5 kB in=15.4 kB
2018-11-16 18:58:31,415 INFO  - in-mem-test-mMKA writing enrichers/uf0zo9helr -->1787; totals: out=23.7 kB in=15.4 kB
2018-11-16 18:58:31,415 INFO  - TESTNG PASSED: "Surefire test" - org.apache.brooklyn.core.mgmt.persist.BrooklynMementoPersisterTestFixture.testLoadAndCheckpointRawMemento() finished in 24 ms
2018-11-16 18:58:31,415 INFO  - TESTNG INVOKING CONFIGURATION: "Surefire test" - @AfterMethod org.apache.brooklyn.core.mgmt.persist.BrooklynMementoPersisterTestFixture.tearDown()
2018-11-16 18:58:31,421 INFO  - in-mem-test-mMKA deleting locations/pss1i16isi -->20; totals: out=30.9 kB in=15.4 kB
2018-11-16 18:58:31,421 INFO  - in-mem-test-mMKA deleting enrichers/f7pxfpwj6z -->20; totals: out=31.0 kB in=15.4 kB
2018-11-16 18:58:31,421 INFO  - in-mem-test-mMKA deleting entities/pvqcljppv9 -->19; totals: out=30.9 kB in=15.4 kB
2018-11-16 18:58:31,421 INFO  - in-mem-test-mMKA deleting enrichers/z3nkyx2prl -->20; totals: out=31.0 kB in=15.4 kB
2018-11-16 18:58:31,421 INFO  - in-mem-test-mMKA deleting enrichers/ra79f60l1j -->20; totals: out=31.0 kB in=15.4 kB
2018-11-16 18:58:31,421 INFO  - in-mem-test-mMKA deleting policies/hwrgcp5q6y -->19; totals: out=30.9 kB in=15.4 kB
2018-11-16 18:58:31,421 INFO  - in-mem-test-mMKA deleting enrichers/h0kkk3ojpw -->20; totals: out=31.0 kB in=15.4 kB
2018-11-16 18:58:31,421 INFO  - in-mem-test-mMKA deleting enrichers/uf0zo9helr -->20; totals: out=31.0 kB in=15.4 kB
2018-11-16 18:58:31,421 INFO  - in-mem-test-mMKA deleting entities/nci9gl2pxn -->19; totals: out=30.9 kB in=15.4 kB
2018-11-16 18:58:31,421 INFO  - in-mem-test-mMKA deleting enrichers/y2d68n2pj6 -->20; totals: out=30.9 kB in=15.4 kB
2018-11-16 18:58:31,423 WARN  - Entities.destroyAll invoked on non-deployment NonDeploymentManagementContext{entity=nci9gl2pxn, mode=MANAGEMENT_STOPPED} - not likely to have much effect! (This usually means the mgmt context has been taken from an entity that has been destroyed. To destroy other things on the management context ensure you keep a handle to the context before the entity is destroyed, such as by creating the management context first.)
2018-11-16 18:58:31,423 INFO  - in-mem-test-zLy3 deleting completely -->1; totals: out=23.0 kB in=30 B
2018-11-16 18:58:31,423 INFO  - TESTNG PASSED CONFIGURATION: "Surefire test" - @AfterMethod org.apache.brooklyn.core.mgmt.persist.BrooklynMementoPersisterTestFixture.tearDown() finished in 8 ms
2018-11-16 18:58:31,424 INFO  - TESTNG INVOKING CONFIGURATION: "Surefire test" - @BeforeMethod org.apache.brooklyn.core.mgmt.persist.BrooklynMementoPersisterTestFixture.setUp()
2018-11-16 18:58:31,427 INFO  - Added external config supplier named 'brooklyn-demo-sample': org.apache.brooklyn.core.config.external.InPlaceExternalConfigSupplier@5231a78b
2018-11-16 18:58:31,435 INFO  - Rebind check: no existing state; will persist new items to in-memory (test) persistence store
2018-11-16 18:58:31,437 INFO  - No Camp-YAML parser registered for parsing catalog item DSL; skipping DSL-parsing
2018-11-16 18:58:31,481 INFO  - TESTNG PASSED CONFIGURATION: "Surefire test" - @BeforeMethod org.apache.brooklyn.core.mgmt.persist.BrooklynMementoPersisterTestFixture.setUp() finished in 57 ms
2018-11-16 18:58:31,481 INFO  - TESTNG INVOKING: "Surefire test" - org.apache.brooklyn.core.mgmt.persist.BrooklynMementoPersisterTestFixture.testCheckPointAndLoadMemento()
2018-11-16 18:58:31,499 INFO  - TESTNG PASSED: "Surefire test" - org.apache.brooklyn.core.mgmt.persist.BrooklynMementoPersisterTestFixture.testCheckPointAndLoadMemento() finished in 18 ms
2018-11-16 18:58:31,500 INFO  - TESTNG INVOKING CONFIGURATION: "Surefire test" - @AfterMethod org.apache.brooklyn.core.mgmt.persist.BrooklynMementoPersisterTestFixture.tearDown()
[GC (Allocation Failure)  480494K->279026K(755712K), 0.0174397 secs]
2018-11-16 18:58:31,526 WARN  - Entities.destroyAll invoked on non-deployment NonDeploymentManagementContext{entity=hvlayxypg3, mode=MANAGEMENT_STOPPED} - not likely to have much effect! (This usually means the mgmt context has been taken from an entity that has been destroyed. To destroy other things on the management context ensure you keep a handle to the context before the entity is destroyed, such as by creating the management context first.)
2018-11-16 18:58:31,526 INFO  - TESTNG PASSED CONFIGURATION: "Surefire test" - @AfterMethod org.apache.brooklyn.core.mgmt.persist.BrooklynMementoPersisterTestFixture.tearDown() finished in 26 ms
2018-11-16 18:58:31,526 INFO  - TESTNG INVOKING CONFIGURATION: "Surefire test" - @BeforeMethod org.apache.brooklyn.core.mgmt.persist.BrooklynMementoPersisterTestFixture.setUp()
2018-11-16 18:58:31,530 INFO  - Added external config supplier named 'brooklyn-demo-sample': org.apache.brooklyn.core.config.external.InPlaceExternalConfigSupplier@79b3e1e4
2018-11-16 18:58:31,536 INFO  - Rebind check: no existing state; will persist new items to in-memory (test) persistence store
2018-11-16 18:58:31,537 INFO  - No Camp-YAML parser registered for parsing catalog item DSL; skipping DSL-parsing
2018-11-16 18:58:31,572 INFO  - TESTNG PASSED CONFIGURATION: "Surefire test" - @BeforeMethod org.apache.brooklyn.core.mgmt.persist.BrooklynMementoPersisterTestFixture.setUp() finished in 46 ms
2018-11-16 18:58:31,572 INFO  - TESTNG INVOKING: "Surefire test" - org.apache.brooklyn.core.mgmt.persist.BrooklynMementoPersisterTestFixture.testDeleteAndLoadMemento()
2018-11-16 18:58:31,591 INFO  - TESTNG PASSED: "Surefire test" - org.apache.brooklyn.core.mgmt.persist.BrooklynMementoPersisterTestFixture.testDeleteAndLoadMemento() finished in 19 ms
2018-11-16 18:58:31,591 INFO  - TESTNG INVOKING CONFIGURATION: "Surefire test" - @AfterMethod org.apache.brooklyn.core.mgmt.persist.BrooklynMementoPersisterTestFixture.tearDown()
2018-11-16 18:58:31,592 WARN  - Entities.destroyAll invoked on non-deployment NonDeploymentManagementContext{entity=ceaw4aksvz, mode=MANAGEMENT_STOPPED} - not likely to have much effect! (This usually means the mgmt context has been taken from an entity that has been destroyed. To destroy other things on the management context ensure you keep a handle to the context before the entity is destroyed, such as by creating the management context first.)
2018-11-16 18:58:31,592 INFO  - TESTNG PASSED CONFIGURATION: "Surefire test" - @AfterMethod org.apache.brooklyn.core.mgmt.persist.BrooklynMementoPersisterTestFixture.tearDown() finished in 1 ms
2018-11-16 18:58:31,592 INFO  - TESTNG INVOKING CONFIGURATION: "Surefire test" - @BeforeMethod org.apache.brooklyn.core.mgmt.persist.BrooklynMementoPersisterTestFixture.setUp()
2018-11-16 18:58:31,594 INFO  - Added external config supplier named 'brooklyn-demo-sample': org.apache.brooklyn.core.config.external.InPlaceExternalConfigSupplier@75975165
2018-11-16 18:58:31,599 INFO  - Rebind check: no existing state; will persist new items to in-memory (test) persistence store
2018-11-16 18:58:31,600 INFO  - No Camp-YAML parser registered for parsing catalog item DSL; skipping DSL-parsing
2018-11-16 18:58:31,634 INFO  - TESTNG PASSED CONFIGURATION: "Surefire test" - @BeforeMethod org.apache.brooklyn.core.mgmt.persist.BrooklynMementoPersisterTestFixture.setUp() finished in 42 ms
2018-11-16 18:58:31,634 INFO  - TESTNG INVOKING: "Surefire test" - org.apache.brooklyn.core.mgmt.persist.BrooklynMementoPersisterTestFixture.testLoadAndCheckpointRawMemento()
2018-11-16 18:58:31,654 INFO  - TESTNG PASSED: "Surefire test" - org.apache.brooklyn.core.mgmt.persist.BrooklynMementoPersisterTestFixture.testLoadAndCheckpointRawMemento() finished in 20 ms
2018-11-16 18:58:31,655 INFO  - TESTNG INVOKING CONFIGURATION: "Surefire test" - @AfterMethod org.apache.brooklyn.core.mgmt.persist.BrooklynMementoPersisterTestFixture.tearDown()
2018-11-16 18:58:31,663 WARN  - Entities.destroyAll invoked on non-deployment NonDeploymentManagementContext{entity=pbkdceub2v, mode=MANAGEMENT_STOPPED} - not likely to have much effect! (This usually means the mgmt context has been taken from an entity that has been destroyed. To destroy other things on the management context ensure you keep a handle to the context before the entity is destroyed, such as by creating the management context first.)
2018-11-16 18:58:31,663 INFO  - TESTNG PASSED CONFIGURATION: "Surefire test" - @AfterMethod org.apache.brooklyn.core.mgmt.persist.BrooklynMementoPersisterTestFixture.tearDown() finished in 9 ms
2018-11-16 18:58:31,884 INFO  - TESTNG 
===============================================
    Surefire test
    Tests run: 2348, Failures: 1, Skips: 0
===============================================
[GC (Allocation Failure)  481266K->280166K(759296K), 0.0087676 secs]
[GC (Allocation Failure)  487014K->279287K(758272K), 0.0170856 secs]
[GC (Allocation Failure)  486020K->279891K(761344K), 0.0065906 secs]
[GC (Allocation Failure)  490835K->279216K(760320K), 0.0131302 secs]
[GC (Allocation Failure)  490160K->279464K(762880K), 0.0387126 secs]
[GC (Allocation Failure)  493480K->279112K(761856K), 0.0077187 secs]
Tests run: 2348, Failures: 1, Errors: 0, Skipped: 0, Time elapsed: 214.31 sec <<< FAILURE! - in TestSuite
testMemberAddedNotFiredAfterRebind(org.apache.brooklyn.entity.group.MembershipTrackingPolicyRebindTest)  Time elapsed: 0.424 sec  <<< FAILURE!
org.apache.brooklyn.util.exceptions.CompoundRuntimeException: Failure rebinding; 2 errors including: Too many dangling references: 1 of 10
	at org.apache.brooklyn.entity.group.MembershipTrackingPolicyRebindTest.testMemberAddedNotFiredAfterRebind(MembershipTrackingPolicyRebindTest.java:68)
Caused by: java.lang.IllegalStateException: Too many dangling references: 1 of 10
	at org.apache.brooklyn.entity.group.MembershipTrackingPolicyRebindTest.testMemberAddedNotFiredAfterRebind(MembershipTrackingPolicyRebindTest.java:68)

2018-11-16 18:58:35,078 INFO  - Brooklyn shutdown: stopping entities [TestEntityImpl{id=mb9m0ykn4m}, TestEntityImpl{id=hxw2pq18lu}, BlockingEntityImpl{id=pkbg2cpeoh}]

Results :

Failed tests: 
  MembershipTrackingPolicyRebindTest.testMemberAddedNotFiredAfterRebind:68->RebindTestFixture.rebind:243->RebindTestFixtureWithApp.rebind:33->RebindTestFixtureWithApp.rebind:61->RebindTestFixture.rebind:262 » CompoundRuntime

Tests run: 2348, Failures: 1, Errors: 0, Skipped: 0

[INFO] ------------------------------------------------------------------------
[INFO] Reactor Summary:
[INFO] 
[INFO] Brooklyn Server Root ............................... SUCCESS [  4.149 s]
[INFO] Brooklyn Parent Project ............................ SUCCESS [  5.522 s]
[INFO] Brooklyn Test Support Utilities .................... SUCCESS [  8.079 s]
[INFO] Brooklyn Logback Includable Configuration .......... SUCCESS [  0.422 s]
[INFO] Brooklyn Common Utilities .......................... SUCCESS [ 29.378 s]
[INFO] Brooklyn API ....................................... SUCCESS [  3.414 s]
[INFO] CAMP Server Parent Project ......................... SUCCESS [  0.129 s]
[INFO] CAMP Base .......................................... SUCCESS [  3.646 s]
[INFO] Brooklyn Test Support .............................. SUCCESS [  2.253 s]
[INFO] Brooklyn REST Swagger Apidoc Utilities ............. SUCCESS [ 13.945 s]
[INFO] Brooklyn Logback Configuration ..................... SUCCESS [  0.201 s]
[INFO] CAMP Server ........................................ SUCCESS [ 13.081 s]
[INFO] Brooklyn Felix Runtime ............................. SUCCESS [  3.317 s]
[INFO] Brooklyn Groovy Utilities .......................... SUCCESS [  2.014 s]
[INFO] Brooklyn Core ...................................... FAILURE [04:27 min]
[INFO] Brooklyn Policies .................................. SKIPPED
[INFO] Brooklyn WinRM Software Entities ................... SKIPPED
[INFO] Brooklyn Secure JMXMP Agent ........................ SKIPPED
[INFO] Brooklyn JMX RMI Agent ............................. SKIPPED
[INFO] Brooklyn Jclouds Location Targets .................. SKIPPED
[INFO] Brooklyn Software Base ............................. SKIPPED
[INFO] Brooklyn CAMP ...................................... SKIPPED
[INFO] Brooklyn Launcher Common ........................... SKIPPED
[INFO] Brooklyn REST API .................................. SKIPPED
[INFO] Brooklyn REST Resources ............................ SKIPPED
[INFO] Brooklyn REST Server ............................... SKIPPED
[INFO] Brooklyn Launcher .................................. SKIPPED
[INFO] Brooklyn Container Location Targets ................ SKIPPED
[INFO] Brooklyn Command Line Interface .................... SKIPPED
[INFO] Brooklyn Test Framework ............................ SKIPPED
[INFO] Brooklyn OSGi init ................................. SKIPPED
[INFO] Brooklyn OSGi start ................................ SKIPPED
[INFO] Brooklyn Karaf ..................................... SKIPPED
[INFO] Jetty config fragment .............................. SKIPPED
[INFO] Apache Http Component extension .................... SKIPPED
[INFO] Brooklyn Karaf Features ............................ SKIPPED
[INFO] Brooklyn Karaf Shell Commands ...................... SKIPPED
[INFO] Brooklyn UI :: Parent .............................. SKIPPED
[INFO] Brooklyn UI :: Modularity Server (parent) .......... SKIPPED
[INFO] Brooklyn UI :: Modularity Server :: UI Module API .. SKIPPED
[INFO] Brooklyn UI :: Modularity Server :: UI Module Registry SKIPPED
[INFO] Brooklyn UI :: Modularity Server :: UI Proxy ....... SKIPPED
[INFO] Brooklyn UI :: Modularity Server :: UI Metadata Registry SKIPPED
[INFO] Brooklyn UI :: Modularity Server :: External UI Modules Registration Hooks SKIPPED
[INFO] Brooklyn UI :: Modularity Server :: Features ....... SKIPPED
[INFO] Brooklyn UI :: Modules (parent) .................... SKIPPED
[INFO] Brooklyn UI :: Modules - UI Utils .................. SKIPPED
[INFO] Brooklyn UI :: Modules - Home ...................... SKIPPED
[INFO] Brooklyn UI :: Modules - App inspector ............. SKIPPED
[INFO] Brooklyn UI :: Modules - Blueprint composer ........ SKIPPED
[INFO] Brooklyn UI :: Modules - Blueprint importer ........ SKIPPED
[INFO] Brooklyn UI :: Modules - Catalog ................... SKIPPED
[INFO] Brooklyn UI :: Modules - Location manager .......... SKIPPED
[INFO] Brooklyn UI :: Modules - REST API Docs ............. SKIPPED
[INFO] Brooklyn UI :: Modules - Groovy console ............ SKIPPED
[INFO] Brooklyn UI :: Modules - Logout .................... SKIPPED
[INFO] Brooklyn UI :: Modules - Features .................. SKIPPED
[INFO] Brooklyn UI :: Features ............................ SKIPPED
[INFO] Brooklyn Library Root .............................. SKIPPED
[INFO] Brooklyn CM Chef ................................... SKIPPED
[INFO] Brooklyn CM SaltStack .............................. SKIPPED
[INFO] Brooklyn CM Ansible ................................ SKIPPED
[INFO] Brooklyn CM Integration Root ....................... SKIPPED
[INFO] Brooklyn Network Software Entities ................. SKIPPED
[INFO] Brooklyn OSGi Software Entities .................... SKIPPED
[INFO] Brooklyn Database Software Entities ................ SKIPPED
[INFO] Brooklyn Web App Software Entities ................. SKIPPED
[INFO] Brooklyn Messaging Software Entities ............... SKIPPED
[INFO] Brooklyn NoSQL Data Store Software Entities ........ SKIPPED
[INFO] Brooklyn Monitoring Software Entities .............. SKIPPED
[INFO] Brooklyn Web App Software Entities ................. SKIPPED
[INFO] Brooklyn QA ........................................ SKIPPED
[INFO] Brooklyn Examples Aggregator Project ............... SKIPPED
[INFO] Brooklyn Examples Aggregator Project - Webapps ..... SKIPPED
[INFO] hello-world-webapp Maven Webapp .................... SKIPPED
[INFO] hello-world-sql-webapp Maven Webapp ................ SKIPPED
[INFO] Brooklyn Simple Web Cluster Example ................ SKIPPED
[INFO] Brooklyn Library Karaf integration ................. SKIPPED
[INFO] Brooklyn Library Catalog ........................... SKIPPED
[INFO] Brooklyn Library Karaf Features .................... SKIPPED
[INFO] Brooklyn Client .................................... SKIPPED
[INFO] Brooklyn Client Command Line Interface ............. SKIPPED
[INFO] Brooklyn REST java Client .......................... SKIPPED
[INFO] Brooklyn Downstream Project Parent ................. SKIPPED
[INFO] Brooklyn Dist Root ................................. SKIPPED
[INFO] Brooklyn All Things ................................ SKIPPED
[INFO] Brooklyn Distribution .............................. SKIPPED
[INFO] Brooklyn Karaf Distribution Parent ................. SKIPPED
[INFO] Brooklyn Karaf Server Configuration ................ SKIPPED
[INFO] Brooklyn Dist Karaf Features ....................... SKIPPED
[INFO] Brooklyn Karaf Distribution ........................ SKIPPED
[INFO] Brooklyn Karaf pax-exam itest ...................... SKIPPED
[INFO] Brooklyn Vagrant Getting Started Environment ....... SKIPPED
[INFO] Brooklyn Quick-Start Project Archetype ............. SKIPPED
[INFO] Brooklyn Shared Package Files ...................... SKIPPED
[INFO] Brooklyn RPM Package ............................... SKIPPED
[INFO] Brooklyn DEB Package ............................... SKIPPED
[INFO] Brooklyn Root 1.0.0-SNAPSHOT ....................... SKIPPED
[INFO] ------------------------------------------------------------------------
[INFO] BUILD FAILURE
[INFO] ------------------------------------------------------------------------
[INFO] Total time: 06:18 min
[INFO] Finished at: 2018-11-16T18:58:35Z
[INFO] ------------------------------------------------------------------------
[ERROR] Failed to execute goal org.apache.maven.plugins:maven-surefire-plugin:2.19.1:test (default-test) on project brooklyn-core: There are test failures.
[ERROR] 
[ERROR] Please refer to /usr/build/brooklyn-server/core/target/surefire-reports for the individual test results.
[ERROR] -> [Help 1]
[ERROR] 
[ERROR] To see the full stack trace of the errors, re-run Maven with the -e switch.
[ERROR] Re-run Maven using the -X switch to enable full debug logging.
[ERROR] 
[ERROR] For more information about the errors and possible solutions, please read the following articles:
[ERROR] [Help 1] http://cwiki.apache.org/confluence/display/MAVEN/MojoFailureException
[ERROR] 
[ERROR] After correcting the problems, you can resume the build with the command
[ERROR]   mvn <goals> -rf :brooklyn-core
Build step 'Execute shell' marked build as failure
Recording test results
TestNG Reports Processing: START
Looking for TestNG results report in workspace using pattern: **/testng-results.xml
Saving reports...
Processing '/x1/jenkins/jenkins-home/jobs/brooklyn-master-build-docker/builds/998/testng/testng-results-1.xml'
Processing '/x1/jenkins/jenkins-home/jobs/brooklyn-master-build-docker/builds/998/testng/testng-results-2.xml'
Processing '/x1/jenkins/jenkins-home/jobs/brooklyn-master-build-docker/builds/998/testng/testng-results-3.xml'
Processing '/x1/jenkins/jenkins-home/jobs/brooklyn-master-build-docker/builds/998/testng/testng-results-4.xml'
Processing '/x1/jenkins/jenkins-home/jobs/brooklyn-master-build-docker/builds/998/testng/testng-results-5.xml'
Processing '/x1/jenkins/jenkins-home/jobs/brooklyn-master-build-docker/builds/998/testng/testng-results-6.xml'
Processing '/x1/jenkins/jenkins-home/jobs/brooklyn-master-build-docker/builds/998/testng/testng-results.xml'
0.033807% of tests failed, which exceeded threshold of 0%. Marking build as UNSTABLE
TestNG Reports Processing: FINISH