osdir.com

[Date Prev][Date Next][Thread Prev][Thread Next][Date Index][Thread Index]

Build failed in Jenkins: brooklyn-master-build-docker-pipeline #59


See <https://builds.apache.org/job/brooklyn-master-build-docker-pipeline/59/display/redirect>

------------------------------------------
[...truncated 8.28 MB...]
2018-11-15 23:41:42,820 INFO  YzkcJ4o3-[p6w74ns9s1,ryuvvtbk7i] Resize DynamicClusterImpl{id=ryuvvtbk7i} from 0 to 1
2018-11-15 23:41:42,863 INFO  - Starting StubHostImpl{id=v0ihjqgc6h} on machine SshMachineLocation[localhost:null@/172.17.0.3:22(id=exrvu8rhjx)]
2018-11-15 23:41:42,864 WARN  - Deprecated use of unmanaged location (StubHostLocation{id=dkogkdezxr, name=Docker Host(v0ihjqgc6h)}); will be managed automatically now but not supported in future versions
2018-11-15 23:41:42,865 INFO  - New Docker host location StubHostLocation{id=dkogkdezxr, name=Docker Host(v0ihjqgc6h)} created
2018-11-15 23:41:43,026 INFO  QqJKKDNK-[p6w74ns9s1] Started application StubInfrastructureImpl{id=p6w74ns9s1}
2018-11-15 23:41:43,036 WARN  hYX5dbb0-[p6w74ns9s1,ryuvvtbk7i,v0ihjqgc6h,u24oxqcqsx,jkal90w400] Deprecated use of unmanaged location (SshMachineLocation[StubContainerLocation:giqw:null@1.2.3.4/1.2.3.4:22(id=giqwldywlw)]); will be managed automatically now but not supported in future versions
2018-11-15 23:41:43,038 INFO  hYX5dbb0-[p6w74ns9s1,ryuvvtbk7i,v0ihjqgc6h,u24oxqcqsx,jkal90w400] Starting entity StubContainerImpl{id=jkal90w400} at [SshMachineLocation[localhost:null@630114d36440/172.17.0.3:22(id=exrvu8rhjx)]]
2018-11-15 23:41:43,040 WARN  - Use of deprecated ConfigKey group.members.delegate in DynamicGroupImpl{id=vzm8bpwfj9} (as of 0.9.0)
2018-11-15 23:41:43,042 INFO  - Docker Host StubHostImpl{id=v0ihjqgc6h}: member SshMachineLocation[StubContainerLocation:giqw:null@1.2.3.4/1.2.3.4:22(id=giqwldywlw)] released
2018-11-15 23:41:43,058 INFO  - TESTNG PASSED: "Surefire test" - org.apache.brooklyn.core.location.dynamic.clocker.ClockerDynamicLocationPatternTest.testCreateAndReleaseDirectly() finished in 310 ms
2018-11-15 23:41:43,058 INFO  - TESTNG INVOKING CONFIGURATION: "Surefire test" - @AfterMethod org.apache.brooklyn.core.test.BrooklynMgmtUnitTestSupport.tearDown()
2018-11-15 23:41:43,067 INFO  bhgnEhwS-[p6w74ns9s1,ryuvvtbk7i,v0ihjqgc6h] Stopping StubHostImpl{id=v0ihjqgc6h} in [LocalhostMachineProvisioningLocation{id=s30uxyo4q6, name=localhost}, SshMachineLocation[localhost:null@630114d36440/172.17.0.3:22(id=exrvu8rhjx)]]
2018-11-15 23:41:43,095 INFO  KXPx3ne1-[p6w74ns9s1] Stopping application StubInfrastructureImpl{id=p6w74ns9s1}
2018-11-15 23:41:43,099 INFO  UNtW0bVh-[p6w74ns9s1,ryuvvtbk7i,v0ihjqgc6h] Stopping StubHostImpl{id=v0ihjqgc6h} in [LocalhostMachineProvisioningLocation{id=s30uxyo4q6, name=localhost}]
2018-11-15 23:41:43,125 INFO  KXPx3ne1-[p6w74ns9s1] Stopped application StubInfrastructureImpl{id=p6w74ns9s1}
2018-11-15 23:41:43,128 WARN  - Error notifying listener of itemAdded(DynamicClusterImpl{id=u24oxqcqsx})
java.lang.IllegalStateException: Entity DynamicMultiGroupImpl{id=uc4oxl2k8t} is no longer managed; execution context not available
	at org.apache.brooklyn.core.mgmt.internal.NonDeploymentManagementContext.getExecutionContext(NonDeploymentManagementContext.java:282) ~[brooklyn-core-1.0.0-SNAPSHOT.jar:1.0.0-SNAPSHOT]
2018-11-15 23:41:43,130 INFO  - TESTNG PASSED CONFIGURATION: "Surefire test" - @AfterMethod org.apache.brooklyn.core.test.BrooklynMgmtUnitTestSupport.tearDown() finished in 72 ms
2018-11-15 23:41:43,130 INFO  - TESTNG INVOKING CONFIGURATION: "Surefire test" - @BeforeMethod org.apache.brooklyn.core.location.dynamic.clocker.ClockerDynamicLocationPatternTest.setUp()
2018-11-15 23:41:43,130 INFO  - Added external config supplier named 'brooklyn-demo-sample': org.apache.brooklyn.core.config.external.InPlaceExternalConfigSupplier@7c7a4986
2018-11-15 23:41:43,166 INFO  - TESTNG PASSED CONFIGURATION: "Surefire test" - @BeforeMethod org.apache.brooklyn.core.location.dynamic.clocker.ClockerDynamicLocationPatternTest.setUp() finished in 36 ms
2018-11-15 23:41:43,166 INFO  - TESTNG INVOKING: "Surefire test" - org.apache.brooklyn.core.location.dynamic.clocker.ClockerDynamicLocationPatternTest.testThroughLocationRegistry()
2018-11-15 23:41:43,226 INFO  nQp9IuxU-[v4honxvjv0] Creating new DockerLocation wrapping LocalhostMachineProvisioningLocation{id=ptosxzu48a, name=localhost}
2018-11-15 23:41:43,228 INFO  nQp9IuxU-[v4honxvjv0] No Camp-YAML parser registered for parsing catalog item DSL; skipping DSL-parsing
2018-11-15 23:41:43,237 INFO  BijlIdsE-[v4honxvjv0,wdnq8yds3n] Resize DynamicClusterImpl{id=wdnq8yds3n} from 0 to 1
2018-11-15 23:41:43,312 INFO  - Starting StubHostImpl{id=g9u80dext9} on machine SshMachineLocation[localhost:null@/172.17.0.3:22(id=zwb5b4r1yt)]
2018-11-15 23:41:43,314 WARN  - Deprecated use of unmanaged location (StubHostLocation{id=m7fnamanum, name=Docker Host(g9u80dext9)}); will be managed automatically now but not supported in future versions
2018-11-15 23:41:43,314 INFO  - New Docker host location StubHostLocation{id=m7fnamanum, name=Docker Host(g9u80dext9)} created
2018-11-15 23:41:43,473 INFO  nQp9IuxU-[v4honxvjv0] Started application StubInfrastructureImpl{id=v4honxvjv0}
2018-11-15 23:41:43,491 WARN  - Use of deprecated ConfigKey group.members.delegate in DynamicGroupImpl{id=yyeqr648gb} (as of 0.9.0)
2018-11-15 23:41:43,502 WARN  sguqt31e-[v4honxvjv0,wdnq8yds3n,g9u80dext9,ftjiwkb5s6,ibiuhxre6o] Deprecated use of unmanaged location (SshMachineLocation[StubContainerLocation:yn6a:null@1.2.3.4/1.2.3.4:22(id=yn6aeo50av)]); will be managed automatically now but not supported in future versions
2018-11-15 23:41:43,503 INFO  sguqt31e-[v4honxvjv0,wdnq8yds3n,g9u80dext9,ftjiwkb5s6,ibiuhxre6o] Starting entity StubContainerImpl{id=ibiuhxre6o} at [SshMachineLocation[localhost:null@630114d36440/172.17.0.3:22(id=zwb5b4r1yt)]]
2018-11-15 23:41:43,513 INFO  - Docker Host StubHostImpl{id=g9u80dext9}: member SshMachineLocation[StubContainerLocation:yn6a:null@1.2.3.4/1.2.3.4:22(id=yn6aeo50av)] released
2018-11-15 23:41:43,518 INFO  - TESTNG PASSED: "Surefire test" - org.apache.brooklyn.core.location.dynamic.clocker.ClockerDynamicLocationPatternTest.testThroughLocationRegistry() finished in 352 ms
2018-11-15 23:41:43,518 INFO  - TESTNG INVOKING CONFIGURATION: "Surefire test" - @AfterMethod org.apache.brooklyn.core.test.BrooklynMgmtUnitTestSupport.tearDown()
2018-11-15 23:41:43,524 INFO  H14ajzMF-[v4honxvjv0,wdnq8yds3n,g9u80dext9] Stopping StubHostImpl{id=g9u80dext9} in [LocalhostMachineProvisioningLocation{id=ptosxzu48a, name=localhost}, SshMachineLocation[localhost:null@630114d36440/172.17.0.3:22(id=zwb5b4r1yt)]]
2018-11-15 23:41:43,530 INFO  vzkooCUN-[v4honxvjv0] Stopping application StubInfrastructureImpl{id=v4honxvjv0}
2018-11-15 23:41:43,539 INFO  wh6MLVce-[v4honxvjv0,wdnq8yds3n,g9u80dext9] Stopping StubHostImpl{id=g9u80dext9} in [LocalhostMachineProvisioningLocation{id=ptosxzu48a, name=localhost}]
2018-11-15 23:41:43,550 INFO  vzkooCUN-[v4honxvjv0] Stopped application StubInfrastructureImpl{id=v4honxvjv0}
2018-11-15 23:41:43,555 INFO  - TESTNG PASSED CONFIGURATION: "Surefire test" - @AfterMethod org.apache.brooklyn.core.test.BrooklynMgmtUnitTestSupport.tearDown() finished in 37 ms
2018-11-15 23:41:43,555 INFO  - TESTNG INVOKING CONFIGURATION: "Surefire test" - @BeforeMethod org.apache.brooklyn.core.location.dynamic.clocker.ClockerDynamicLocationPatternTest.setUp()
2018-11-15 23:41:43,556 INFO  - Added external config supplier named 'brooklyn-demo-sample': org.apache.brooklyn.core.config.external.InPlaceExternalConfigSupplier@6af02de0
2018-11-15 23:41:43,557 WARN  ulKIirAS-[v4honxvjv0,wdnq8yds3n,g9u80dext9,ftjiwkb5s6] Error invoking stop at DynamicClusterImpl{id=ftjiwkb5s6}: CancellationException
2018-11-15 23:41:43,572 INFO  - TESTNG PASSED CONFIGURATION: "Surefire test" - @BeforeMethod org.apache.brooklyn.core.location.dynamic.clocker.ClockerDynamicLocationPatternTest.setUp() finished in 17 ms
2018-11-15 23:41:43,572 INFO  - TESTNG INVOKING: "Surefire test" - org.apache.brooklyn.core.location.dynamic.clocker.ClockerDynamicLocationPatternTest.testThroughLocationRegistryAfterReloadProperties()
2018-11-15 23:41:43,636 INFO  Hmm7uXA2-[ly791wqwoq] Creating new DockerLocation wrapping LocalhostMachineProvisioningLocation{id=aclzn4zbf6, name=localhost}
2018-11-15 23:41:43,642 INFO  Hmm7uXA2-[ly791wqwoq] No Camp-YAML parser registered for parsing catalog item DSL; skipping DSL-parsing
2018-11-15 23:41:43,651 INFO  VJbw3Sdo-[ly791wqwoq,njzhzein73] Resize DynamicClusterImpl{id=njzhzein73} from 0 to 1
2018-11-15 23:41:43,713 INFO  - Starting StubHostImpl{id=hw0qi5q9mx} on machine SshMachineLocation[localhost:null@/172.17.0.3:22(id=seybwbx9rs)]
2018-11-15 23:41:43,715 WARN  - Deprecated use of unmanaged location (StubHostLocation{id=qitj0oqn1t, name=Docker Host(hw0qi5q9mx)}); will be managed automatically now but not supported in future versions
2018-11-15 23:41:43,715 INFO  - New Docker host location StubHostLocation{id=qitj0oqn1t, name=Docker Host(hw0qi5q9mx)} created
2018-11-15 23:41:43,883 INFO  Hmm7uXA2-[ly791wqwoq] Started application StubInfrastructureImpl{id=ly791wqwoq}
2018-11-15 23:41:43,889 INFO  - Reloading brooklyn properties from Builder{originalProperties=BrooklynProperties[4]}
2018-11-15 23:41:43,889 WARN  - When reloading, mgmt context LocalManagementContext[?-U9ABwfqv] properties are fixed, so reload will be of limited utility
2018-11-15 23:41:43,892 INFO  - Locations to look up: infraLocSpec=stub:f1k6ddge60:(name="my-stub-cloud"); infraLocName=my-stub-cloud; hostLocSpec=stub:f1k6ddge60:qitj0oqn1t:(name="f1k6ddge60-hw0qi5q9mx"); hostLocName=f1k6ddge60-hw0qi5q9mx
2018-11-15 23:41:43,908 WARN  - Use of deprecated ConfigKey group.members.delegate in DynamicGroupImpl{id=hq9rxjalet} (as of 0.9.0)
2018-11-15 23:41:43,927 WARN  YVqraG3S-[ly791wqwoq,njzhzein73,hw0qi5q9mx,s9dkmxns3t,ataaqtc0rn] Deprecated use of unmanaged location (SshMachineLocation[StubContainerLocation:cubr:null@1.2.3.4/1.2.3.4:22(id=cubr633j76)]); will be managed automatically now but not supported in future versions
2018-11-15 23:41:43,928 INFO  YVqraG3S-[ly791wqwoq,njzhzein73,hw0qi5q9mx,s9dkmxns3t,ataaqtc0rn] Starting entity StubContainerImpl{id=ataaqtc0rn} at [SshMachineLocation[localhost:null@630114d36440/172.17.0.3:22(id=seybwbx9rs)]]
2018-11-15 23:41:43,941 INFO  - Docker Host StubHostImpl{id=hw0qi5q9mx}: member SshMachineLocation[StubContainerLocation:cubr:null@1.2.3.4/1.2.3.4:22(id=cubr633j76)] released
2018-11-15 23:41:43,945 INFO  - TESTNG PASSED: "Surefire test" - org.apache.brooklyn.core.location.dynamic.clocker.ClockerDynamicLocationPatternTest.testThroughLocationRegistryAfterReloadProperties() finished in 373 ms
2018-11-15 23:41:43,945 INFO  - TESTNG INVOKING CONFIGURATION: "Surefire test" - @AfterMethod org.apache.brooklyn.core.test.BrooklynMgmtUnitTestSupport.tearDown()
2018-11-15 23:41:43,975 INFO  mg97tGvC-[ly791wqwoq,njzhzein73,hw0qi5q9mx] Stopping StubHostImpl{id=hw0qi5q9mx} in [LocalhostMachineProvisioningLocation{id=aclzn4zbf6, name=localhost}, SshMachineLocation[localhost:null@630114d36440/172.17.0.3:22(id=seybwbx9rs)]]
2018-11-15 23:41:44,033 INFO  f2Xgw0ZR-[ly791wqwoq] Stopping application StubInfrastructureImpl{id=ly791wqwoq}
2018-11-15 23:41:44,035 INFO  eBR33idj-[ly791wqwoq,njzhzein73,hw0qi5q9mx] Stopping StubHostImpl{id=hw0qi5q9mx} in [LocalhostMachineProvisioningLocation{id=aclzn4zbf6, name=localhost}]
2018-11-15 23:41:44,053 INFO  f2Xgw0ZR-[ly791wqwoq] Stopped application StubInfrastructureImpl{id=ly791wqwoq}
2018-11-15 23:41:44,065 INFO  - TESTNG PASSED CONFIGURATION: "Surefire test" - @AfterMethod org.apache.brooklyn.core.test.BrooklynMgmtUnitTestSupport.tearDown() finished in 120 ms
2018-11-15 23:41:44,231 INFO  - TESTNG 
===============================================
    Surefire test
    Tests run: 234, Failures: 1, Skips: 0
===============================================
[GC (Allocation Failure)  283408K->81351K(759296K), 0.0636791 secs]
Tests run: 234, Failures: 1, Errors: 0, Skipped: 0, Time elapsed: 349.227 sec <<< FAILURE! - in TestSuite
testUseSshMonitoringDisabled(org.apache.brooklyn.entity.software.base.VanillaSoftwareProcessTest)  Time elapsed: 121.193 sec  <<< FAILURE!
org.apache.brooklyn.core.mgmt.internal.EffectorUtils$EffectorCallPropagatedRuntimeException: Error invoking start at VanillaSoftwareProcessImpl{id=pbef4lpa7t}
	at org.apache.brooklyn.entity.software.base.VanillaSoftwareProcessTest.testUseSshMonitoringDisabled(VanillaSoftwareProcessTest.java:381)
Caused by: org.apache.brooklyn.util.exceptions.PropagatedRuntimeException: 
	at org.apache.brooklyn.entity.software.base.VanillaSoftwareProcessTest.testUseSshMonitoringDisabled(VanillaSoftwareProcessTest.java:381)
Caused by: java.util.concurrent.ExecutionException: java.lang.IllegalStateException: Timeout waiting for SERVICE_UP on VanillaSoftwareProcessImpl{id=pbef4lpa7t}
	at org.apache.brooklyn.entity.software.base.VanillaSoftwareProcessTest.testUseSshMonitoringDisabled(VanillaSoftwareProcessTest.java:381)
Caused by: java.lang.IllegalStateException: Timeout waiting for SERVICE_UP on VanillaSoftwareProcessImpl{id=pbef4lpa7t}


Results :

Failed tests: 
  VanillaSoftwareProcessTest.testUseSshMonitoringDisabled:381 » EffectorCallPropagatedRuntime

Tests run: 234, Failures: 1, Errors: 0, Skipped: 0

[INFO] ------------------------------------------------------------------------
[INFO] Reactor Summary:
[INFO] 
[INFO] Brooklyn Server Root ............................... SUCCESS [ 19.649 s]
[INFO] Brooklyn Parent Project ............................ SUCCESS [ 22.360 s]
[INFO] Brooklyn Test Support Utilities .................... SUCCESS [ 35.896 s]
[INFO] Brooklyn Logback Includable Configuration .......... SUCCESS [  2.927 s]
[INFO] Brooklyn Common Utilities .......................... SUCCESS [01:52 min]
[INFO] Brooklyn API ....................................... SUCCESS [ 14.775 s]
[INFO] CAMP Server Parent Project ......................... SUCCESS [  0.722 s]
[INFO] CAMP Base .......................................... SUCCESS [ 13.650 s]
[INFO] Brooklyn Test Support .............................. SUCCESS [ 12.166 s]
[INFO] Brooklyn REST Swagger Apidoc Utilities ............. SUCCESS [ 24.082 s]
[INFO] Brooklyn Logback Configuration ..................... SUCCESS [  1.701 s]
[INFO] CAMP Server ........................................ SUCCESS [ 34.960 s]
[INFO] Brooklyn Felix Runtime ............................. SUCCESS [ 15.189 s]
[INFO] Brooklyn Groovy Utilities .......................... SUCCESS [  9.118 s]
[INFO] Brooklyn Core ...................................... SUCCESS [13:45 min]
[INFO] Brooklyn Policies .................................. SUCCESS [02:14 min]
[INFO] Brooklyn WinRM Software Entities ................... SUCCESS [ 39.519 s]
[INFO] Brooklyn Secure JMXMP Agent ........................ SUCCESS [ 14.648 s]
[INFO] Brooklyn JMX RMI Agent ............................. SUCCESS [  2.022 s]
[INFO] Brooklyn Jclouds Location Targets .................. SUCCESS [02:38 min]
[INFO] Brooklyn Software Base ............................. FAILURE [06:29 min]
[INFO] Brooklyn CAMP ...................................... SKIPPED
[INFO] Brooklyn Launcher Common ........................... SKIPPED
[INFO] Brooklyn REST API .................................. SKIPPED
[INFO] Brooklyn REST Resources ............................ SKIPPED
[INFO] Brooklyn REST Server ............................... SKIPPED
[INFO] Brooklyn Launcher .................................. SKIPPED
[INFO] Brooklyn Container Location Targets ................ SKIPPED
[INFO] Brooklyn Command Line Interface .................... SKIPPED
[INFO] Brooklyn Test Framework ............................ SKIPPED
[INFO] Brooklyn OSGi init ................................. SKIPPED
[INFO] Brooklyn OSGi start ................................ SKIPPED
[INFO] Brooklyn Karaf ..................................... SKIPPED
[INFO] Jetty config fragment .............................. SKIPPED
[INFO] Apache Http Component extension .................... SKIPPED
[INFO] Brooklyn Karaf Features ............................ SKIPPED
[INFO] Brooklyn Karaf Shell Commands ...................... SKIPPED
[INFO] Brooklyn UI :: Parent .............................. SKIPPED
[INFO] Brooklyn UI :: Modularity Server (parent) .......... SKIPPED
[INFO] Brooklyn UI :: Modularity Server :: UI Module API .. SKIPPED
[INFO] Brooklyn UI :: Modularity Server :: UI Module Registry SKIPPED
[INFO] Brooklyn UI :: Modularity Server :: UI Proxy ....... SKIPPED
[INFO] Brooklyn UI :: Modularity Server :: UI Metadata Registry SKIPPED
[INFO] Brooklyn UI :: Modularity Server :: External UI Modules Registration Hooks SKIPPED
[INFO] Brooklyn UI :: Modularity Server :: Features ....... SKIPPED
[INFO] Brooklyn UI :: Modules (parent) .................... SKIPPED
[INFO] Brooklyn UI :: Modules - UI Utils .................. SKIPPED
[INFO] Brooklyn UI :: Modules - Home ...................... SKIPPED
[INFO] Brooklyn UI :: Modules - App inspector ............. SKIPPED
[INFO] Brooklyn UI :: Modules - Blueprint composer ........ SKIPPED
[INFO] Brooklyn UI :: Modules - Blueprint importer ........ SKIPPED
[INFO] Brooklyn UI :: Modules - Catalog ................... SKIPPED
[INFO] Brooklyn UI :: Modules - Location manager .......... SKIPPED
[INFO] Brooklyn UI :: Modules - REST API Docs ............. SKIPPED
[INFO] Brooklyn UI :: Modules - Groovy console ............ SKIPPED
[INFO] Brooklyn UI :: Modules - Logout .................... SKIPPED
[INFO] Brooklyn UI :: Modules - Features .................. SKIPPED
[INFO] Brooklyn UI :: Features ............................ SKIPPED
[INFO] Brooklyn Library Root .............................. SKIPPED
[INFO] Brooklyn CM Chef ................................... SKIPPED
[INFO] Brooklyn CM SaltStack .............................. SKIPPED
[INFO] Brooklyn CM Ansible ................................ SKIPPED
[INFO] Brooklyn CM Integration Root ....................... SKIPPED
[INFO] Brooklyn Network Software Entities ................. SKIPPED
[INFO] Brooklyn OSGi Software Entities .................... SKIPPED
[INFO] Brooklyn Database Software Entities ................ SKIPPED
[INFO] Brooklyn Web App Software Entities ................. SKIPPED
[INFO] Brooklyn Messaging Software Entities ............... SKIPPED
[INFO] Brooklyn NoSQL Data Store Software Entities ........ SKIPPED
[INFO] Brooklyn Monitoring Software Entities .............. SKIPPED
[INFO] Brooklyn Web App Software Entities ................. SKIPPED
[INFO] Brooklyn QA ........................................ SKIPPED
[INFO] Brooklyn Examples Aggregator Project ............... SKIPPED
[INFO] Brooklyn Examples Aggregator Project - Webapps ..... SKIPPED
[INFO] hello-world-webapp Maven Webapp .................... SKIPPED
[INFO] hello-world-sql-webapp Maven Webapp ................ SKIPPED
[INFO] Brooklyn Simple Web Cluster Example ................ SKIPPED
[INFO] Brooklyn Library Karaf integration ................. SKIPPED
[INFO] Brooklyn Library Catalog ........................... SKIPPED
[INFO] Brooklyn Library Karaf Features .................... SKIPPED
[INFO] Brooklyn Client .................................... SKIPPED
[INFO] Brooklyn Client Command Line Interface ............. SKIPPED
[INFO] Brooklyn REST java Client .......................... SKIPPED
[INFO] Brooklyn Downstream Project Parent ................. SKIPPED
[INFO] Brooklyn Dist Root ................................. SKIPPED
[INFO] Brooklyn All Things ................................ SKIPPED
[INFO] Brooklyn Distribution .............................. SKIPPED
[INFO] Brooklyn Karaf Distribution Parent ................. SKIPPED
[INFO] Brooklyn Karaf Server Configuration ................ SKIPPED
[INFO] Brooklyn Dist Karaf Features ....................... SKIPPED
[INFO] Brooklyn Karaf Distribution ........................ SKIPPED
[INFO] Brooklyn Karaf pax-exam itest ...................... SKIPPED
[INFO] Brooklyn Vagrant Getting Started Environment ....... SKIPPED
[INFO] Brooklyn Quick-Start Project Archetype ............. SKIPPED
[INFO] Brooklyn Shared Package Files ...................... SKIPPED
[INFO] Brooklyn RPM Package ............................... SKIPPED
[INFO] Brooklyn DEB Package ............................... SKIPPED
[INFO] Brooklyn Root 1.0.0-SNAPSHOT ....................... SKIPPED
[INFO] ------------------------------------------------------------------------
[INFO] BUILD FAILURE
[INFO] ------------------------------------------------------------------------
[INFO] Total time: 33:02 min
[INFO] Finished at: 2018-11-15T23:41:45Z
[INFO] ------------------------------------------------------------------------
[ERROR] Failed to execute goal org.apache.maven.plugins:maven-surefire-plugin:2.19.1:test (default-test) on project brooklyn-software-base: There are test failures.
[ERROR] 
[ERROR] Please refer to /home/jenkins/jenkins-slave/workspace/brooklyn-master-build-docker-pipeline/brooklyn-server/software/base/target/surefire-reports for the individual test results.
[ERROR] -> [Help 1]
[ERROR] 
[ERROR] To see the full stack trace of the errors, re-run Maven with the -e switch.
[ERROR] Re-run Maven using the -X switch to enable full debug logging.
[ERROR] 
[ERROR] For more information about the errors and possible solutions, please read the following articles:
[ERROR] [Help 1] http://cwiki.apache.org/confluence/display/MAVEN/MojoFailureException
[ERROR] 
[ERROR] After correcting the problems, you can resume the build with the command
[ERROR]   mvn <goals> -rf :brooklyn-software-base
[Pipeline] }
$ docker stop --time=1 630114d3644029745d497ce7f5b5857d43644daba78fd26ff3922b5c48055e7d
$ docker rm -f 630114d3644029745d497ce7f5b5857d43644daba78fd26ff3922b5c48055e7d
[Pipeline] // withDockerContainer
[Pipeline] }
[Pipeline] // stage
[Pipeline] }
[Pipeline] // withEnv
[Pipeline] }
ERROR: script returned exit code 1
[Pipeline] // catchError
[Pipeline] stage
[Pipeline] { (Publish test results)
[Pipeline] junit
Recording test results
[Pipeline] step
TestNG Reports Processing: START
Looking for TestNG results report in workspace using pattern: **/testng-results.xml
Saving reports...
Processing '/x1/jenkins/jenkins-home/jobs/brooklyn-master-build-docker-pipeline/builds/59/testng/testng-results-1.xml'
Processing '/x1/jenkins/jenkins-home/jobs/brooklyn-master-build-docker-pipeline/builds/59/testng/testng-results-10.xml'
Processing '/x1/jenkins/jenkins-home/jobs/brooklyn-master-build-docker-pipeline/builds/59/testng/testng-results-11.xml'
Processing '/x1/jenkins/jenkins-home/jobs/brooklyn-master-build-docker-pipeline/builds/59/testng/testng-results-2.xml'
Processing '/x1/jenkins/jenkins-home/jobs/brooklyn-master-build-docker-pipeline/builds/59/testng/testng-results-3.xml'
Processing '/x1/jenkins/jenkins-home/jobs/brooklyn-master-build-docker-pipeline/builds/59/testng/testng-results-4.xml'
Processing '/x1/jenkins/jenkins-home/jobs/brooklyn-master-build-docker-pipeline/builds/59/testng/testng-results-5.xml'
Processing '/x1/jenkins/jenkins-home/jobs/brooklyn-master-build-docker-pipeline/builds/59/testng/testng-results-6.xml'
Processing '/x1/jenkins/jenkins-home/jobs/brooklyn-master-build-docker-pipeline/builds/59/testng/testng-results-7.xml'
Processing '/x1/jenkins/jenkins-home/jobs/brooklyn-master-build-docker-pipeline/builds/59/testng/testng-results-8.xml'
Processing '/x1/jenkins/jenkins-home/jobs/brooklyn-master-build-docker-pipeline/builds/59/testng/testng-results-9.xml'
Processing '/x1/jenkins/jenkins-home/jobs/brooklyn-master-build-docker-pipeline/builds/59/testng/testng-results.xml'
0.028185% of tests failed, which exceeded threshold of 0%. Marking build as UNSTABLE
TestNG Reports Processing: FINISH
[Pipeline] }
[Pipeline] // stage
[Pipeline] stage
[Pipeline] { (Send notifications)
[Pipeline] step