osdir.com

[Date Prev][Date Next][Thread Prev][Thread Next][Date Index][Thread Index]

Build failed in Jenkins: brooklyn-master-build-docker #989


See <https://builds.apache.org/job/brooklyn-master-build-docker/989/display/redirect>

------------------------------------------
[...truncated 8.00 MB...]
2018-11-15 16:05:43,846 INFO  - TESTNG INVOKING: "Surefire test" - org.apache.brooklyn.feed.jmx.JmxHelperTest.testMBeanNotFoundLoggedOnlyOncePerUrl()
2018-11-15 16:05:43,846 WARN  - JMX object DoesNotExist:type=DoesNotExist not found at service:jmx:rmi:///jndi/rmi://127.0.0.1:11051/jmxrmi
2018-11-15 16:05:43,857 INFO  - JMX tester service stopped (127.0.0.1:11051)
2018-11-15 16:05:43,863 INFO  - JMX tester service started at URL service:jmx:rmi:///jndi/rmi://127.0.0.1:11270/jmxrmi
2018-11-15 16:05:43,867 WARN  - JMX object DoesNotExist:type=DoesNotExist not found at service:jmx:rmi:///jndi/rmi://127.0.0.1:11270/jmxrmi
2018-11-15 16:05:43,872 INFO  - TESTNG PASSED: "Surefire test" - org.apache.brooklyn.feed.jmx.JmxHelperTest.testMBeanNotFoundLoggedOnlyOncePerUrl() finished in 26 ms
2018-11-15 16:05:43,872 INFO  - TESTNG INVOKING CONFIGURATION: "Surefire test" - @AfterMethod org.apache.brooklyn.feed.jmx.JmxHelperTest.tearDown()
2018-11-15 16:05:43,874 INFO  - JMX tester service stopped (127.0.0.1:11270)
2018-11-15 16:05:43,874 INFO  - TESTNG PASSED CONFIGURATION: "Surefire test" - @AfterMethod org.apache.brooklyn.feed.jmx.JmxHelperTest.tearDown() finished in 2 ms
2018-11-15 16:05:43,874 INFO  - TESTNG INVOKING CONFIGURATION: "Surefire test" - @BeforeMethod org.apache.brooklyn.feed.jmx.JmxHelperTest.setUp()
2018-11-15 16:05:43,878 INFO  - JMX tester service started at URL service:jmx:rmi:///jndi/rmi://127.0.0.1:11107/jmxrmi
2018-11-15 16:05:43,882 INFO  - TESTNG PASSED CONFIGURATION: "Surefire test" - @BeforeMethod org.apache.brooklyn.feed.jmx.JmxHelperTest.setUp() finished in 8 ms
2018-11-15 16:05:43,882 INFO  - TESTNG INVOKING: "Surefire test" - org.apache.brooklyn.feed.jmx.JmxHelperTest.testReconnectsOnJmxServerTemporaryFailure()
2018-11-15 16:05:43,884 INFO  - JMX tester service stopped (127.0.0.1:11107)
2018-11-15 16:05:43,896 INFO  - JMX tester service started at URL service:jmx:rmi:///jndi/rmi://127.0.0.1:11107/jmxrmi
2018-11-15 16:05:43,902 INFO  - TESTNG PASSED: "Surefire test" - org.apache.brooklyn.feed.jmx.JmxHelperTest.testReconnectsOnJmxServerTemporaryFailure() finished in 20 ms
2018-11-15 16:05:43,903 INFO  - TESTNG INVOKING CONFIGURATION: "Surefire test" - @AfterMethod org.apache.brooklyn.feed.jmx.JmxHelperTest.tearDown()
2018-11-15 16:05:43,905 INFO  - JMX tester service stopped (127.0.0.1:11107)
2018-11-15 16:05:43,905 INFO  - TESTNG PASSED CONFIGURATION: "Surefire test" - @AfterMethod org.apache.brooklyn.feed.jmx.JmxHelperTest.tearDown() finished in 3 ms
2018-11-15 16:05:43,906 INFO  - TESTNG INVOKING CONFIGURATION: "Surefire test" - @BeforeMethod org.apache.brooklyn.feed.jmx.JmxHelperTest.setUp()
2018-11-15 16:05:43,911 INFO  - JMX tester service started at URL service:jmx:rmi:///jndi/rmi://127.0.0.1:11092/jmxrmi
2018-11-15 16:05:43,915 INFO  - TESTNG PASSED CONFIGURATION: "Surefire test" - @BeforeMethod org.apache.brooklyn.feed.jmx.JmxHelperTest.setUp() finished in 9 ms
2018-11-15 16:05:43,916 INFO  - TESTNG INVOKING: "Surefire test" - org.apache.brooklyn.feed.jmx.JmxHelperTest.testSetAttribute()
2018-11-15 16:05:43,919 INFO  - TESTNG PASSED: "Surefire test" - org.apache.brooklyn.feed.jmx.JmxHelperTest.testSetAttribute() finished in 3 ms
2018-11-15 16:05:43,919 INFO  - TESTNG INVOKING CONFIGURATION: "Surefire test" - @AfterMethod org.apache.brooklyn.feed.jmx.JmxHelperTest.tearDown()
2018-11-15 16:05:43,920 INFO  - JMX tester service stopped (127.0.0.1:11092)
2018-11-15 16:05:43,920 INFO  - TESTNG PASSED CONFIGURATION: "Surefire test" - @AfterMethod org.apache.brooklyn.feed.jmx.JmxHelperTest.tearDown() finished in 1 ms
2018-11-15 16:05:43,921 INFO  - TESTNG INVOKING CONFIGURATION: "Surefire test" - @BeforeMethod org.apache.brooklyn.feed.jmx.JmxHelperTest.setUp()
2018-11-15 16:05:43,925 INFO  - JMX tester service started at URL service:jmx:rmi:///jndi/rmi://127.0.0.1:11108/jmxrmi
2018-11-15 16:05:43,930 INFO  - TESTNG PASSED CONFIGURATION: "Surefire test" - @BeforeMethod org.apache.brooklyn.feed.jmx.JmxHelperTest.setUp() finished in 9 ms
2018-11-15 16:05:43,930 INFO  - TESTNG INVOKING: "Surefire test" - org.apache.brooklyn.feed.jmx.JmxHelperTest.testSetAttributeUsingObjectNameWildcard()
2018-11-15 16:05:43,932 INFO  - TESTNG PASSED: "Surefire test" - org.apache.brooklyn.feed.jmx.JmxHelperTest.testSetAttributeUsingObjectNameWildcard() finished in 2 ms
2018-11-15 16:05:43,932 INFO  - TESTNG INVOKING CONFIGURATION: "Surefire test" - @AfterMethod org.apache.brooklyn.feed.jmx.JmxHelperTest.tearDown()
2018-11-15 16:05:43,934 INFO  - JMX tester service stopped (127.0.0.1:11108)
2018-11-15 16:05:43,934 INFO  - TESTNG PASSED CONFIGURATION: "Surefire test" - @AfterMethod org.apache.brooklyn.feed.jmx.JmxHelperTest.tearDown() finished in 2 ms
2018-11-15 16:05:43,934 INFO  - TESTNG INVOKING CONFIGURATION: "Surefire test" - @BeforeMethod org.apache.brooklyn.feed.jmx.JmxHelperTest.setUp()
2018-11-15 16:05:43,938 INFO  - JMX tester service started at URL service:jmx:rmi:///jndi/rmi://127.0.0.1:11496/jmxrmi
2018-11-15 16:05:43,941 INFO  - TESTNG PASSED CONFIGURATION: "Surefire test" - @BeforeMethod org.apache.brooklyn.feed.jmx.JmxHelperTest.setUp() finished in 7 ms
2018-11-15 16:05:43,942 INFO  - TESTNG INVOKING: "Surefire test" - org.apache.brooklyn.feed.jmx.JmxHelperTest.testSubscribeToJmxNotificationsDirectlyWithJmxHelper()
2018-11-15 16:05:43,948 INFO  - TESTNG PASSED: "Surefire test" - org.apache.brooklyn.feed.jmx.JmxHelperTest.testSubscribeToJmxNotificationsDirectlyWithJmxHelper() finished in 6 ms
2018-11-15 16:05:43,948 INFO  - TESTNG INVOKING CONFIGURATION: "Surefire test" - @AfterMethod org.apache.brooklyn.feed.jmx.JmxHelperTest.tearDown()
2018-11-15 16:05:43,950 INFO  - JMX tester service stopped (127.0.0.1:11496)
2018-11-15 16:05:43,950 INFO  - TESTNG PASSED CONFIGURATION: "Surefire test" - @AfterMethod org.apache.brooklyn.feed.jmx.JmxHelperTest.tearDown() finished in 2 ms
2018-11-15 16:05:43,950 INFO  - TESTNG INVOKING: "Surefire test" - org.apache.brooklyn.feed.jmx.JmxValueFunctionsTest.testCompositeDataToMap()
2018-11-15 16:05:43,952 INFO  - TESTNG PASSED: "Surefire test" - org.apache.brooklyn.feed.jmx.JmxValueFunctionsTest.testCompositeDataToMap() finished in 2 ms
2018-11-15 16:05:43,952 INFO  - TESTNG INVOKING: "Surefire test" - org.apache.brooklyn.feed.jmx.JmxValueFunctionsTest.testTabularDataToMap()
2018-11-15 16:05:43,952 WARN  - tablularDataToMap has overwritten key key1
2018-11-15 16:05:43,952 WARN  - tablularDataToMap has overwritten key key2
2018-11-15 16:05:43,953 WARN  - tablularDataToMap has overwritten key key1
2018-11-15 16:05:43,953 WARN  - tablularDataToMap has overwritten key key2
2018-11-15 16:05:43,953 INFO  - TESTNG PASSED: "Surefire test" - org.apache.brooklyn.feed.jmx.JmxValueFunctionsTest.testTabularDataToMap() finished in 1 ms
2018-11-15 16:05:43,953 INFO  - TESTNG INVOKING: "Surefire test" - org.apache.brooklyn.feed.jmx.JmxValueFunctionsTest.testTabularDataToMapOfMaps()
2018-11-15 16:05:43,954 INFO  - TESTNG PASSED: "Surefire test" - org.apache.brooklyn.feed.jmx.JmxValueFunctionsTest.testTabularDataToMapOfMaps() finished in 1 ms
2018-11-15 16:05:43,955 INFO  - TESTNG INVOKING CONFIGURATION: "Surefire test" - @BeforeMethod org.apache.brooklyn.feed.jmx.RebindJmxFeedTest.setUp()
2018-11-15 16:05:43,956 INFO  - Added external config supplier named 'brooklyn-demo-sample': org.apache.brooklyn.core.config.external.InPlaceExternalConfigSupplier@62682ece
2018-11-15 16:05:43,963 INFO  - Rebind check: no existing state; will persist new items to /tmp/RebindJmxFeedTest-LV2V
2018-11-15 16:05:43,965 INFO  - No Camp-YAML parser registered for parsing catalog item DSL; skipping DSL-parsing
2018-11-15 16:05:43,981 INFO  - Test class org.apache.brooklyn.feed.jmx.RebindJmxFeedTest persisting to /tmp/RebindJmxFeedTest-LV2V
2018-11-15 16:05:43,981 INFO  - TESTNG PASSED CONFIGURATION: "Surefire test" - @BeforeMethod org.apache.brooklyn.feed.jmx.RebindJmxFeedTest.setUp() finished in 26 ms
2018-11-15 16:05:43,981 INFO  - TESTNG INVOKING: "Surefire test" - org.apache.brooklyn.feed.jmx.RebindJmxFeedTest.testJmxFeedIsPersisted()
2018-11-15 16:05:44,009 INFO  sJzW60Mr-[jslgfepxxz,ch14ajdb1g] Creating PortForwardManager(scope=global)
2018-11-15 16:05:44,018 INFO  - JMX tester service started at URL service:jmx:rmi:///jndi/rmi://localhost:40123/jmxrmi
2018-11-15 16:05:44,058 INFO  - Added external config supplier named 'brooklyn-demo-sample': org.apache.brooklyn.core.config.external.InPlaceExternalConfigSupplier@1ab780fd
2018-11-15 16:05:44,557 INFO  - Rebinding app, using mementoDir /tmp/RebindJmxFeedTest-LV2V; object store null
2018-11-15 16:05:44,577 INFO  - Rebinding from /tmp/RebindJmxFeedTest-LV2V for master lwGUI6Oi...
2018-11-15 16:05:44,581 INFO  - No Camp-YAML parser registered for parsing catalog item DSL; skipping DSL-parsing
2018-11-15 16:05:44,630 INFO  - Rebind complete (MASTER) in 71ms: 1 app, 2 entities, 1 location, 0 policies, 2 enrichers, 1 feed, 0 catalog items, 0 catalog bundles
2018-11-15 16:05:44,781 INFO  - Back-up of persisted state created on promotion, in /root/.brooklyn/brooklyn-persisted-state/backups/2018-11-15-1605-lwGUI6Oi-promotion-M1hd
2018-11-15 16:05:44,783 INFO  - TESTNG PASSED: "Surefire test" - org.apache.brooklyn.feed.jmx.RebindJmxFeedTest.testJmxFeedIsPersisted() finished in 802 ms
2018-11-15 16:05:44,783 INFO  - TESTNG INVOKING CONFIGURATION: "Surefire test" - @AfterMethod org.apache.brooklyn.feed.jmx.RebindJmxFeedTest.tearDown()
2018-11-15 16:05:44,785 INFO  - JMX tester service stopped (localhost:40123)
2018-11-15 16:05:44,802 INFO  - TESTNG PASSED CONFIGURATION: "Surefire test" - @AfterMethod org.apache.brooklyn.feed.jmx.RebindJmxFeedTest.tearDown() finished in 19 ms
2018-11-15 16:05:44,802 INFO  - TESTNG INVOKING CONFIGURATION: "Surefire test" - @BeforeMethod org.apache.brooklyn.feed.jmx.RebindJmxFeedTest.setUp()
2018-11-15 16:05:44,803 INFO  - Added external config supplier named 'brooklyn-demo-sample': org.apache.brooklyn.core.config.external.InPlaceExternalConfigSupplier@4ea4290f
2018-11-15 16:05:44,809 INFO  - Rebind check: no existing state; will persist new items to /tmp/RebindJmxFeedTest-NFzM
2018-11-15 16:05:44,811 INFO  - No Camp-YAML parser registered for parsing catalog item DSL; skipping DSL-parsing
2018-11-15 16:05:44,825 INFO  - Test class org.apache.brooklyn.feed.jmx.RebindJmxFeedTest persisting to /tmp/RebindJmxFeedTest-NFzM
2018-11-15 16:05:44,826 INFO  - TESTNG PASSED CONFIGURATION: "Surefire test" - @BeforeMethod org.apache.brooklyn.feed.jmx.RebindJmxFeedTest.setUp() finished in 24 ms
2018-11-15 16:05:44,826 INFO  - TESTNG INVOKING: "Surefire test" - org.apache.brooklyn.feed.jmx.RebindJmxFeedTest.testJmxFeedIsPersistedWithPreCreatedJmxHelper()
2018-11-15 16:05:44,843 INFO  oqet5sr8-[dhidd6a232,gro3yk9hqt] Creating PortForwardManager(scope=global)
2018-11-15 16:05:44,852 INFO  - JMX tester service started at URL service:jmx:rmi:///jndi/rmi://localhost:40124/jmxrmi
2018-11-15 16:05:44,982 INFO  - Added external config supplier named 'brooklyn-demo-sample': org.apache.brooklyn.core.config.external.InPlaceExternalConfigSupplier@7053a864
2018-11-15 16:05:45,001 INFO  - Rebinding app, using mementoDir /tmp/RebindJmxFeedTest-NFzM; object store null
2018-11-15 16:05:45,017 INFO  - Rebinding from /tmp/RebindJmxFeedTest-NFzM for master nlnoFX4z...
2018-11-15 16:05:45,019 INFO  - No Camp-YAML parser registered for parsing catalog item DSL; skipping DSL-parsing
2018-11-15 16:05:45,049 INFO  - Rebind complete (MASTER) in 47ms: 1 app, 2 entities, 1 location, 0 policies, 2 enrichers, 1 feed, 0 catalog items, 0 catalog bundles
2018-11-15 16:05:45,185 INFO  - Back-up of persisted state created on promotion, in /root/.brooklyn/brooklyn-persisted-state/backups/2018-11-15-1605-nlnoFX4z-promotion-grnT
2018-11-15 16:05:45,212 INFO  - TESTNG PASSED: "Surefire test" - org.apache.brooklyn.feed.jmx.RebindJmxFeedTest.testJmxFeedIsPersistedWithPreCreatedJmxHelper() finished in 385 ms
2018-11-15 16:05:45,212 INFO  - TESTNG INVOKING CONFIGURATION: "Surefire test" - @AfterMethod org.apache.brooklyn.feed.jmx.RebindJmxFeedTest.tearDown()
2018-11-15 16:05:45,213 INFO  - JMX tester service stopped (localhost:40124)
2018-11-15 16:05:45,227 INFO  - TESTNG PASSED CONFIGURATION: "Surefire test" - @AfterMethod org.apache.brooklyn.feed.jmx.RebindJmxFeedTest.tearDown() finished in 15 ms
2018-11-15 16:05:45,302 INFO  - TESTNG 
===============================================
    Surefire test
    Tests run: 234, Failures: 1, Skips: 0
===============================================
[GC (Allocation Failure)  249644K->74007K(746496K), 0.0213412 secs]
Tests run: 234, Failures: 1, Errors: 0, Skipped: 0, Time elapsed: 83.103 sec <<< FAILURE! - in TestSuite
testStopDuringProvisionWaitsForCompletion(org.apache.brooklyn.entity.software.base.SoftwareProcessStopsDuringStartTest)  Time elapsed: 0.142 sec  <<< FAILURE!
java.lang.AssertionError: lists don't have the same size expected [2] but found [1]
	at org.apache.brooklyn.entity.software.base.SoftwareProcessStopsDuringStartTest.testStopDuringProvisionWaitsForCompletion(SoftwareProcessStopsDuringStartTest.java:184)


Results :

Failed tests: 
  SoftwareProcessStopsDuringStartTest.testStopDuringProvisionWaitsForCompletion:184 lists don't have the same size expected [2] but found [1]

Tests run: 234, Failures: 1, Errors: 0, Skipped: 0

[INFO] ------------------------------------------------------------------------
[INFO] Reactor Summary:
[INFO] 
[INFO] Brooklyn Server Root ............................... SUCCESS [  4.288 s]
[INFO] Brooklyn Parent Project ............................ SUCCESS [  5.057 s]
[INFO] Brooklyn Test Support Utilities .................... SUCCESS [  8.484 s]
[INFO] Brooklyn Logback Includable Configuration .......... SUCCESS [  0.427 s]
[INFO] Brooklyn Common Utilities .......................... SUCCESS [ 29.132 s]
[INFO] Brooklyn API ....................................... SUCCESS [  3.575 s]
[INFO] CAMP Server Parent Project ......................... SUCCESS [  0.125 s]
[INFO] CAMP Base .......................................... SUCCESS [  3.926 s]
[INFO] Brooklyn Test Support .............................. SUCCESS [  2.474 s]
[INFO] Brooklyn REST Swagger Apidoc Utilities ............. SUCCESS [ 14.001 s]
[INFO] Brooklyn Logback Configuration ..................... SUCCESS [  0.226 s]
[INFO] CAMP Server ........................................ SUCCESS [ 13.739 s]
[INFO] Brooklyn Felix Runtime ............................. SUCCESS [  3.491 s]
[INFO] Brooklyn Groovy Utilities .......................... SUCCESS [  2.081 s]
[INFO] Brooklyn Core ...................................... SUCCESS [04:23 min]
[INFO] Brooklyn Policies .................................. SUCCESS [ 34.277 s]
[INFO] Brooklyn WinRM Software Entities ................... SUCCESS [ 20.094 s]
[INFO] Brooklyn Secure JMXMP Agent ........................ SUCCESS [  7.735 s]
[INFO] Brooklyn JMX RMI Agent ............................. SUCCESS [  0.445 s]
[INFO] Brooklyn Jclouds Location Targets .................. SUCCESS [01:06 min]
[INFO] Brooklyn Software Base ............................. FAILURE [01:32 min]
[INFO] Brooklyn CAMP ...................................... SKIPPED
[INFO] Brooklyn Launcher Common ........................... SKIPPED
[INFO] Brooklyn REST API .................................. SKIPPED
[INFO] Brooklyn REST Resources ............................ SKIPPED
[INFO] Brooklyn REST Server ............................... SKIPPED
[INFO] Brooklyn Launcher .................................. SKIPPED
[INFO] Brooklyn Container Location Targets ................ SKIPPED
[INFO] Brooklyn Command Line Interface .................... SKIPPED
[INFO] Brooklyn Test Framework ............................ SKIPPED
[INFO] Brooklyn OSGi init ................................. SKIPPED
[INFO] Brooklyn OSGi start ................................ SKIPPED
[INFO] Brooklyn Karaf ..................................... SKIPPED
[INFO] Jetty config fragment .............................. SKIPPED
[INFO] Apache Http Component extension .................... SKIPPED
[INFO] Brooklyn Karaf Features ............................ SKIPPED
[INFO] Brooklyn Karaf Shell Commands ...................... SKIPPED
[INFO] Brooklyn UI :: Parent .............................. SKIPPED
[INFO] Brooklyn UI :: Modularity Server (parent) .......... SKIPPED
[INFO] Brooklyn UI :: Modularity Server :: UI Module API .. SKIPPED
[INFO] Brooklyn UI :: Modularity Server :: UI Module Registry SKIPPED
[INFO] Brooklyn UI :: Modularity Server :: UI Proxy ....... SKIPPED
[INFO] Brooklyn UI :: Modularity Server :: UI Metadata Registry SKIPPED
[INFO] Brooklyn UI :: Modularity Server :: External UI Modules Registration Hooks SKIPPED
[INFO] Brooklyn UI :: Modularity Server :: Features ....... SKIPPED
[INFO] Brooklyn UI :: Modules (parent) .................... SKIPPED
[INFO] Brooklyn UI :: Modules - UI Utils .................. SKIPPED
[INFO] Brooklyn UI :: Modules - Home ...................... SKIPPED
[INFO] Brooklyn UI :: Modules - App inspector ............. SKIPPED
[INFO] Brooklyn UI :: Modules - Blueprint composer ........ SKIPPED
[INFO] Brooklyn UI :: Modules - Blueprint importer ........ SKIPPED
[INFO] Brooklyn UI :: Modules - Catalog ................... SKIPPED
[INFO] Brooklyn UI :: Modules - Location manager .......... SKIPPED
[INFO] Brooklyn UI :: Modules - REST API Docs ............. SKIPPED
[INFO] Brooklyn UI :: Modules - Groovy console ............ SKIPPED
[INFO] Brooklyn UI :: Modules - Logout .................... SKIPPED
[INFO] Brooklyn UI :: Modules - Features .................. SKIPPED
[INFO] Brooklyn UI :: Features ............................ SKIPPED
[INFO] Brooklyn Library Root .............................. SKIPPED
[INFO] Brooklyn CM Chef ................................... SKIPPED
[INFO] Brooklyn CM SaltStack .............................. SKIPPED
[INFO] Brooklyn CM Ansible ................................ SKIPPED
[INFO] Brooklyn CM Integration Root ....................... SKIPPED
[INFO] Brooklyn Network Software Entities ................. SKIPPED
[INFO] Brooklyn OSGi Software Entities .................... SKIPPED
[INFO] Brooklyn Database Software Entities ................ SKIPPED
[INFO] Brooklyn Web App Software Entities ................. SKIPPED
[INFO] Brooklyn Messaging Software Entities ............... SKIPPED
[INFO] Brooklyn NoSQL Data Store Software Entities ........ SKIPPED
[INFO] Brooklyn Monitoring Software Entities .............. SKIPPED
[INFO] Brooklyn Web App Software Entities ................. SKIPPED
[INFO] Brooklyn QA ........................................ SKIPPED
[INFO] Brooklyn Examples Aggregator Project ............... SKIPPED
[INFO] Brooklyn Examples Aggregator Project - Webapps ..... SKIPPED
[INFO] hello-world-webapp Maven Webapp .................... SKIPPED
[INFO] hello-world-sql-webapp Maven Webapp ................ SKIPPED
[INFO] Brooklyn Simple Web Cluster Example ................ SKIPPED
[INFO] Brooklyn Library Karaf integration ................. SKIPPED
[INFO] Brooklyn Library Catalog ........................... SKIPPED
[INFO] Brooklyn Library Karaf Features .................... SKIPPED
[INFO] Brooklyn Client .................................... SKIPPED
[INFO] Brooklyn Client Command Line Interface ............. SKIPPED
[INFO] Brooklyn REST java Client .......................... SKIPPED
[INFO] Brooklyn Downstream Project Parent ................. SKIPPED
[INFO] Brooklyn Dist Root ................................. SKIPPED
[INFO] Brooklyn All Things ................................ SKIPPED
[INFO] Brooklyn Distribution .............................. SKIPPED
[INFO] Brooklyn Karaf Distribution Parent ................. SKIPPED
[INFO] Brooklyn Karaf Server Configuration ................ SKIPPED
[INFO] Brooklyn Dist Karaf Features ....................... SKIPPED
[INFO] Brooklyn Karaf Distribution ........................ SKIPPED
[INFO] Brooklyn Karaf pax-exam itest ...................... SKIPPED
[INFO] Brooklyn Vagrant Getting Started Environment ....... SKIPPED
[INFO] Brooklyn Quick-Start Project Archetype ............. SKIPPED
[INFO] Brooklyn Shared Package Files ...................... SKIPPED
[INFO] Brooklyn RPM Package ............................... SKIPPED
[INFO] Brooklyn DEB Package ............................... SKIPPED
[INFO] Brooklyn Root 1.0.0-SNAPSHOT ....................... SKIPPED
[INFO] ------------------------------------------------------------------------
[INFO] BUILD FAILURE
[INFO] ------------------------------------------------------------------------
[INFO] Total time: 09:59 min
[INFO] Finished at: 2018-11-15T16:05:46Z
[INFO] ------------------------------------------------------------------------
[ERROR] Failed to execute goal org.apache.maven.plugins:maven-surefire-plugin:2.19.1:test (default-test) on project brooklyn-software-base: There are test failures.
[ERROR] 
[ERROR] Please refer to /usr/build/brooklyn-server/software/base/target/surefire-reports for the individual test results.
[ERROR] -> [Help 1]
[ERROR] 
[ERROR] To see the full stack trace of the errors, re-run Maven with the -e switch.
[ERROR] Re-run Maven using the -X switch to enable full debug logging.
[ERROR] 
[ERROR] For more information about the errors and possible solutions, please read the following articles:
[ERROR] [Help 1] http://cwiki.apache.org/confluence/display/MAVEN/MojoFailureException
[ERROR] 
[ERROR] After correcting the problems, you can resume the build with the command
[ERROR]   mvn <goals> -rf :brooklyn-software-base
Build step 'Execute shell' marked build as failure
Recording test results
TestNG Reports Processing: START
Looking for TestNG results report in workspace using pattern: **/testng-results.xml
Saving reports...
Processing '/x1/jenkins/jenkins-home/jobs/brooklyn-master-build-docker/builds/989/testng/testng-results-1.xml'
Processing '/x1/jenkins/jenkins-home/jobs/brooklyn-master-build-docker/builds/989/testng/testng-results-10.xml'
Processing '/x1/jenkins/jenkins-home/jobs/brooklyn-master-build-docker/builds/989/testng/testng-results-11.xml'
Processing '/x1/jenkins/jenkins-home/jobs/brooklyn-master-build-docker/builds/989/testng/testng-results-2.xml'
Processing '/x1/jenkins/jenkins-home/jobs/brooklyn-master-build-docker/builds/989/testng/testng-results-3.xml'
Processing '/x1/jenkins/jenkins-home/jobs/brooklyn-master-build-docker/builds/989/testng/testng-results-4.xml'
Processing '/x1/jenkins/jenkins-home/jobs/brooklyn-master-build-docker/builds/989/testng/testng-results-5.xml'
Processing '/x1/jenkins/jenkins-home/jobs/brooklyn-master-build-docker/builds/989/testng/testng-results-6.xml'
Processing '/x1/jenkins/jenkins-home/jobs/brooklyn-master-build-docker/builds/989/testng/testng-results-7.xml'
Processing '/x1/jenkins/jenkins-home/jobs/brooklyn-master-build-docker/builds/989/testng/testng-results-8.xml'
Processing '/x1/jenkins/jenkins-home/jobs/brooklyn-master-build-docker/builds/989/testng/testng-results-9.xml'
Processing '/x1/jenkins/jenkins-home/jobs/brooklyn-master-build-docker/builds/989/testng/testng-results.xml'
0.028185% of tests failed, which exceeded threshold of 0%. Marking build as UNSTABLE
TestNG Reports Processing: FINISH