osdir.com

[Date Prev][Date Next][Thread Prev][Thread Next][Date Index][Thread Index]

Build failed in Jenkins: brooklyn-dist-master-docker #125


See <https://builds.apache.org/job/brooklyn-dist-master-docker/125/display/redirect>

------------------------------------------
[...truncated 4.72 MB...]
[INFO]               enricher.sourceSensor[ConfigKey:org.apache.brooklyn.api.sensor.Sensor<?>] = Sensor: service.notUp.indicators (java.util.Map)
[INFO]               enricher.suppressDuplicates[ConfigKey:java.lang.Boolean] = true
[INFO]               enricher.targetSensor[ConfigKey:org.apache.brooklyn.api.sensor.Sensor<?>] = Sensor: service.isUp (java.lang.Boolean)
[INFO]               enricher.transformation[ConfigKey:com.google.common.base.Function<?, ?>] = if[{Predicates.not(Predicates.isNull())=forPredicate(Predicates.equalTo(0)(sizeFunction(keys)))}]-else[UNCHANGED]
[INFO]           ComputeServiceState{uniqueTag=service.state.actual, running=true, entity=TestEffectorImpl{id=v82c4gpdl4}, id=cupps6mdbb}
[INFO]     TestSensorImpl{id=ia9f7zea2p} ia9f7zea2p
[INFO]         displayName = TestSensor:ia9f
[INFO]         locations = []
[INFO]         assert = {equalTo=myEffector(myVal)}
[INFO]         sensor = lastCall
[INFO]         targetId = sample
[INFO]         application.id: pd77aziy4m
[INFO]         entity.id: ia9f7zea2p
[INFO]         service.isUp: true
[INFO]         service.state: running
[INFO]         service.state.expected: running @ 1542210697587 / Wed Nov 14 15:51:37 GMT 2018
[INFO]         target: MySampleImpl{id=mh5rinr91r}
[INFO]         test.target.entity.id: mh5rinr91r
[INFO]         test.target.entity.name: MySample:mh5r
[INFO]         test.target.entity.type: com.acme.sample.brooklyn.MySample
[INFO]         Enrichers:
[INFO]           Transformer{uniqueTag=service.isUp if no service.notUp.indicators, running=true, entity=TestSensorImpl{id=ia9f7zea2p}, id=r834qkobvz}
[INFO]               enricher.sourceSensor[ConfigKey:org.apache.brooklyn.api.sensor.Sensor<?>] = Sensor: service.notUp.indicators (java.util.Map)
[INFO]               enricher.suppressDuplicates[ConfigKey:java.lang.Boolean] = true
[INFO]               enricher.targetSensor[ConfigKey:org.apache.brooklyn.api.sensor.Sensor<?>] = Sensor: service.isUp (java.lang.Boolean)
[INFO]               enricher.transformation[ConfigKey:com.google.common.base.Function<?, ?>] = if[{Predicates.not(Predicates.isNull())=forPredicate(Predicates.equalTo(0)(sizeFunction(keys)))}]-else[UNCHANGED]
[INFO]           ComputeServiceState{uniqueTag=service.state.actual, running=true, entity=TestSensorImpl{id=ia9f7zea2p}, id=unpllh7tke}
[INFO]     TestEffectorImpl{id=ab09wnq5bl} ab09wnq5bl
[INFO]         displayName = TestEffector:ab09
[INFO]         locations = []
[INFO]         effector = stop
[INFO]         targetId = sample
[INFO]         application.id: pd77aziy4m
[INFO]         entity.id: ab09wnq5bl
[INFO]         service.isUp: true
[INFO]         service.state: running
[INFO]         service.state.expected: running @ 1542210697606 / Wed Nov 14 15:51:37 GMT 2018
[INFO]         target: MySampleImpl{id=mh5rinr91r}
[INFO]         test.target.entity.id: mh5rinr91r
[INFO]         test.target.entity.name: MySample:mh5r
[INFO]         test.target.entity.type: com.acme.sample.brooklyn.MySample
[INFO]         Enrichers:
[INFO]           Transformer{uniqueTag=service.isUp if no service.notUp.indicators, running=true, entity=TestEffectorImpl{id=ab09wnq5bl}, id=vvm7d1tw13}
[INFO]               enricher.sourceSensor[ConfigKey:org.apache.brooklyn.api.sensor.Sensor<?>] = Sensor: service.notUp.indicators (java.util.Map)
[INFO]               enricher.suppressDuplicates[ConfigKey:java.lang.Boolean] = true
[INFO]               enricher.targetSensor[ConfigKey:org.apache.brooklyn.api.sensor.Sensor<?>] = Sensor: service.isUp (java.lang.Boolean)
[INFO]               enricher.transformation[ConfigKey:com.google.common.base.Function<?, ?>] = if[{Predicates.not(Predicates.isNull())=forPredicate(Predicates.equalTo(0)(sizeFunction(keys)))}]-else[UNCHANGED]
[INFO]           ComputeServiceState{uniqueTag=service.state.actual, running=true, entity=TestEffectorImpl{id=ab09wnq5bl}, id=zx1g0oc8sq}
[INFO]     TestSensorImpl{id=d17sn2ssyp} d17sn2ssyp
[INFO]         displayName = TestSensor:d17s
[INFO]         locations = []
[INFO]         assert = {equalTo=false}
[INFO]         sensor = service.isUp
[INFO]         targetId = sample
[INFO]         timeout = 10s
[INFO]         application.id: pd77aziy4m
[INFO]         entity.id: d17sn2ssyp
[INFO]         service.isUp: true
[INFO]         service.state: running
[INFO]         service.state.expected: running @ 1542210697615 / Wed Nov 14 15:51:37 GMT 2018
[INFO]         target: MySampleImpl{id=mh5rinr91r}
[INFO]         test.target.entity.id: mh5rinr91r
[INFO]         test.target.entity.name: MySample:mh5r
[INFO]         test.target.entity.type: com.acme.sample.brooklyn.MySample
[INFO]         Enrichers:
[INFO]           Transformer{uniqueTag=service.isUp if no service.notUp.indicators, running=true, entity=TestSensorImpl{id=d17sn2ssyp}, id=l5ri7ouus6}
[INFO]               enricher.sourceSensor[ConfigKey:org.apache.brooklyn.api.sensor.Sensor<?>] = Sensor: service.notUp.indicators (java.util.Map)
[INFO]               enricher.suppressDuplicates[ConfigKey:java.lang.Boolean] = true
[INFO]               enricher.targetSensor[ConfigKey:org.apache.brooklyn.api.sensor.Sensor<?>] = Sensor: service.isUp (java.lang.Boolean)
[INFO]               enricher.transformation[ConfigKey:com.google.common.base.Function<?, ?>] = if[{Predicates.not(Predicates.isNull())=forPredicate(Predicates.equalTo(0)(sizeFunction(keys)))}]-else[UNCHANGED]
[INFO]           ComputeServiceState{uniqueTag=service.state.actual, running=true, entity=TestSensorImpl{id=d17sn2ssyp}, id=bzyw9qg1bt}
[INFO] 2018-11-14 15:51:37,677 INFO  - TESTNG PASSED: "Surefire test" - com.acme.sample.brooklyn.MySampleYamlTest.testUsingTestFramework() finished in 503 ms
[INFO] 2018-11-14 15:51:37,678 INFO  - TESTNG INVOKING CONFIGURATION: "Surefire test" - @AfterMethod org.apache.brooklyn.camp.brooklyn.AbstractYamlTest.tearDown()
[INFO] 2018-11-14 15:51:37,689 INFO  JMW8myea-[pd77aziy4m] Stopping application BasicApplicationImpl{id=pd77aziy4m}
[INFO] 2018-11-14 15:51:37,694 INFO  A0dIeFGz-[pd77aziy4m,mh5rinr91r] MySampleImpl.stop()
[INFO] 2018-11-14 15:51:37,741 INFO  JMW8myea-[pd77aziy4m] Stopped application BasicApplicationImpl{id=pd77aziy4m}
[INFO] 2018-11-14 15:51:37,762 INFO  - TESTNG PASSED CONFIGURATION: "Surefire test" - @AfterMethod org.apache.brooklyn.camp.brooklyn.AbstractYamlTest.tearDown() finished in 84 ms
[INFO] 2018-11-14 15:51:37,764 INFO  - TESTNG INVOKING CONFIGURATION: "Surefire test" - @BeforeMethod org.apache.brooklyn.core.test.BrooklynAppUnitTestSupport.setUp()
[INFO] 2018-11-14 15:51:37,765 INFO  - Added external config supplier named 'brooklyn-demo-sample': org.apache.brooklyn.core.config.external.InPlaceExternalConfigSupplier@581d969c
[INFO] 2018-11-14 15:51:37,833 INFO  - TESTNG PASSED CONFIGURATION: "Surefire test" - @BeforeMethod org.apache.brooklyn.core.test.BrooklynAppUnitTestSupport.setUp() finished in 69 ms
[INFO] 2018-11-14 15:51:37,833 INFO  - TESTNG INVOKING: "Surefire test" - com.acme.sample.brooklyn.MySampleTest.testEntity()
[INFO] 2018-11-14 15:51:37,861 INFO  - MySampleImpl.init() with config myConfVal
[INFO] 2018-11-14 15:51:37,909 INFO  zVyL6qfv-[s4wttaipc2,qnb1zvp1e2] MySampleImpl.start([])
[INFO] 2018-11-14 15:51:37,910 WARN  zVyL6qfv-[s4wttaipc2,qnb1zvp1e2] Setting MySampleImpl{id=qnb1zvp1e2} on-fire due to problems when expected running, up=false, not-up-indicators: {}
[INFO] 2018-11-14 15:51:37,952 INFO  Z1nvVEHg-[s4wttaipc2,qnb1zvp1e2] MySampleImpl.myEffector(myArgVal)
[INFO] 2018-11-14 15:51:37,962 INFO  vSC7Xiz1-[s4wttaipc2,qnb1zvp1e2] MySampleImpl.stop()
[INFO] 2018-11-14 15:52:07,974 INFO  - succeedsEventually exceeded max attempts or timeout - 75 attempts lasting 30001 ms, for RunnableAdapter(org.apache.brooklyn.core.entity.EntityAsserts$1@33aa93c)
[INFO] 2018-11-14 15:52:07,974 INFO  - failed succeeds-eventually, 75 attempts, 30001ms elapsed (rethrowing): java.lang.AssertionError: entity=MySampleImpl{id=qnb1zvp1e2}; attribute=Sensor: service.isUp (java.lang.Boolean) expected [false] but found [true]
[INFO] 2018-11-14 15:52:07,980 INFO  - TESTNG FAILED: "Surefire test" - com.acme.sample.brooklyn.MySampleTest.testEntity() finished in 30143 ms
[INFO] java.lang.AssertionError: failed succeeds-eventually, 75 attempts, 30002ms elapsed: AssertionError: entity=MySampleImpl{id=qnb1zvp1e2}; attribute=Sensor: service.isUp (java.lang.Boolean) expected [false] but found [true]
[INFO] 	at org.apache.brooklyn.test.Asserts.succeedsEventually(Asserts.java:1009)
[INFO] 	at org.apache.brooklyn.test.Asserts.succeedsEventually(Asserts.java:892)
[INFO] 	at org.apache.brooklyn.core.entity.EntityAsserts.assertAttributeEqualsEventually(EntityAsserts.java:71)
[INFO] 	at org.apache.brooklyn.core.entity.EntityAsserts.assertAttributeEqualsEventually(EntityAsserts.java:66)
[INFO] 	at com.acme.sample.brooklyn.MySampleTest.testEntity(MySampleTest.java:33)
[INFO] Caused by: java.lang.AssertionError: entity=MySampleImpl{id=qnb1zvp1e2}; attribute=Sensor: service.isUp (java.lang.Boolean) expected [false] but found [true]
[INFO] 	at org.apache.brooklyn.test.Asserts.fail(Asserts.java:755)
[INFO] 	at org.apache.brooklyn.test.Asserts.failNotEquals(Asserts.java:145)
[INFO] 	at org.apache.brooklyn.test.Asserts.assertEquals(Asserts.java:467)
[INFO] 	at org.apache.brooklyn.core.entity.EntityAsserts.assertAttributeEquals(EntityAsserts.java:58)
[INFO] 	at org.apache.brooklyn.core.entity.EntityAsserts$1.run(EntityAsserts.java:74)
[INFO] 	at org.apache.brooklyn.test.Asserts$RunnableAdapter.call(Asserts.java:1367)
[INFO] 	at org.apache.brooklyn.test.Asserts.succeedsEventually(Asserts.java:970)
[INFO] 	... 33 more
[INFO] 2018-11-14 15:52:07,993 INFO  - TESTNG INVOKING CONFIGURATION: "Surefire test" - @AfterMethod org.apache.brooklyn.core.test.BrooklynMgmtUnitTestSupport.tearDown()
[INFO] 2018-11-14 15:52:08,002 INFO  - TESTNG PASSED CONFIGURATION: "Surefire test" - @AfterMethod org.apache.brooklyn.core.test.BrooklynMgmtUnitTestSupport.tearDown() finished in 9 ms
[INFO] 2018-11-14 15:52:08,021 INFO  - TESTNG 
[INFO] ===============================================
[INFO]     Surefire test
[INFO]     Tests run: 3, Failures: 1, Skips: 0
[INFO] ===============================================
[INFO] Tests run: 3, Failures: 1, Errors: 0, Skipped: 0, Time elapsed: 33.971 sec <<< FAILURE! - in TestSuite
[INFO] testEntity(com.acme.sample.brooklyn.MySampleTest)  Time elapsed: 30.154 sec  <<< FAILURE!
[INFO] java.lang.AssertionError: failed succeeds-eventually, 75 attempts, 30002ms elapsed: AssertionError: entity=MySampleImpl{id=qnb1zvp1e2}; attribute=Sensor: service.isUp (java.lang.Boolean) expected [false] but found [true]
[INFO] 	at org.apache.brooklyn.test.Asserts.fail(Asserts.java:755)
[INFO] 	at org.apache.brooklyn.test.Asserts.failNotEquals(Asserts.java:145)
[INFO] 	at org.apache.brooklyn.test.Asserts.assertEquals(Asserts.java:467)
[INFO] 	at org.apache.brooklyn.core.entity.EntityAsserts.assertAttributeEquals(EntityAsserts.java:58)
[INFO] 	at org.apache.brooklyn.core.entity.EntityAsserts$1.run(EntityAsserts.java:74)
[INFO] 	at org.apache.brooklyn.test.Asserts$RunnableAdapter.call(Asserts.java:1367)
[INFO] 	at org.apache.brooklyn.test.Asserts.succeedsEventually(Asserts.java:970)
[INFO] 	at org.apache.brooklyn.test.Asserts.succeedsEventually(Asserts.java:892)
[INFO] 	at org.apache.brooklyn.core.entity.EntityAsserts.assertAttributeEqualsEventually(EntityAsserts.java:71)
[INFO] 	at org.apache.brooklyn.core.entity.EntityAsserts.assertAttributeEqualsEventually(EntityAsserts.java:66)
[INFO] 	at com.acme.sample.brooklyn.MySampleTest.testEntity(MySampleTest.java:33)
[INFO] 
[INFO] 
[INFO] Results :
[INFO] 
[INFO] Failed tests: 
[INFO]   MySampleTest.testEntity:33 failed succeeds-eventually, 75 attempts, 30002ms elapsed: AssertionError: entity=MySampleImpl{id=qnb1zvp1e2}; attribute=Sensor: service.isUp (java.lang.Boolean) expected [false] but found [true]
[INFO] 
[INFO] Tests run: 3, Failures: 1, Errors: 0, Skipped: 0
[INFO] 
[INFO] [INFO] ------------------------------------------------------------------------
[INFO] [INFO] BUILD FAILURE
[INFO] [INFO] ------------------------------------------------------------------------
[INFO] [INFO] Total time: 01:22 min
[INFO] [INFO] Finished at: 2018-11-14T15:52:08Z
[INFO] [INFO] Final Memory: 56M/556M
[INFO] [INFO] ------------------------------------------------------------------------
[INFO] [ERROR] Failed to execute goal org.apache.maven.plugins:maven-surefire-plugin:2.18.1:test (default-test) on project brooklyn-sample: There are test failures.
[INFO] [ERROR] 
[INFO] [ERROR] Please refer to /usr/build/archetypes/quickstart/target/test-classes/projects/integration-test-1/project/brooklyn-sample/target/surefire-reports for the individual test results.
[INFO] [ERROR] -> [Help 1]
[INFO] org.apache.maven.lifecycle.LifecycleExecutionException: Failed to execute goal org.apache.maven.plugins:maven-surefire-plugin:2.18.1:test (default-test) on project brooklyn-sample: There are test failures.
[INFO] 
[INFO] Please refer to /usr/build/archetypes/quickstart/target/test-classes/projects/integration-test-1/project/brooklyn-sample/target/surefire-reports for the individual test results.
[INFO]     at org.apache.maven.lifecycle.internal.MojoExecutor.execute (MojoExecutor.java:213)
[INFO]     at org.apache.maven.lifecycle.internal.MojoExecutor.execute (MojoExecutor.java:154)
[INFO]     at org.apache.maven.lifecycle.internal.MojoExecutor.execute (MojoExecutor.java:146)
[INFO]     at org.apache.maven.lifecycle.internal.LifecycleModuleBuilder.buildProject (LifecycleModuleBuilder.java:117)
[INFO]     at org.apache.maven.lifecycle.internal.LifecycleModuleBuilder.buildProject (LifecycleModuleBuilder.java:81)
[INFO]     at org.apache.maven.lifecycle.internal.builder.singlethreaded.SingleThreadedBuilder.build (SingleThreadedBuilder.java:51)
[INFO]     at org.apache.maven.lifecycle.internal.LifecycleStarter.execute (LifecycleStarter.java:128)
[INFO]     at org.apache.maven.DefaultMaven.doExecute (DefaultMaven.java:309)
[INFO]     at org.apache.maven.DefaultMaven.doExecute (DefaultMaven.java:194)
[INFO]     at org.apache.maven.DefaultMaven.execute (DefaultMaven.java:107)
[INFO]     at org.apache.maven.cli.MavenCli.execute (MavenCli.java:955)
[INFO]     at org.apache.maven.cli.MavenCli.doMain (MavenCli.java:290)
[INFO]     at org.apache.maven.cli.MavenCli.main (MavenCli.java:194)
[INFO]     at sun.reflect.NativeMethodAccessorImpl.invoke0 (Native Method)
[INFO]     at sun.reflect.NativeMethodAccessorImpl.invoke (NativeMethodAccessorImpl.java:62)
[INFO]     at sun.reflect.DelegatingMethodAccessorImpl.invoke (DelegatingMethodAccessorImpl.java:43)
[INFO]     at java.lang.reflect.Method.invoke (Method.java:498)
[INFO]     at org.codehaus.plexus.classworlds.launcher.Launcher.launchEnhanced (Launcher.java:289)
[INFO]     at org.codehaus.plexus.classworlds.launcher.Launcher.launch (Launcher.java:229)
[INFO]     at org.codehaus.plexus.classworlds.launcher.Launcher.mainWithExitCode (Launcher.java:415)
[INFO]     at org.codehaus.plexus.classworlds.launcher.Launcher.main (Launcher.java:356)
[INFO] Caused by: org.apache.maven.plugin.MojoFailureException: There are test failures.
[INFO] 
[INFO] Please refer to /usr/build/archetypes/quickstart/target/test-classes/projects/integration-test-1/project/brooklyn-sample/target/surefire-reports for the individual test results.
[INFO]     at org.apache.maven.plugin.surefire.SurefireHelper.reportExecution (SurefireHelper.java:82)
[INFO]     at org.apache.maven.plugin.surefire.SurefirePlugin.handleSummary (SurefirePlugin.java:254)
[INFO]     at org.apache.maven.plugin.surefire.AbstractSurefireMojo.executeAfterPreconditionsChecked (AbstractSurefireMojo.java:854)
[INFO]     at org.apache.maven.plugin.surefire.AbstractSurefireMojo.execute (AbstractSurefireMojo.java:722)
[INFO]     at org.apache.maven.plugin.DefaultBuildPluginManager.executeMojo (DefaultBuildPluginManager.java:134)
[INFO]     at org.apache.maven.lifecycle.internal.MojoExecutor.execute (MojoExecutor.java:208)
[INFO]     at org.apache.maven.lifecycle.internal.MojoExecutor.execute (MojoExecutor.java:154)
[INFO]     at org.apache.maven.lifecycle.internal.MojoExecutor.execute (MojoExecutor.java:146)
[INFO]     at org.apache.maven.lifecycle.internal.LifecycleModuleBuilder.buildProject (LifecycleModuleBuilder.java:117)
[INFO]     at org.apache.maven.lifecycle.internal.LifecycleModuleBuilder.buildProject (LifecycleModuleBuilder.java:81)
[INFO]     at org.apache.maven.lifecycle.internal.builder.singlethreaded.SingleThreadedBuilder.build (SingleThreadedBuilder.java:51)
[INFO]     at org.apache.maven.lifecycle.internal.LifecycleStarter.execute (LifecycleStarter.java:128)
[INFO]     at org.apache.maven.DefaultMaven.doExecute (DefaultMaven.java:309)
[INFO]     at org.apache.maven.DefaultMaven.doExecute (DefaultMaven.java:194)
[INFO]     at org.apache.maven.DefaultMaven.execute (DefaultMaven.java:107)
[INFO]     at org.apache.maven.cli.MavenCli.execute (MavenCli.java:955)
[INFO]     at org.apache.maven.cli.MavenCli.doMain (MavenCli.java:290)
[INFO]     at org.apache.maven.cli.MavenCli.main (MavenCli.java:194)
[INFO]     at sun.reflect.NativeMethodAccessorImpl.invoke0 (Native Method)
[INFO]     at sun.reflect.NativeMethodAccessorImpl.invoke (NativeMethodAccessorImpl.java:62)
[INFO]     at sun.reflect.DelegatingMethodAccessorImpl.invoke (DelegatingMethodAccessorImpl.java:43)
[INFO]     at java.lang.reflect.Method.invoke (Method.java:498)
[INFO]     at org.codehaus.plexus.classworlds.launcher.Launcher.launchEnhanced (Launcher.java:289)
[INFO]     at org.codehaus.plexus.classworlds.launcher.Launcher.launch (Launcher.java:229)
[INFO]     at org.codehaus.plexus.classworlds.launcher.Launcher.mainWithExitCode (Launcher.java:415)
[INFO]     at org.codehaus.plexus.classworlds.launcher.Launcher.main (Launcher.java:356)
[INFO] [ERROR] 
[INFO] [ERROR] Re-run Maven using the -X switch to enable full debug logging.
[INFO] [ERROR] 
[INFO] [ERROR] For more information about the errors and possible solutions, please read the following articles:
[INFO] [ERROR] [Help 1] http://cwiki.apache.org/confluence/display/MAVEN/MojoFailureException
[INFO] Post-archetype-generation invoker exit code: 1
[INFO] ------------------------------------------------------------------------
[INFO] Reactor Summary:
[INFO] 
[INFO] Brooklyn Downstream Project Parent ................. SUCCESS [ 20.722 s]
[INFO] Brooklyn Dist Root ................................. SUCCESS [  5.480 s]
[INFO] Brooklyn All Things ................................ SUCCESS [02:06 min]
[INFO] Brooklyn Distribution .............................. SUCCESS [01:06 min]
[INFO] Brooklyn Karaf Distribution Parent ................. SUCCESS [  0.064 s]
[INFO] Brooklyn Karaf Server Configuration ................ SUCCESS [  1.083 s]
[INFO] Brooklyn Dist Karaf Features ....................... SUCCESS [  3.235 s]
[INFO] Brooklyn Karaf Distribution ........................ SUCCESS [02:14 min]
[INFO] Brooklyn Karaf pax-exam itest ...................... SUCCESS [03:04 min]
[INFO] Brooklyn Vagrant Getting Started Environment ....... SUCCESS [  0.189 s]
[INFO] Brooklyn Quick-Start Project Archetype ............. FAILURE [01:26 min]
[INFO] Brooklyn Shared Package Files ...................... SKIPPED
[INFO] Brooklyn RPM Package ............................... SKIPPED
[INFO] Brooklyn DEB Package ............................... SKIPPED
[INFO] ------------------------------------------------------------------------
[INFO] BUILD FAILURE
[INFO] ------------------------------------------------------------------------
[INFO] Total time: 10:45 min
[INFO] Finished at: 2018-11-14T15:52:08Z
[INFO] Final Memory: 106M/845M
[INFO] ------------------------------------------------------------------------
[ERROR] Failed to execute goal org.apache.maven.plugins:maven-archetype-plugin:2.3:integration-test (default-integration-test) on project brooklyn-archetype-quickstart: 
[ERROR] Archetype IT 'integration-test-1' failed: Execution failure: exit code = 1
[ERROR] -> [Help 1]
[ERROR] 
[ERROR] To see the full stack trace of the errors, re-run Maven with the -e switch.
[ERROR] Re-run Maven using the -X switch to enable full debug logging.
[ERROR] 
[ERROR] For more information about the errors and possible solutions, please read the following articles:
[ERROR] [Help 1] http://cwiki.apache.org/confluence/display/MAVEN/MojoExecutionException
[ERROR] 
[ERROR] After correcting the problems, you can resume the build with the command
[ERROR]   mvn <goals> -rf :brooklyn-archetype-quickstart
Build step 'Execute shell' marked build as failure
Recording test results
TestNG Reports Processing: START
Looking for TestNG results report in workspace using pattern: **/testng-results.xml
Saving reports...
Processing '/x1/jenkins/jenkins-home/jobs/brooklyn-dist-master-docker/builds/125/testng/testng-results-1.xml'
Processing '/x1/jenkins/jenkins-home/jobs/brooklyn-dist-master-docker/builds/125/testng/testng-results.xml'
33.333332% of tests failed, which exceeded threshold of 0%. Marking build as UNSTABLE
TestNG Reports Processing: FINISH