osdir.com


[Date Prev][Date Next][Thread Prev][Thread Next][Date Index][Thread Index]

Build failed in Jenkins: brooklyn-master-build-docker #956


See <https://builds.apache.org/job/brooklyn-master-build-docker/956/display/redirect>

------------------------------------------
[...truncated 6.29 MB...]
2018-11-10 08:58:11,806 INFO  - TESTNG INVOKING CONFIGURATION: "Surefire test" - @AfterMethod org.apache.brooklyn.core.mgmt.rebind.RebindTestFixture.tearDown()
2018-11-10 08:58:11,821 INFO  - TESTNG PASSED CONFIGURATION: "Surefire test" - @AfterMethod org.apache.brooklyn.core.mgmt.rebind.RebindTestFixture.tearDown() finished in 15 ms
2018-11-10 08:58:11,821 INFO  - TESTNG INVOKING CONFIGURATION: "Surefire test" - @BeforeMethod org.apache.brooklyn.core.test.BrooklynAppUnitTestSupport.setUp()
2018-11-10 08:58:11,822 INFO  - Added external config supplier named 'brooklyn-demo-sample': org.apache.brooklyn.core.config.external.InPlaceExternalConfigSupplier@5bdea3f4
2018-11-10 08:58:11,837 INFO  - TESTNG PASSED CONFIGURATION: "Surefire test" - @BeforeMethod org.apache.brooklyn.core.test.BrooklynAppUnitTestSupport.setUp() finished in 16 ms
2018-11-10 08:58:11,837 INFO  - TESTNG INVOKING CONFIGURATION: "Surefire test" - @BeforeMethod org.apache.brooklyn.core.sensor.password.CreatePasswordSensorTest.setup()
2018-11-10 08:58:11,875 INFO  - TESTNG PASSED CONFIGURATION: "Surefire test" - @BeforeMethod org.apache.brooklyn.core.sensor.password.CreatePasswordSensorTest.setup() finished in 38 ms
2018-11-10 08:58:11,875 INFO  - TESTNG INVOKING: "Surefire test" - org.apache.brooklyn.core.sensor.password.CreatePasswordSensorTest.testCreatePasswordCharacterGroups()
2018-11-10 08:58:11,881 INFO  - TESTNG PASSED: "Surefire test" - org.apache.brooklyn.core.sensor.password.CreatePasswordSensorTest.testCreatePasswordCharacterGroups() finished in 6 ms
2018-11-10 08:58:11,881 INFO  - TESTNG INVOKING CONFIGURATION: "Surefire test" - @AfterMethod org.apache.brooklyn.core.test.BrooklynMgmtUnitTestSupport.tearDown()
2018-11-10 08:58:11,887 INFO  - TESTNG PASSED CONFIGURATION: "Surefire test" - @AfterMethod org.apache.brooklyn.core.test.BrooklynMgmtUnitTestSupport.tearDown() finished in 6 ms
2018-11-10 08:58:11,887 INFO  - TESTNG INVOKING CONFIGURATION: "Surefire test" - @BeforeMethod org.apache.brooklyn.core.test.BrooklynAppUnitTestSupport.setUp()
2018-11-10 08:58:11,888 INFO  - Added external config supplier named 'brooklyn-demo-sample': org.apache.brooklyn.core.config.external.InPlaceExternalConfigSupplier@1c491240
2018-11-10 08:58:11,900 INFO  - TESTNG PASSED CONFIGURATION: "Surefire test" - @BeforeMethod org.apache.brooklyn.core.test.BrooklynAppUnitTestSupport.setUp() finished in 13 ms
2018-11-10 08:58:11,900 INFO  - TESTNG INVOKING CONFIGURATION: "Surefire test" - @BeforeMethod org.apache.brooklyn.core.sensor.password.CreatePasswordSensorTest.setup()
2018-11-10 08:58:11,930 INFO  - TESTNG PASSED CONFIGURATION: "Surefire test" - @BeforeMethod org.apache.brooklyn.core.sensor.password.CreatePasswordSensorTest.setup() finished in 30 ms
2018-11-10 08:58:11,930 INFO  - TESTNG INVOKING: "Surefire test" - org.apache.brooklyn.core.sensor.password.CreatePasswordSensorTest.testCreatePasswordCreatesAPasswordOfDefaultLength()
2018-11-10 08:58:11,931 INFO  - TESTNG PASSED: "Surefire test" - org.apache.brooklyn.core.sensor.password.CreatePasswordSensorTest.testCreatePasswordCreatesAPasswordOfDefaultLength() finished in 1 ms
2018-11-10 08:58:11,931 INFO  - TESTNG INVOKING CONFIGURATION: "Surefire test" - @AfterMethod org.apache.brooklyn.core.test.BrooklynMgmtUnitTestSupport.tearDown()
2018-11-10 08:58:11,936 INFO  - TESTNG PASSED CONFIGURATION: "Surefire test" - @AfterMethod org.apache.brooklyn.core.test.BrooklynMgmtUnitTestSupport.tearDown() finished in 5 ms
2018-11-10 08:58:11,936 INFO  - TESTNG INVOKING CONFIGURATION: "Surefire test" - @BeforeMethod org.apache.brooklyn.core.test.BrooklynAppUnitTestSupport.setUp()
2018-11-10 08:58:11,936 INFO  - Added external config supplier named 'brooklyn-demo-sample': org.apache.brooklyn.core.config.external.InPlaceExternalConfigSupplier@471c9424
2018-11-10 08:58:11,946 INFO  - TESTNG PASSED CONFIGURATION: "Surefire test" - @BeforeMethod org.apache.brooklyn.core.test.BrooklynAppUnitTestSupport.setUp() finished in 10 ms
2018-11-10 08:58:11,946 INFO  - TESTNG INVOKING: "Surefire test" - org.apache.brooklyn.core.sensor.DurationSinceSensorTest.testSensorAddedAndUpdated()
2018-11-10 08:58:12,027 INFO  - TESTNG PASSED: "Surefire test" - org.apache.brooklyn.core.sensor.DurationSinceSensorTest.testSensorAddedAndUpdated() finished in 80 ms
2018-11-10 08:58:12,027 INFO  - TESTNG INVOKING CONFIGURATION: "Surefire test" - @AfterMethod org.apache.brooklyn.core.test.BrooklynMgmtUnitTestSupport.tearDown()
2018-11-10 08:58:12,032 INFO  - TESTNG PASSED CONFIGURATION: "Surefire test" - @AfterMethod org.apache.brooklyn.core.test.BrooklynMgmtUnitTestSupport.tearDown() finished in 5 ms
2018-11-10 08:58:12,033 INFO  - TESTNG INVOKING CONFIGURATION: "Surefire test" - @BeforeMethod org.apache.brooklyn.core.sensor.http.HttpRequestSensorTest.setUp()
2018-11-10 08:58:12,035 INFO  - Added external config supplier named 'brooklyn-demo-sample': org.apache.brooklyn.core.config.external.InPlaceExternalConfigSupplier@228f8aec
2018-11-10 08:58:12,087 INFO  - TESTNG PASSED CONFIGURATION: "Surefire test" - @BeforeMethod org.apache.brooklyn.core.sensor.http.HttpRequestSensorTest.setUp() finished in 55 ms
2018-11-10 08:58:12,087 INFO  - TESTNG INVOKING: "Surefire test" - org.apache.brooklyn.core.sensor.http.HttpRequestSensorTest.testDoNotParseJson()
2018-11-10 08:58:12,133 INFO  - TESTNG PASSED: "Surefire test" - org.apache.brooklyn.core.sensor.http.HttpRequestSensorTest.testDoNotParseJson() finished in 45 ms
2018-11-10 08:58:12,133 INFO  - TESTNG INVOKING CONFIGURATION: "Surefire test" - @AfterMethod org.apache.brooklyn.core.sensor.http.HttpRequestSensorTest.tearDown()
2018-11-10 08:58:12,140 INFO  - TESTNG PASSED CONFIGURATION: "Surefire test" - @AfterMethod org.apache.brooklyn.core.sensor.http.HttpRequestSensorTest.tearDown() finished in 7 ms
2018-11-10 08:58:12,140 INFO  - TESTNG INVOKING CONFIGURATION: "Surefire test" - @BeforeMethod org.apache.brooklyn.core.sensor.http.HttpRequestSensorTest.setUp()
2018-11-10 08:58:12,142 INFO  - Added external config supplier named 'brooklyn-demo-sample': org.apache.brooklyn.core.config.external.InPlaceExternalConfigSupplier@7a388dae
2018-11-10 08:58:12,194 INFO  - TESTNG PASSED CONFIGURATION: "Surefire test" - @BeforeMethod org.apache.brooklyn.core.sensor.http.HttpRequestSensorTest.setUp() finished in 54 ms
2018-11-10 08:58:12,194 INFO  - TESTNG INVOKING: "Surefire test" - org.apache.brooklyn.core.sensor.http.HttpRequestSensorTest.testHttpSensor()
2018-11-10 08:58:12,207 INFO  - TESTNG PASSED: "Surefire test" - org.apache.brooklyn.core.sensor.http.HttpRequestSensorTest.testHttpSensor() finished in 13 ms
2018-11-10 08:58:12,207 INFO  - TESTNG INVOKING CONFIGURATION: "Surefire test" - @AfterMethod org.apache.brooklyn.core.sensor.http.HttpRequestSensorTest.tearDown()
2018-11-10 08:58:12,214 INFO  - TESTNG PASSED CONFIGURATION: "Surefire test" - @AfterMethod org.apache.brooklyn.core.sensor.http.HttpRequestSensorTest.tearDown() finished in 7 ms
2018-11-10 08:58:12,214 INFO  - TESTNG INVOKING CONFIGURATION: "Surefire test" - @BeforeMethod org.apache.brooklyn.core.sensor.http.HttpRequestSensorTest.setUp()
2018-11-10 08:58:12,215 INFO  - Added external config supplier named 'brooklyn-demo-sample': org.apache.brooklyn.core.config.external.InPlaceExternalConfigSupplier@68e49165
2018-11-10 08:58:12,258 INFO  - TESTNG PASSED CONFIGURATION: "Surefire test" - @BeforeMethod org.apache.brooklyn.core.sensor.http.HttpRequestSensorTest.setUp() finished in 44 ms
2018-11-10 08:58:12,258 INFO  - TESTNG INVOKING: "Surefire test" - org.apache.brooklyn.core.sensor.http.HttpRequestSensorTest.testNonJson()
2018-11-10 08:58:12,266 INFO  - TESTNG PASSED: "Surefire test" - org.apache.brooklyn.core.sensor.http.HttpRequestSensorTest.testNonJson() finished in 8 ms
2018-11-10 08:58:12,266 INFO  - TESTNG INVOKING CONFIGURATION: "Surefire test" - @AfterMethod org.apache.brooklyn.core.sensor.http.HttpRequestSensorTest.tearDown()
2018-11-10 08:58:12,273 INFO  - TESTNG PASSED CONFIGURATION: "Surefire test" - @AfterMethod org.apache.brooklyn.core.sensor.http.HttpRequestSensorTest.tearDown() finished in 7 ms
2018-11-10 08:58:12,273 INFO  - TESTNG INVOKING CONFIGURATION: "Surefire test" - @BeforeMethod org.apache.brooklyn.core.sensor.http.HttpRequestSensorTest.setUp()
2018-11-10 08:58:12,275 INFO  - Added external config supplier named 'brooklyn-demo-sample': org.apache.brooklyn.core.config.external.InPlaceExternalConfigSupplier@181a2c3d
2018-11-10 08:58:12,316 INFO  - TESTNG PASSED CONFIGURATION: "Surefire test" - @BeforeMethod org.apache.brooklyn.core.sensor.http.HttpRequestSensorTest.setUp() finished in 43 ms
2018-11-10 08:58:12,316 INFO  - TESTNG INVOKING: "Surefire test" - org.apache.brooklyn.core.sensor.http.HttpRequestSensorTest.testPreemptiveBasicAuth()
2018-11-10 08:58:12,329 INFO  - TESTNG PASSED: "Surefire test" - org.apache.brooklyn.core.sensor.http.HttpRequestSensorTest.testPreemptiveBasicAuth() finished in 13 ms
2018-11-10 08:58:12,330 INFO  - TESTNG INVOKING CONFIGURATION: "Surefire test" - @AfterMethod org.apache.brooklyn.core.sensor.http.HttpRequestSensorTest.tearDown()
2018-11-10 08:58:12,336 INFO  - TESTNG PASSED CONFIGURATION: "Surefire test" - @AfterMethod org.apache.brooklyn.core.sensor.http.HttpRequestSensorTest.tearDown() finished in 7 ms
2018-11-10 08:58:12,337 INFO  - TESTNG INVOKING CONFIGURATION: "Surefire test" - @BeforeMethod org.apache.brooklyn.core.test.BrooklynAppUnitTestSupport.setUp()
2018-11-10 08:58:12,338 INFO  - Added external config supplier named 'brooklyn-demo-sample': org.apache.brooklyn.core.config.external.InPlaceExternalConfigSupplier@2b480986
2018-11-10 08:58:12,354 INFO  - TESTNG PASSED CONFIGURATION: "Surefire test" - @BeforeMethod org.apache.brooklyn.core.test.BrooklynAppUnitTestSupport.setUp() finished in 17 ms
2018-11-10 08:58:12,355 INFO  - TESTNG INVOKING: "Surefire test" - org.apache.brooklyn.core.sensor.MaxConcurrencySensorTest.testAddsStaticSensorOfTypeString()
2018-11-10 08:58:12,372 INFO  - TESTNG PASSED: "Surefire test" - org.apache.brooklyn.core.sensor.MaxConcurrencySensorTest.testAddsStaticSensorOfTypeString() finished in 17 ms
2018-11-10 08:58:12,372 INFO  - TESTNG INVOKING CONFIGURATION: "Surefire test" - @AfterMethod org.apache.brooklyn.core.test.BrooklynMgmtUnitTestSupport.tearDown()
2018-11-10 08:58:12,375 INFO  - TESTNG PASSED CONFIGURATION: "Surefire test" - @AfterMethod org.apache.brooklyn.core.test.BrooklynMgmtUnitTestSupport.tearDown() finished in 3 ms
2018-11-10 08:58:12,375 INFO  - TESTNG INVOKING CONFIGURATION: "Surefire test" - @BeforeMethod org.apache.brooklyn.core.test.BrooklynAppUnitTestSupport.setUp()
2018-11-10 08:58:12,376 INFO  - Added external config supplier named 'brooklyn-demo-sample': org.apache.brooklyn.core.config.external.InPlaceExternalConfigSupplier@c6965b6
2018-11-10 08:58:12,387 INFO  - TESTNG PASSED CONFIGURATION: "Surefire test" - @BeforeMethod org.apache.brooklyn.core.test.BrooklynAppUnitTestSupport.setUp() finished in 12 ms
2018-11-10 08:58:12,387 INFO  - TESTNG INVOKING: "Surefire test" - org.apache.brooklyn.core.sensor.SensorEventPredicatesTest.testSensorEqualTo()
2018-11-10 08:58:12,389 INFO  - TESTNG PASSED: "Surefire test" - org.apache.brooklyn.core.sensor.SensorEventPredicatesTest.testSensorEqualTo() finished in 2 ms
2018-11-10 08:58:12,389 INFO  - TESTNG INVOKING CONFIGURATION: "Surefire test" - @AfterMethod org.apache.brooklyn.core.test.BrooklynMgmtUnitTestSupport.tearDown()
2018-11-10 08:58:12,393 INFO  - TESTNG PASSED CONFIGURATION: "Surefire test" - @AfterMethod org.apache.brooklyn.core.test.BrooklynMgmtUnitTestSupport.tearDown() finished in 4 ms
2018-11-10 08:58:12,394 INFO  - TESTNG INVOKING CONFIGURATION: "Surefire test" - @BeforeMethod org.apache.brooklyn.core.test.BrooklynAppUnitTestSupport.setUp()
2018-11-10 08:58:12,394 INFO  - Added external config supplier named 'brooklyn-demo-sample': org.apache.brooklyn.core.config.external.InPlaceExternalConfigSupplier@1cc2f0bd
2018-11-10 08:58:12,404 INFO  - TESTNG PASSED CONFIGURATION: "Surefire test" - @BeforeMethod org.apache.brooklyn.core.test.BrooklynAppUnitTestSupport.setUp() finished in 10 ms
2018-11-10 08:58:12,404 INFO  - TESTNG INVOKING: "Surefire test" - org.apache.brooklyn.core.sensor.SensorEventPredicatesTest.testSensorSatisfies()
2018-11-10 08:58:12,404 INFO  - TESTNG PASSED: "Surefire test" - org.apache.brooklyn.core.sensor.SensorEventPredicatesTest.testSensorSatisfies() finished in 0 ms
2018-11-10 08:58:12,404 INFO  - TESTNG INVOKING CONFIGURATION: "Surefire test" - @AfterMethod org.apache.brooklyn.core.test.BrooklynMgmtUnitTestSupport.tearDown()
2018-11-10 08:58:12,409 INFO  - TESTNG PASSED CONFIGURATION: "Surefire test" - @AfterMethod org.apache.brooklyn.core.test.BrooklynMgmtUnitTestSupport.tearDown() finished in 5 ms
2018-11-10 08:58:12,409 INFO  - TESTNG INVOKING CONFIGURATION: "Surefire test" - @BeforeMethod org.apache.brooklyn.core.test.BrooklynAppUnitTestSupport.setUp()
2018-11-10 08:58:12,410 INFO  - Added external config supplier named 'brooklyn-demo-sample': org.apache.brooklyn.core.config.external.InPlaceExternalConfigSupplier@1c456773
2018-11-10 08:58:12,420 INFO  - TESTNG PASSED CONFIGURATION: "Surefire test" - @BeforeMethod org.apache.brooklyn.core.test.BrooklynAppUnitTestSupport.setUp() finished in 11 ms
2018-11-10 08:58:12,420 INFO  - TESTNG INVOKING: "Surefire test" - org.apache.brooklyn.core.sensor.SensorEventPredicatesTest.testValueEqualTo()
2018-11-10 08:58:12,421 INFO  - TESTNG PASSED: "Surefire test" - org.apache.brooklyn.core.sensor.SensorEventPredicatesTest.testValueEqualTo() finished in 1 ms
2018-11-10 08:58:12,421 INFO  - TESTNG INVOKING CONFIGURATION: "Surefire test" - @AfterMethod org.apache.brooklyn.core.test.BrooklynMgmtUnitTestSupport.tearDown()
2018-11-10 08:58:12,426 INFO  - TESTNG PASSED CONFIGURATION: "Surefire test" - @AfterMethod org.apache.brooklyn.core.test.BrooklynMgmtUnitTestSupport.tearDown() finished in 5 ms
2018-11-10 08:58:12,426 INFO  - TESTNG INVOKING CONFIGURATION: "Surefire test" - @BeforeMethod org.apache.brooklyn.core.test.BrooklynAppUnitTestSupport.setUp()
2018-11-10 08:58:12,426 INFO  - Added external config supplier named 'brooklyn-demo-sample': org.apache.brooklyn.core.config.external.InPlaceExternalConfigSupplier@799d8a
2018-11-10 08:58:12,437 INFO  - TESTNG PASSED CONFIGURATION: "Surefire test" - @BeforeMethod org.apache.brooklyn.core.test.BrooklynAppUnitTestSupport.setUp() finished in 11 ms
2018-11-10 08:58:12,437 INFO  - TESTNG INVOKING: "Surefire test" - org.apache.brooklyn.core.sensor.SensorEventPredicatesTest.testValueSatisfies()
2018-11-10 08:58:12,437 INFO  - TESTNG PASSED: "Surefire test" - org.apache.brooklyn.core.sensor.SensorEventPredicatesTest.testValueSatisfies() finished in 0 ms
2018-11-10 08:58:12,437 INFO  - TESTNG INVOKING CONFIGURATION: "Surefire test" - @AfterMethod org.apache.brooklyn.core.test.BrooklynMgmtUnitTestSupport.tearDown()
2018-11-10 08:58:12,441 INFO  - TESTNG PASSED CONFIGURATION: "Surefire test" - @AfterMethod org.apache.brooklyn.core.test.BrooklynMgmtUnitTestSupport.tearDown() finished in 4 ms
2018-11-10 08:58:12,686 INFO  - TESTNG 
===============================================
    Surefire test
    Tests run: 2348, Failures: 1, Skips: 0
===============================================
[GC (Allocation Failure)  397451K->177851K(766976K), 0.0411607 secs]
[GC (Allocation Failure)  400571K->172807K(766464K), 0.0109245 secs]
[GC (Allocation Failure)  395527K->172574K(766976K), 0.0217443 secs]
[GC (Allocation Failure)  395806K->172567K(766976K), 0.0119234 secs]
[GC (Allocation Failure)  395799K->172679K(767488K), 0.0070609 secs]
[GC (Allocation Failure)  396935K->173663K(767488K), 0.0554851 secs]
Tests run: 2348, Failures: 1, Errors: 0, Skipped: 0, Time elapsed: 213.565 sec <<< FAILURE! - in TestSuite
testUnsubmittedTaskWithExecutionContextTimesOutWhenImmediate(org.apache.brooklyn.util.core.task.ValueResolverTest)  Time elapsed: 0.01 sec  <<< FAILURE!
java.lang.AssertionError: result=Absent[] expected [true] but found [false]
	at org.apache.brooklyn.util.core.task.ValueResolverTest.testUnsubmittedTaskWithExecutionContextTimesOutWhenImmediate(ValueResolverTest.java:159)

2018-11-10 08:58:15,568 INFO  - Brooklyn shutdown: stopping entities [TestEntityImpl{id=xls0nn1j1e}, TestEntityImpl{id=iseuoqlva5}, BlockingEntityImpl{id=lrn1lz8rul}]

Results :

Failed tests: 
  ValueResolverTest.testUnsubmittedTaskWithExecutionContextTimesOutWhenImmediate:159 result=Absent[] expected [true] but found [false]

Tests run: 2348, Failures: 1, Errors: 0, Skipped: 0

[INFO] ------------------------------------------------------------------------
[INFO] Reactor Summary:
[INFO] 
[INFO] Brooklyn Server Root ............................... SUCCESS [  4.289 s]
[INFO] Brooklyn Parent Project ............................ SUCCESS [  5.612 s]
[INFO] Brooklyn Test Support Utilities .................... SUCCESS [  8.148 s]
[INFO] Brooklyn Logback Includable Configuration .......... SUCCESS [  0.474 s]
[INFO] Brooklyn Common Utilities .......................... SUCCESS [ 30.332 s]
[INFO] Brooklyn API ....................................... SUCCESS [  3.330 s]
[INFO] CAMP Server Parent Project ......................... SUCCESS [  0.118 s]
[INFO] CAMP Base .......................................... SUCCESS [  3.644 s]
[INFO] Brooklyn Test Support .............................. SUCCESS [  2.437 s]
[INFO] Brooklyn REST Swagger Apidoc Utilities ............. SUCCESS [ 14.075 s]
[INFO] Brooklyn Logback Configuration ..................... SUCCESS [  0.220 s]
[INFO] CAMP Server ........................................ SUCCESS [ 14.256 s]
[INFO] Brooklyn Felix Runtime ............................. SUCCESS [  3.398 s]
[INFO] Brooklyn Groovy Utilities .......................... SUCCESS [  2.045 s]
[INFO] Brooklyn Core ...................................... FAILURE [04:25 min]
[INFO] Brooklyn Policies .................................. SKIPPED
[INFO] Brooklyn WinRM Software Entities ................... SKIPPED
[INFO] Brooklyn Secure JMXMP Agent ........................ SKIPPED
[INFO] Brooklyn JMX RMI Agent ............................. SKIPPED
[INFO] Brooklyn Jclouds Location Targets .................. SKIPPED
[INFO] Brooklyn Software Base ............................. SKIPPED
[INFO] Brooklyn CAMP ...................................... SKIPPED
[INFO] Brooklyn Launcher Common ........................... SKIPPED
[INFO] Brooklyn REST API .................................. SKIPPED
[INFO] Brooklyn REST Resources ............................ SKIPPED
[INFO] Brooklyn REST Server ............................... SKIPPED
[INFO] Brooklyn Launcher .................................. SKIPPED
[INFO] Brooklyn Container Location Targets ................ SKIPPED
[INFO] Brooklyn Command Line Interface .................... SKIPPED
[INFO] Brooklyn Test Framework ............................ SKIPPED
[INFO] Brooklyn OSGi init ................................. SKIPPED
[INFO] Brooklyn OSGi start ................................ SKIPPED
[INFO] Brooklyn Karaf ..................................... SKIPPED
[INFO] Jetty config fragment .............................. SKIPPED
[INFO] Apache Http Component extension .................... SKIPPED
[INFO] Brooklyn Karaf Features ............................ SKIPPED
[INFO] Brooklyn Karaf Shell Commands ...................... SKIPPED
[INFO] Brooklyn UI :: Parent .............................. SKIPPED
[INFO] Brooklyn UI :: Modularity Server (parent) .......... SKIPPED
[INFO] Brooklyn UI :: Modularity Server :: UI Module API .. SKIPPED
[INFO] Brooklyn UI :: Modularity Server :: UI Module Registry SKIPPED
[INFO] Brooklyn UI :: Modularity Server :: UI Proxy ....... SKIPPED
[INFO] Brooklyn UI :: Modularity Server :: UI Metadata Registry SKIPPED
[INFO] Brooklyn UI :: Modularity Server :: External UI Modules Registration Hooks SKIPPED
[INFO] Brooklyn UI :: Modularity Server :: Features ....... SKIPPED
[INFO] Brooklyn UI :: Modules (parent) .................... SKIPPED
[INFO] Brooklyn UI :: Modules - UI Utils .................. SKIPPED
[INFO] Brooklyn UI :: Modules - Home ...................... SKIPPED
[INFO] Brooklyn UI :: Modules - App inspector ............. SKIPPED
[INFO] Brooklyn UI :: Modules - Blueprint composer ........ SKIPPED
[INFO] Brooklyn UI :: Modules - Blueprint importer ........ SKIPPED
[INFO] Brooklyn UI :: Modules - Catalog ................... SKIPPED
[INFO] Brooklyn UI :: Modules - Location manager .......... SKIPPED
[INFO] Brooklyn UI :: Modules - REST API Docs ............. SKIPPED
[INFO] Brooklyn UI :: Modules - Groovy console ............ SKIPPED
[INFO] Brooklyn UI :: Modules - Logout .................... SKIPPED
[INFO] Brooklyn UI :: Modules - Features .................. SKIPPED
[INFO] Brooklyn UI :: Features ............................ SKIPPED
[INFO] Brooklyn Library Root .............................. SKIPPED
[INFO] Brooklyn CM Chef ................................... SKIPPED
[INFO] Brooklyn CM SaltStack .............................. SKIPPED
[INFO] Brooklyn CM Ansible ................................ SKIPPED
[INFO] Brooklyn CM Integration Root ....................... SKIPPED
[INFO] Brooklyn Network Software Entities ................. SKIPPED
[INFO] Brooklyn OSGi Software Entities .................... SKIPPED
[INFO] Brooklyn Database Software Entities ................ SKIPPED
[INFO] Brooklyn Web App Software Entities ................. SKIPPED
[INFO] Brooklyn Messaging Software Entities ............... SKIPPED
[INFO] Brooklyn NoSQL Data Store Software Entities ........ SKIPPED
[INFO] Brooklyn Monitoring Software Entities .............. SKIPPED
[INFO] Brooklyn Web App Software Entities ................. SKIPPED
[INFO] Brooklyn QA ........................................ SKIPPED
[INFO] Brooklyn Examples Aggregator Project ............... SKIPPED
[INFO] Brooklyn Examples Aggregator Project - Webapps ..... SKIPPED
[INFO] hello-world-webapp Maven Webapp .................... SKIPPED
[INFO] hello-world-sql-webapp Maven Webapp ................ SKIPPED
[INFO] Brooklyn Simple Web Cluster Example ................ SKIPPED
[INFO] Brooklyn Library Karaf integration ................. SKIPPED
[INFO] Brooklyn Library Catalog ........................... SKIPPED
[INFO] Brooklyn Library Karaf Features .................... SKIPPED
[INFO] Brooklyn Client .................................... SKIPPED
[INFO] Brooklyn Client Command Line Interface ............. SKIPPED
[INFO] Brooklyn REST java Client .......................... SKIPPED
[INFO] Brooklyn Downstream Project Parent ................. SKIPPED
[INFO] Brooklyn Dist Root ................................. SKIPPED
[INFO] Brooklyn All Things ................................ SKIPPED
[INFO] Brooklyn Distribution .............................. SKIPPED
[INFO] Brooklyn Karaf Distribution Parent ................. SKIPPED
[INFO] Brooklyn Karaf Server Configuration ................ SKIPPED
[INFO] Brooklyn Dist Karaf Features ....................... SKIPPED
[INFO] Brooklyn Karaf Distribution ........................ SKIPPED
[INFO] Brooklyn Karaf pax-exam itest ...................... SKIPPED
[INFO] Brooklyn Vagrant Getting Started Environment ....... SKIPPED
[INFO] Brooklyn Quick-Start Project Archetype ............. SKIPPED
[INFO] Brooklyn Shared Package Files ...................... SKIPPED
[INFO] Brooklyn RPM Package ............................... SKIPPED
[INFO] Brooklyn DEB Package ............................... SKIPPED
[INFO] Brooklyn Root 1.0.0-SNAPSHOT ....................... SKIPPED
[INFO] ------------------------------------------------------------------------
[INFO] BUILD FAILURE
[INFO] ------------------------------------------------------------------------
[INFO] Total time: 06:20 min
[INFO] Finished at: 2018-11-10T08:58:16Z
[INFO] ------------------------------------------------------------------------
[ERROR] Failed to execute goal org.apache.maven.plugins:maven-surefire-plugin:2.19.1:test (default-test) on project brooklyn-core: There are test failures.
[ERROR] 
[ERROR] Please refer to /usr/build/brooklyn-server/core/target/surefire-reports for the individual test results.
[ERROR] -> [Help 1]
[ERROR] 
[ERROR] To see the full stack trace of the errors, re-run Maven with the -e switch.
[ERROR] Re-run Maven using the -X switch to enable full debug logging.
[ERROR] 
[ERROR] For more information about the errors and possible solutions, please read the following articles:
[ERROR] [Help 1] http://cwiki.apache.org/confluence/display/MAVEN/MojoFailureException
[ERROR] 
[ERROR] After correcting the problems, you can resume the build with the command
[ERROR]   mvn <goals> -rf :brooklyn-core
Build step 'Execute shell' marked build as failure
Recording test results
TestNG Reports Processing: START
Looking for TestNG results report in workspace using pattern: **/testng-results.xml
Saving reports...
Processing '/x1/jenkins/jenkins-home/jobs/brooklyn-master-build-docker/builds/956/testng/testng-results-1.xml'
Processing '/x1/jenkins/jenkins-home/jobs/brooklyn-master-build-docker/builds/956/testng/testng-results-2.xml'
Processing '/x1/jenkins/jenkins-home/jobs/brooklyn-master-build-docker/builds/956/testng/testng-results-3.xml'
Processing '/x1/jenkins/jenkins-home/jobs/brooklyn-master-build-docker/builds/956/testng/testng-results-4.xml'
Processing '/x1/jenkins/jenkins-home/jobs/brooklyn-master-build-docker/builds/956/testng/testng-results-5.xml'
Processing '/x1/jenkins/jenkins-home/jobs/brooklyn-master-build-docker/builds/956/testng/testng-results-6.xml'
Processing '/x1/jenkins/jenkins-home/jobs/brooklyn-master-build-docker/builds/956/testng/testng-results.xml'
0.033807% of tests failed, which exceeded threshold of 0%. Marking build as UNSTABLE
TestNG Reports Processing: FINISH