OSDir


[Date Prev][Date Next][Thread Prev][Thread Next][Date Index][Thread Index]

Build failed in Jenkins: brooklyn-master-build-docker #939


See <https://builds.apache.org/job/brooklyn-master-build-docker/939/display/redirect>

------------------------------------------
[...truncated 8.10 MB...]
2018-11-07 23:43:15,291 INFO  - TESTNG PASSED CONFIGURATION: "Surefire test" - @AfterMethod org.apache.brooklyn.feed.jmx.JmxFeedTest.tearDown() finished in 12 ms
2018-11-07 23:43:15,291 INFO  - TESTNG INVOKING CONFIGURATION: "Surefire test" - @BeforeMethod org.apache.brooklyn.feed.jmx.JmxFeedTest.setUp()
2018-11-07 23:43:15,292 INFO  - Added external config supplier named 'brooklyn-demo-sample': org.apache.brooklyn.core.config.external.InPlaceExternalConfigSupplier@53fd59d4
2018-11-07 23:43:15,323 WARN  Og2Scr0M-[wdnt7euhqt] Deprecated use of unmanaged location (SimulatedLocation{id=f1i0lmphw8, name=SimulatedLocation:f1i0}); will be managed automatically now but not supported in future versions
2018-11-07 23:43:15,339 INFO  - Creating PortForwardManager(scope=global)
2018-11-07 23:43:15,346 INFO  - JMX tester service started at URL service:jmx:rmi:///jndi/rmi://127.0.0.1:40990/jmxrmi
2018-11-07 23:43:15,346 INFO  - TESTNG PASSED CONFIGURATION: "Surefire test" - @BeforeMethod org.apache.brooklyn.feed.jmx.JmxFeedTest.setUp() finished in 55 ms
2018-11-07 23:43:15,346 INFO  - TESTNG INVOKING: "Surefire test" - org.apache.brooklyn.feed.jmx.JmxFeedTest.testJmxOperationPolledForSensor()
2018-11-07 23:43:15,365 INFO  - TESTNG PASSED: "Surefire test" - org.apache.brooklyn.feed.jmx.JmxFeedTest.testJmxOperationPolledForSensor() finished in 18 ms
2018-11-07 23:43:15,365 INFO  - TESTNG INVOKING CONFIGURATION: "Surefire test" - @AfterMethod org.apache.brooklyn.feed.jmx.JmxFeedTest.tearDown()
2018-11-07 23:43:15,367 INFO  - JMX tester service stopped (127.0.0.1:40990)
2018-11-07 23:43:15,374 INFO  - TESTNG PASSED CONFIGURATION: "Surefire test" - @AfterMethod org.apache.brooklyn.feed.jmx.JmxFeedTest.tearDown() finished in 9 ms
2018-11-07 23:43:15,374 INFO  - TESTNG INVOKING CONFIGURATION: "Surefire test" - @BeforeMethod org.apache.brooklyn.feed.jmx.JmxFeedTest.setUp()
2018-11-07 23:43:15,375 INFO  - Added external config supplier named 'brooklyn-demo-sample': org.apache.brooklyn.core.config.external.InPlaceExternalConfigSupplier@144792d5
2018-11-07 23:43:15,398 WARN  krWd96Xm-[fi4u0bocr1] Deprecated use of unmanaged location (SimulatedLocation{id=cxcvpa5nk3, name=SimulatedLocation:cxcv}); will be managed automatically now but not supported in future versions
2018-11-07 23:43:15,413 INFO  - Creating PortForwardManager(scope=global)
2018-11-07 23:43:15,419 INFO  - JMX tester service started at URL service:jmx:rmi:///jndi/rmi://127.0.0.1:40570/jmxrmi
2018-11-07 23:43:15,419 INFO  - TESTNG PASSED CONFIGURATION: "Surefire test" - @BeforeMethod org.apache.brooklyn.feed.jmx.JmxFeedTest.setUp() finished in 45 ms
2018-11-07 23:43:15,419 INFO  - TESTNG INVOKING: "Surefire test" - org.apache.brooklyn.feed.jmx.JmxFeedTest.testJmxOperationWithArgPolledForSensor()
2018-11-07 23:43:15,428 INFO  - TESTNG PASSED: "Surefire test" - org.apache.brooklyn.feed.jmx.JmxFeedTest.testJmxOperationWithArgPolledForSensor() finished in 9 ms
2018-11-07 23:43:15,429 INFO  - TESTNG INVOKING CONFIGURATION: "Surefire test" - @AfterMethod org.apache.brooklyn.feed.jmx.JmxFeedTest.tearDown()
2018-11-07 23:43:15,430 INFO  - JMX tester service stopped (127.0.0.1:40570)
2018-11-07 23:43:15,435 INFO  - TESTNG PASSED CONFIGURATION: "Surefire test" - @AfterMethod org.apache.brooklyn.feed.jmx.JmxFeedTest.tearDown() finished in 7 ms
2018-11-07 23:43:15,435 INFO  - TESTNG INVOKING CONFIGURATION: "Surefire test" - @BeforeMethod org.apache.brooklyn.feed.jmx.JmxFeedTest.setUp()
2018-11-07 23:43:15,436 INFO  - Added external config supplier named 'brooklyn-demo-sample': org.apache.brooklyn.core.config.external.InPlaceExternalConfigSupplier@7307ae6
2018-11-07 23:43:15,478 WARN  Cc1hLu17-[hg4cbn7a2t] Deprecated use of unmanaged location (SimulatedLocation{id=h2rrc9sm7m, name=SimulatedLocation:h2rr}); will be managed automatically now but not supported in future versions
2018-11-07 23:43:15,497 INFO  - Creating PortForwardManager(scope=global)
2018-11-07 23:43:15,505 INFO  - JMX tester service started at URL service:jmx:rmi:///jndi/rmi://127.0.0.1:40774/jmxrmi
2018-11-07 23:43:15,506 INFO  - TESTNG PASSED CONFIGURATION: "Surefire test" - @BeforeMethod org.apache.brooklyn.feed.jmx.JmxFeedTest.setUp() finished in 71 ms
2018-11-07 23:43:15,506 INFO  - TESTNG INVOKING: "Surefire test" - org.apache.brooklyn.feed.jmx.JmxFeedTest.testSubscribeToJmxNotificationAndEmitCorrespondingNotificationSensor()
2018-11-07 23:43:15,524 WARN  nhGCu5OV-[vct82k59u3] Deprecated use of unmanaged location (SimulatedLocation{id=sluge2wu7n, name=SimulatedLocation:slug}); will be managed automatically now but not supported in future versions
2018-11-07 23:43:15,562 INFO  - TESTNG PASSED: "Surefire test" - org.apache.brooklyn.feed.jmx.JmxFeedTest.testSubscribeToJmxNotificationAndEmitCorrespondingNotificationSensor() finished in 56 ms
2018-11-07 23:43:15,563 INFO  - TESTNG INVOKING CONFIGURATION: "Surefire test" - @AfterMethod org.apache.brooklyn.feed.jmx.JmxFeedTest.tearDown()
2018-11-07 23:43:15,566 INFO  - JMX tester service stopped (127.0.0.1:40774)
2018-11-07 23:43:15,566 INFO  - TESTNG PASSED CONFIGURATION: "Surefire test" - @AfterMethod org.apache.brooklyn.feed.jmx.JmxFeedTest.tearDown() finished in 3 ms
2018-11-07 23:43:15,567 INFO  - TESTNG INVOKING: "Surefire test" - org.apache.brooklyn.feed.jmx.JmxValueFunctionsTest.testCompositeDataToMap()
2018-11-07 23:43:15,568 INFO  - TESTNG PASSED: "Surefire test" - org.apache.brooklyn.feed.jmx.JmxValueFunctionsTest.testCompositeDataToMap() finished in 1 ms
2018-11-07 23:43:15,568 INFO  - TESTNG INVOKING: "Surefire test" - org.apache.brooklyn.feed.jmx.JmxValueFunctionsTest.testTabularDataToMap()
2018-11-07 23:43:15,568 WARN  - tablularDataToMap has overwritten key key1
2018-11-07 23:43:15,568 WARN  - tablularDataToMap has overwritten key key2
2018-11-07 23:43:15,568 WARN  - tablularDataToMap has overwritten key key1
2018-11-07 23:43:15,568 WARN  - tablularDataToMap has overwritten key key2
2018-11-07 23:43:15,569 INFO  - TESTNG PASSED: "Surefire test" - org.apache.brooklyn.feed.jmx.JmxValueFunctionsTest.testTabularDataToMap() finished in 1 ms
2018-11-07 23:43:15,574 INFO  - TESTNG INVOKING: "Surefire test" - org.apache.brooklyn.feed.jmx.JmxValueFunctionsTest.testTabularDataToMapOfMaps()
2018-11-07 23:43:15,575 INFO  - TESTNG PASSED: "Surefire test" - org.apache.brooklyn.feed.jmx.JmxValueFunctionsTest.testTabularDataToMapOfMaps() finished in 1 ms
2018-11-07 23:43:24,627 WARN  - Management Context LocalManagementContext[?-RbDtyz2b] running, creation stacktrace:
java.lang.Throwable: for construction stacktrace
	at org.apache.brooklyn.core.mgmt.internal.LocalManagementContext.<init>(LocalManagementContext.java:141)
	at org.apache.brooklyn.core.mgmt.internal.LocalManagementContext.<init>(LocalManagementContext.java:163)
	at org.apache.brooklyn.core.mgmt.internal.LocalManagementContext.<init>(LocalManagementContext.java:159)
	at org.apache.brooklyn.core.test.entity.LocalManagementContextForTests.<init>(LocalManagementContextForTests.java:45)
	at org.apache.brooklyn.core.test.entity.LocalManagementContextForTests$Builder.build(LocalManagementContextForTests.java:185)
	at org.apache.brooklyn.core.mgmt.rebind.RebindTestUtils$ManagementContextBuilder.buildUnstarted(RebindTestUtils.java:271)
	at org.apache.brooklyn.core.mgmt.rebind.RebindTestFixture.createNewManagementContext(RebindTestFixture.java:148)
	at org.apache.brooklyn.core.location.dynamic.clocker.ClockerDynamicLocationPatternRebindTest.createNewManagementContext(ClockerDynamicLocationPatternRebindTest.java:61)
	at org.apache.brooklyn.core.mgmt.rebind.RebindTestFixture.createNewManagementContext(RebindTestFixture.java:133)
	at org.apache.brooklyn.core.mgmt.rebind.RebindTestFixture.rebind(RebindTestFixture.java:256)
	at org.apache.brooklyn.core.mgmt.rebind.RebindTestFixtureWithApp.rebind(RebindTestFixtureWithApp.java:61)
	at org.apache.brooklyn.core.mgmt.rebind.RebindTestFixtureWithApp.rebind(RebindTestFixtureWithApp.java:33)
	at org.apache.brooklyn.core.mgmt.rebind.RebindTestFixture.rebind(RebindTestFixture.java:243)
	at org.apache.brooklyn.core.location.dynamic.clocker.ClockerDynamicLocationPatternRebindTest.testRebind(ClockerDynamicLocationPatternRebindTest.java:103)
	at sun.reflect.NativeMethodAccessorImpl.invoke0(Native Method)
	at sun.reflect.NativeMethodAccessorImpl.invoke(NativeMethodAccessorImpl.java:62)
	at sun.reflect.DelegatingMethodAccessorImpl.invoke(DelegatingMethodAccessorImpl.java:43)
	at java.lang.reflect.Method.invoke(Method.java:498)
	at org.testng.internal.MethodInvocationHelper.invokeMethod(MethodInvocationHelper.java:104)
	at org.testng.internal.Invoker.invokeMethod(Invoker.java:645)
	at org.testng.internal.Invoker.invokeTestMethod(Invoker.java:851)
	at org.testng.internal.Invoker.invokeTestMethods(Invoker.java:1177)
	at org.testng.internal.TestMethodWorker.invokeTestMethods(TestMethodWorker.java:129)
	at org.testng.internal.TestMethodWorker.run(TestMethodWorker.java:112)
	at org.testng.TestRunner.privateRun(TestRunner.java:756)
	at org.testng.TestRunner.run(TestRunner.java:610)
	at org.testng.SuiteRunner.runTest(SuiteRunner.java:387)
	at org.testng.SuiteRunner.runSequentially(SuiteRunner.java:382)
	at org.testng.SuiteRunner.privateRun(SuiteRunner.java:340)
	at org.testng.SuiteRunner.run(SuiteRunner.java:289)
	at org.testng.SuiteRunnerWorker.runSuite(SuiteRunnerWorker.java:52)
	at org.testng.SuiteRunnerWorker.run(SuiteRunnerWorker.java:86)
	at org.testng.TestNG.runSuitesSequentially(TestNG.java:1293)
	at org.testng.TestNG.runSuitesLocally(TestNG.java:1218)
	at org.testng.TestNG.runSuites(TestNG.java:1133)
	at org.testng.TestNG.run(TestNG.java:1104)
	at org.apache.maven.surefire.testng.TestNGExecutor.run(TestNGExecutor.java:132)
	at org.apache.maven.surefire.testng.TestNGDirectoryTestSuite.executeMulti(TestNGDirectoryTestSuite.java:193)
	at org.apache.maven.surefire.testng.TestNGDirectoryTestSuite.execute(TestNGDirectoryTestSuite.java:94)
	at org.apache.maven.surefire.testng.TestNGProvider.invoke(TestNGProvider.java:147)
	at org.apache.maven.surefire.booter.ForkedBooter.invokeProviderInSameClassLoader(ForkedBooter.java:290)
	at org.apache.maven.surefire.booter.ForkedBooter.runSuitesInProcess(ForkedBooter.java:242)
	at org.apache.maven.surefire.booter.ForkedBooter.main(ForkedBooter.java:121)

2018-11-07 23:43:24,629 INFO  - BrooklynLeakListener.onFinish attempting to terminate all extant ManagementContexts: name=Surefire test; includedGroups=[]; excludedGroups=[Integration, Acceptance, Live, Live-sanity, WIP, Broken]; suiteName=Surefire suite; outDir=/usr/build/brooklyn-server/software/base/target/surefire-reports/Surefire suite: 1 ManagementContexts terminated
2018-11-07 23:43:24,630 INFO  - TESTNG 
===============================================
    Surefire test
    Tests run: 234, Failures: 1, Skips: 0
===============================================
[GC (Allocation Failure)  242155K->57988K(749056K), 0.0370241 secs]
Tests run: 234, Failures: 1, Errors: 0, Skipped: 0, Time elapsed: 638.214 sec <<< FAILURE! - in TestSuite
testRebind(org.apache.brooklyn.core.location.dynamic.clocker.ClockerDynamicLocationPatternRebindTest)  Time elapsed: 45.306 sec  <<< FAILURE!
java.util.concurrent.TimeoutException: Timeout waiting for completion of in-progress write of rebind-periodic-delta, after 40s 283us 950ns
	at org.apache.brooklyn.core.location.dynamic.clocker.ClockerDynamicLocationPatternRebindTest.testRebind(ClockerDynamicLocationPatternRebindTest.java:103)


Results :

Failed tests: 
  ClockerDynamicLocationPatternRebindTest.testRebind:103->RebindTestFixture.rebind:243->RebindTestFixtureWithApp.rebind:33->RebindTestFixtureWithApp.rebind:61->RebindTestFixture.rebind:259 » Timeout

Tests run: 234, Failures: 1, Errors: 0, Skipped: 0

[INFO] ------------------------------------------------------------------------
[INFO] Reactor Summary:
[INFO] 
[INFO] Brooklyn Server Root ............................... SUCCESS [  5.108 s]
[INFO] Brooklyn Parent Project ............................ SUCCESS [  6.722 s]
[INFO] Brooklyn Test Support Utilities .................... SUCCESS [  9.901 s]
[INFO] Brooklyn Logback Includable Configuration .......... SUCCESS [  0.590 s]
[INFO] Brooklyn Common Utilities .......................... SUCCESS [ 34.962 s]
[INFO] Brooklyn API ....................................... SUCCESS [  3.995 s]
[INFO] CAMP Server Parent Project ......................... SUCCESS [  0.167 s]
[INFO] CAMP Base .......................................... SUCCESS [  4.302 s]
[INFO] Brooklyn Test Support .............................. SUCCESS [  1.493 s]
[INFO] Brooklyn REST Swagger Apidoc Utilities ............. SUCCESS [ 14.582 s]
[INFO] Brooklyn Logback Configuration ..................... SUCCESS [  0.248 s]
[INFO] CAMP Server ........................................ SUCCESS [ 14.764 s]
[INFO] Brooklyn Felix Runtime ............................. SUCCESS [  3.991 s]
[INFO] Brooklyn Groovy Utilities .......................... SUCCESS [  2.558 s]
[INFO] Brooklyn Core ...................................... SUCCESS [05:46 min]
[INFO] Brooklyn Policies .................................. SUCCESS [ 39.495 s]
[INFO] Brooklyn WinRM Software Entities ................... SUCCESS [ 23.025 s]
[INFO] Brooklyn Secure JMXMP Agent ........................ SUCCESS [  9.776 s]
[INFO] Brooklyn JMX RMI Agent ............................. SUCCESS [  0.535 s]
[INFO] Brooklyn Jclouds Location Targets .................. SUCCESS [04:39 min]
[INFO] Brooklyn Software Base ............................. FAILURE [11:23 min]
[INFO] Brooklyn CAMP ...................................... SKIPPED
[INFO] Brooklyn Launcher Common ........................... SKIPPED
[INFO] Brooklyn REST API .................................. SKIPPED
[INFO] Brooklyn REST Resources ............................ SKIPPED
[INFO] Brooklyn REST Server ............................... SKIPPED
[INFO] Brooklyn Launcher .................................. SKIPPED
[INFO] Brooklyn Container Location Targets ................ SKIPPED
[INFO] Brooklyn Command Line Interface .................... SKIPPED
[INFO] Brooklyn Test Framework ............................ SKIPPED
[INFO] Brooklyn OSGi init ................................. SKIPPED
[INFO] Brooklyn OSGi start ................................ SKIPPED
[INFO] Brooklyn Karaf ..................................... SKIPPED
[INFO] Jetty config fragment .............................. SKIPPED
[INFO] Apache Http Component extension .................... SKIPPED
[INFO] Brooklyn Karaf Features ............................ SKIPPED
[INFO] Brooklyn Karaf Shell Commands ...................... SKIPPED
[INFO] Brooklyn UI :: Parent .............................. SKIPPED
[INFO] Brooklyn UI :: Modularity Server (parent) .......... SKIPPED
[INFO] Brooklyn UI :: Modularity Server :: UI Module API .. SKIPPED
[INFO] Brooklyn UI :: Modularity Server :: UI Module Registry SKIPPED
[INFO] Brooklyn UI :: Modularity Server :: UI Proxy ....... SKIPPED
[INFO] Brooklyn UI :: Modularity Server :: UI Metadata Registry SKIPPED
[INFO] Brooklyn UI :: Modularity Server :: External UI Modules Registration Hooks SKIPPED
[INFO] Brooklyn UI :: Modularity Server :: Features ....... SKIPPED
[INFO] Brooklyn UI :: Modules (parent) .................... SKIPPED
[INFO] Brooklyn UI :: Modules - UI Utils .................. SKIPPED
[INFO] Brooklyn UI :: Modules - Home ...................... SKIPPED
[INFO] Brooklyn UI :: Modules - App inspector ............. SKIPPED
[INFO] Brooklyn UI :: Modules - Blueprint composer ........ SKIPPED
[INFO] Brooklyn UI :: Modules - Blueprint importer ........ SKIPPED
[INFO] Brooklyn UI :: Modules - Catalog ................... SKIPPED
[INFO] Brooklyn UI :: Modules - Location manager .......... SKIPPED
[INFO] Brooklyn UI :: Modules - REST API Docs ............. SKIPPED
[INFO] Brooklyn UI :: Modules - Groovy console ............ SKIPPED
[INFO] Brooklyn UI :: Modules - Logout .................... SKIPPED
[INFO] Brooklyn UI :: Modules - Features .................. SKIPPED
[INFO] Brooklyn UI :: Features ............................ SKIPPED
[INFO] Brooklyn Library Root .............................. SKIPPED
[INFO] Brooklyn CM Chef ................................... SKIPPED
[INFO] Brooklyn CM SaltStack .............................. SKIPPED
[INFO] Brooklyn CM Ansible ................................ SKIPPED
[INFO] Brooklyn CM Integration Root ....................... SKIPPED
[INFO] Brooklyn Network Software Entities ................. SKIPPED
[INFO] Brooklyn OSGi Software Entities .................... SKIPPED
[INFO] Brooklyn Database Software Entities ................ SKIPPED
[INFO] Brooklyn Web App Software Entities ................. SKIPPED
[INFO] Brooklyn Messaging Software Entities ............... SKIPPED
[INFO] Brooklyn NoSQL Data Store Software Entities ........ SKIPPED
[INFO] Brooklyn Monitoring Software Entities .............. SKIPPED
[INFO] Brooklyn Web App Software Entities ................. SKIPPED
[INFO] Brooklyn QA ........................................ SKIPPED
[INFO] Brooklyn Examples Aggregator Project ............... SKIPPED
[INFO] Brooklyn Examples Aggregator Project - Webapps ..... SKIPPED
[INFO] hello-world-webapp Maven Webapp .................... SKIPPED
[INFO] hello-world-sql-webapp Maven Webapp ................ SKIPPED
[INFO] Brooklyn Simple Web Cluster Example ................ SKIPPED
[INFO] Brooklyn Library Karaf integration ................. SKIPPED
[INFO] Brooklyn Library Catalog ........................... SKIPPED
[INFO] Brooklyn Library Karaf Features .................... SKIPPED
[INFO] Brooklyn Client .................................... SKIPPED
[INFO] Brooklyn Client Command Line Interface ............. SKIPPED
[INFO] Brooklyn REST java Client .......................... SKIPPED
[INFO] Brooklyn Downstream Project Parent ................. SKIPPED
[INFO] Brooklyn Dist Root ................................. SKIPPED
[INFO] Brooklyn All Things ................................ SKIPPED
[INFO] Brooklyn Distribution .............................. SKIPPED
[INFO] Brooklyn Karaf Distribution Parent ................. SKIPPED
[INFO] Brooklyn Karaf Server Configuration ................ SKIPPED
[INFO] Brooklyn Dist Karaf Features ....................... SKIPPED
[INFO] Brooklyn Karaf Distribution ........................ SKIPPED
[INFO] Brooklyn Karaf pax-exam itest ...................... SKIPPED
[INFO] Brooklyn Vagrant Getting Started Environment ....... SKIPPED
[INFO] Brooklyn Quick-Start Project Archetype ............. SKIPPED
[INFO] Brooklyn Shared Package Files ...................... SKIPPED
[INFO] Brooklyn RPM Package ............................... SKIPPED
[INFO] Brooklyn DEB Package ............................... SKIPPED
[INFO] Brooklyn Root 1.0.0-SNAPSHOT ....................... SKIPPED
[INFO] ------------------------------------------------------------------------
[INFO] BUILD FAILURE
[INFO] ------------------------------------------------------------------------
[INFO] Total time: 25:14 min
[INFO] Finished at: 2018-11-07T23:43:25Z
[INFO] ------------------------------------------------------------------------
[ERROR] Failed to execute goal org.apache.maven.plugins:maven-surefire-plugin:2.19.1:test (default-test) on project brooklyn-software-base: There are test failures.
[ERROR] 
[ERROR] Please refer to /usr/build/brooklyn-server/software/base/target/surefire-reports for the individual test results.
[ERROR] -> [Help 1]
[ERROR] 
[ERROR] To see the full stack trace of the errors, re-run Maven with the -e switch.
[ERROR] Re-run Maven using the -X switch to enable full debug logging.
[ERROR] 
[ERROR] For more information about the errors and possible solutions, please read the following articles:
[ERROR] [Help 1] http://cwiki.apache.org/confluence/display/MAVEN/MojoFailureException
[ERROR] 
[ERROR] After correcting the problems, you can resume the build with the command
[ERROR]   mvn <goals> -rf :brooklyn-software-base
Build step 'Execute shell' marked build as failure
Recording test results
TestNG Reports Processing: START
Looking for TestNG results report in workspace using pattern: **/testng-results.xml
Saving reports...
Processing '/x1/jenkins/jenkins-home/jobs/brooklyn-master-build-docker/builds/939/testng/testng-results-1.xml'
Processing '/x1/jenkins/jenkins-home/jobs/brooklyn-master-build-docker/builds/939/testng/testng-results-10.xml'
Processing '/x1/jenkins/jenkins-home/jobs/brooklyn-master-build-docker/builds/939/testng/testng-results-2.xml'
Processing '/x1/jenkins/jenkins-home/jobs/brooklyn-master-build-docker/builds/939/testng/testng-results-3.xml'
Processing '/x1/jenkins/jenkins-home/jobs/brooklyn-master-build-docker/builds/939/testng/testng-results-4.xml'
Processing '/x1/jenkins/jenkins-home/jobs/brooklyn-master-build-docker/builds/939/testng/testng-results-5.xml'
Processing '/x1/jenkins/jenkins-home/jobs/brooklyn-master-build-docker/builds/939/testng/testng-results-6.xml'
Processing '/x1/jenkins/jenkins-home/jobs/brooklyn-master-build-docker/builds/939/testng/testng-results-7.xml'
Processing '/x1/jenkins/jenkins-home/jobs/brooklyn-master-build-docker/builds/939/testng/testng-results-8.xml'
Processing '/x1/jenkins/jenkins-home/jobs/brooklyn-master-build-docker/builds/939/testng/testng-results-9.xml'
Processing '/x1/jenkins/jenkins-home/jobs/brooklyn-master-build-docker/builds/939/testng/testng-results.xml'
0.028201% of tests failed, which exceeded threshold of 0%. Marking build as UNSTABLE
TestNG Reports Processing: FINISH