OSDir


[Date Prev][Date Next][Thread Prev][Thread Next][Date Index][Thread Index]

Build failed in Jenkins: brooklyn-master-build-docker #916


See <https://builds.apache.org/job/brooklyn-master-build-docker/916/display/redirect>

------------------------------------------
[...truncated 50.14 MB...]
    at org.apache.maven.DefaultMaven.doExecute (DefaultMaven.java:305)
    at org.apache.maven.DefaultMaven.doExecute (DefaultMaven.java:192)
    at org.apache.maven.DefaultMaven.execute (DefaultMaven.java:105)
    at org.apache.maven.cli.MavenCli.execute (MavenCli.java:954)
    at org.apache.maven.cli.MavenCli.doMain (MavenCli.java:288)
    at org.apache.maven.cli.MavenCli.main (MavenCli.java:192)
    at sun.reflect.NativeMethodAccessorImpl.invoke0 (Native Method)
    at sun.reflect.NativeMethodAccessorImpl.invoke (NativeMethodAccessorImpl.java:62)
    at sun.reflect.DelegatingMethodAccessorImpl.invoke (DelegatingMethodAccessorImpl.java:43)
    at java.lang.reflect.Method.invoke (Method.java:498)
    at org.codehaus.plexus.classworlds.launcher.Launcher.launchEnhanced (Launcher.java:289)
    at org.codehaus.plexus.classworlds.launcher.Launcher.launch (Launcher.java:229)
    at org.codehaus.plexus.classworlds.launcher.Launcher.mainWithExitCode (Launcher.java:415)
    at org.codehaus.plexus.classworlds.launcher.Launcher.main (Launcher.java:356)
Caused by: com.spotify.docker.client.shaded.javax.ws.rs.ProcessingException: java.io.IOException: No such file or directory
    at com.spotify.docker.client.shaded.org.glassfish.jersey.apache.connector.ApacheConnector.apply (ApacheConnector.java:481)
    at com.spotify.docker.client.shaded.org.glassfish.jersey.apache.connector.ApacheConnector$1.run (ApacheConnector.java:491)
    at java.util.concurrent.Executors$RunnableAdapter.call (Executors.java:511)
    at java.util.concurrent.FutureTask.run (FutureTask.java:266)
    at jersey.repackaged.com.google.common.util.concurrent.MoreExecutors$DirectExecutorService.execute (MoreExecutors.java:299)
    at java.util.concurrent.AbstractExecutorService.submit (AbstractExecutorService.java:112)
    at jersey.repackaged.com.google.common.util.concurrent.AbstractListeningExecutorService.submit (AbstractListeningExecutorService.java:50)
    at jersey.repackaged.com.google.common.util.concurrent.AbstractListeningExecutorService.submit (AbstractListeningExecutorService.java:37)
    at com.spotify.docker.client.shaded.org.glassfish.jersey.apache.connector.ApacheConnector.apply (ApacheConnector.java:487)
    at com.spotify.docker.client.shaded.org.glassfish.jersey.client.ClientRuntime$2.run (ClientRuntime.java:178)
    at com.spotify.docker.client.shaded.org.glassfish.jersey.internal.Errors$1.call (Errors.java:271)
    at com.spotify.docker.client.shaded.org.glassfish.jersey.internal.Errors$1.call (Errors.java:267)
    at com.spotify.docker.client.shaded.org.glassfish.jersey.internal.Errors.process (Errors.java:315)
    at com.spotify.docker.client.shaded.org.glassfish.jersey.internal.Errors.process (Errors.java:297)
    at com.spotify.docker.client.shaded.org.glassfish.jersey.internal.Errors.process (Errors.java:267)
    at com.spotify.docker.client.shaded.org.glassfish.jersey.process.internal.RequestScope.runInScope (RequestScope.java:340)
    at com.spotify.docker.client.shaded.org.glassfish.jersey.client.ClientRuntime$3.run (ClientRuntime.java:210)
    at java.util.concurrent.Executors$RunnableAdapter.call (Executors.java:511)
    at java.util.concurrent.FutureTask.run (FutureTask.java:266)
    at java.util.concurrent.ThreadPoolExecutor.runWorker (ThreadPoolExecutor.java:1149)
    at java.util.concurrent.ThreadPoolExecutor$Worker.run (ThreadPoolExecutor.java:624)
    at java.lang.Thread.run (Thread.java:748)
Caused by: java.io.IOException: No such file or directory
    at jnr.unixsocket.UnixSocketChannel.doConnect (UnixSocketChannel.java:127)
    at jnr.unixsocket.UnixSocketChannel.connect (UnixSocketChannel.java:136)
    at jnr.unixsocket.UnixSocketChannel.connect (UnixSocketChannel.java:223)
    at com.spotify.docker.client.UnixConnectionSocketFactory.connectSocket (UnixConnectionSocketFactory.java:85)
    at com.spotify.docker.client.shaded.org.apache.http.impl.conn.DefaultHttpClientConnectionOperator.connect (DefaultHttpClientConnectionOperator.java:134)
    at com.spotify.docker.client.shaded.org.apache.http.impl.conn.PoolingHttpClientConnectionManager.connect (PoolingHttpClientConnectionManager.java:353)
    at com.spotify.docker.client.shaded.org.apache.http.impl.execchain.MainClientExec.establishRoute (MainClientExec.java:380)
    at com.spotify.docker.client.shaded.org.apache.http.impl.execchain.MainClientExec.execute (MainClientExec.java:236)
    at com.spotify.docker.client.shaded.org.apache.http.impl.execchain.ProtocolExec.execute (ProtocolExec.java:184)
    at com.spotify.docker.client.shaded.org.apache.http.impl.execchain.RetryExec.execute (RetryExec.java:88)
    at com.spotify.docker.client.shaded.org.apache.http.impl.execchain.RedirectExec.execute (RedirectExec.java:110)
    at com.spotify.docker.client.shaded.org.apache.http.impl.client.InternalHttpClient.doExecute (InternalHttpClient.java:184)
    at com.spotify.docker.client.shaded.org.apache.http.impl.client.CloseableHttpClient.execute (CloseableHttpClient.java:71)
    at com.spotify.docker.client.shaded.org.glassfish.jersey.apache.connector.ApacheConnector.apply (ApacheConnector.java:435)
    at com.spotify.docker.client.shaded.org.glassfish.jersey.apache.connector.ApacheConnector$1.run (ApacheConnector.java:491)
    at java.util.concurrent.Executors$RunnableAdapter.call (Executors.java:511)
    at java.util.concurrent.FutureTask.run (FutureTask.java:266)
    at jersey.repackaged.com.google.common.util.concurrent.MoreExecutors$DirectExecutorService.execute (MoreExecutors.java:299)
    at java.util.concurrent.AbstractExecutorService.submit (AbstractExecutorService.java:112)
    at jersey.repackaged.com.google.common.util.concurrent.AbstractListeningExecutorService.submit (AbstractListeningExecutorService.java:50)
    at jersey.repackaged.com.google.common.util.concurrent.AbstractListeningExecutorService.submit (AbstractListeningExecutorService.java:37)
    at com.spotify.docker.client.shaded.org.glassfish.jersey.apache.connector.ApacheConnector.apply (ApacheConnector.java:487)
    at com.spotify.docker.client.shaded.org.glassfish.jersey.client.ClientRuntime$2.run (ClientRuntime.java:178)
    at com.spotify.docker.client.shaded.org.glassfish.jersey.internal.Errors$1.call (Errors.java:271)
    at com.spotify.docker.client.shaded.org.glassfish.jersey.internal.Errors$1.call (Errors.java:267)
    at com.spotify.docker.client.shaded.org.glassfish.jersey.internal.Errors.process (Errors.java:315)
    at com.spotify.docker.client.shaded.org.glassfish.jersey.internal.Errors.process (Errors.java:297)
    at com.spotify.docker.client.shaded.org.glassfish.jersey.internal.Errors.process (Errors.java:267)
    at com.spotify.docker.client.shaded.org.glassfish.jersey.process.internal.RequestScope.runInScope (RequestScope.java:340)
    at com.spotify.docker.client.shaded.org.glassfish.jersey.client.ClientRuntime$3.run (ClientRuntime.java:210)
    at java.util.concurrent.Executors$RunnableAdapter.call (Executors.java:511)
    at java.util.concurrent.FutureTask.run (FutureTask.java:266)
    at java.util.concurrent.ThreadPoolExecutor.runWorker (ThreadPoolExecutor.java:1149)
    at java.util.concurrent.ThreadPoolExecutor$Worker.run (ThreadPoolExecutor.java:624)
    at java.lang.Thread.run (Thread.java:748)
[INFO] Building Docker context /usr/build/brooklyn-dist/dist
[INFO] 
[INFO] Image will be built as apache/brooklyn:1.0.0-SNAPSHOT
[INFO] 
Nov 04, 2018 8:44:53 AM com.spotify.docker.client.shaded.org.apache.http.impl.execchain.RetryExec execute
INFO: I/O exception (java.io.IOException) caught when processing request to {}->unix://localhost:80: No such file or directory
Nov 04, 2018 8:44:53 AM com.spotify.docker.client.shaded.org.apache.http.impl.execchain.RetryExec execute
INFO: Retrying request to {}->unix://localhost:80
Nov 04, 2018 8:44:53 AM com.spotify.docker.client.shaded.org.apache.http.impl.execchain.RetryExec execute
INFO: I/O exception (java.io.IOException) caught when processing request to {}->unix://localhost:80: No such file or directory
Nov 04, 2018 8:44:53 AM com.spotify.docker.client.shaded.org.apache.http.impl.execchain.RetryExec execute
INFO: Retrying request to {}->unix://localhost:80
Nov 04, 2018 8:44:53 AM com.spotify.docker.client.shaded.org.apache.http.impl.execchain.RetryExec execute
INFO: I/O exception (java.io.IOException) caught when processing request to {}->unix://localhost:80: No such file or directory
Nov 04, 2018 8:44:53 AM com.spotify.docker.client.shaded.org.apache.http.impl.execchain.RetryExec execute
INFO: Retrying request to {}->unix://localhost:80
[INFO] ------------------------------------------------------------------------
[INFO] Reactor Summary:
[INFO] 
[INFO] Brooklyn Server Root ............................... SUCCESS [  4.613 s]
[INFO] Brooklyn Parent Project ............................ SUCCESS [  5.281 s]
[INFO] Brooklyn Test Support Utilities .................... SUCCESS [  8.443 s]
[INFO] Brooklyn Logback Includable Configuration .......... SUCCESS [  0.520 s]
[INFO] Brooklyn Common Utilities .......................... SUCCESS [ 28.527 s]
[INFO] Brooklyn API ....................................... SUCCESS [  3.477 s]
[INFO] CAMP Server Parent Project ......................... SUCCESS [  0.137 s]
[INFO] CAMP Base .......................................... SUCCESS [  3.666 s]
[INFO] Brooklyn Test Support .............................. SUCCESS [  1.132 s]
[INFO] Brooklyn REST Swagger Apidoc Utilities ............. SUCCESS [ 14.289 s]
[INFO] Brooklyn Logback Configuration ..................... SUCCESS [  0.210 s]
[INFO] CAMP Server ........................................ SUCCESS [ 14.203 s]
[INFO] Brooklyn Felix Runtime ............................. SUCCESS [  3.549 s]
[INFO] Brooklyn Groovy Utilities .......................... SUCCESS [  2.280 s]
[INFO] Brooklyn Core ...................................... SUCCESS [04:30 min]
[INFO] Brooklyn Policies .................................. SUCCESS [ 35.285 s]
[INFO] Brooklyn WinRM Software Entities ................... SUCCESS [ 20.813 s]
[INFO] Brooklyn Secure JMXMP Agent ........................ SUCCESS [  7.700 s]
[INFO] Brooklyn JMX RMI Agent ............................. SUCCESS [  0.419 s]
[INFO] Brooklyn Jclouds Location Targets .................. SUCCESS [01:07 min]
[INFO] Brooklyn Software Base ............................. SUCCESS [01:36 min]
[INFO] Brooklyn CAMP ...................................... SUCCESS [03:01 min]
[INFO] Brooklyn Launcher Common ........................... SUCCESS [  4.829 s]
[INFO] Brooklyn REST API .................................. SUCCESS [  8.898 s]
[INFO] Brooklyn REST Resources ............................ SUCCESS [ 51.869 s]
[INFO] Brooklyn REST Server ............................... SUCCESS [ 25.541 s]
[INFO] Brooklyn Launcher .................................. SUCCESS [03:32 min]
[INFO] Brooklyn Container Location Targets ................ SUCCESS [ 12.617 s]
[INFO] Brooklyn Command Line Interface .................... SUCCESS [ 10.865 s]
[INFO] Brooklyn Test Framework ............................ SUCCESS [ 21.660 s]
[INFO] Brooklyn OSGi init ................................. SUCCESS [  5.847 s]
[INFO] Brooklyn OSGi start ................................ SUCCESS [  2.054 s]
[INFO] Brooklyn Karaf ..................................... SUCCESS [  0.022 s]
[INFO] Jetty config fragment .............................. SUCCESS [  1.365 s]
[INFO] Apache Http Component extension .................... SUCCESS [  0.296 s]
[INFO] Brooklyn Karaf Features ............................ SUCCESS [  0.724 s]
[INFO] Brooklyn Karaf Shell Commands ...................... SUCCESS [  8.852 s]
[INFO] Brooklyn UI :: Parent .............................. SUCCESS [  2.271 s]
[INFO] Brooklyn UI :: Modularity Server (parent) .......... SUCCESS [  0.101 s]
[INFO] Brooklyn UI :: Modularity Server :: UI Module API .. SUCCESS [  4.189 s]
[INFO] Brooklyn UI :: Modularity Server :: UI Module Registry SUCCESS [  2.232 s]
[INFO] Brooklyn UI :: Modularity Server :: UI Proxy ....... SUCCESS [  4.082 s]
[INFO] Brooklyn UI :: Modularity Server :: UI Metadata Registry SUCCESS [  0.575 s]
[INFO] Brooklyn UI :: Modularity Server :: External UI Modules Registration Hooks SUCCESS [  5.006 s]
[INFO] Brooklyn UI :: Modularity Server :: Features ....... SUCCESS [ 49.965 s]
[INFO] Brooklyn UI :: Modules (parent) .................... SUCCESS [  0.154 s]
[INFO] Brooklyn UI :: Modules - UI Utils .................. SUCCESS [ 44.783 s]
[INFO] Brooklyn UI :: Modules - Home ...................... SUCCESS [02:36 min]
[INFO] Brooklyn UI :: Modules - App inspector ............. SUCCESS [02:39 min]
[INFO] Brooklyn UI :: Modules - Blueprint composer ........ SUCCESS [02:55 min]
[INFO] Brooklyn UI :: Modules - Blueprint importer ........ SUCCESS [02:30 min]
[INFO] Brooklyn UI :: Modules - Catalog ................... SUCCESS [02:39 min]
[INFO] Brooklyn UI :: Modules - Location manager .......... SUCCESS [02:28 min]
[INFO] Brooklyn UI :: Modules - REST API Docs ............. SUCCESS [02:31 min]
[INFO] Brooklyn UI :: Modules - Groovy console ............ SUCCESS [02:27 min]
[INFO] Brooklyn UI :: Modules - Logout .................... SUCCESS [02:22 min]
[INFO] Brooklyn UI :: Modules - Features .................. SUCCESS [  7.414 s]
[INFO] Brooklyn UI :: Features ............................ SUCCESS [  0.199 s]
[INFO] Brooklyn Library Root .............................. SUCCESS [  0.121 s]
[INFO] Brooklyn CM Chef ................................... SUCCESS [  7.322 s]
[INFO] Brooklyn CM SaltStack .............................. SUCCESS [  5.931 s]
[INFO] Brooklyn CM Ansible ................................ SUCCESS [  4.457 s]
[INFO] Brooklyn CM Integration Root ....................... SUCCESS [  0.136 s]
[INFO] Brooklyn Network Software Entities ................. SUCCESS [  4.774 s]
[INFO] Brooklyn OSGi Software Entities .................... SUCCESS [  3.540 s]
[INFO] Brooklyn Database Software Entities ................ SUCCESS [  8.438 s]
[INFO] Brooklyn Web App Software Entities ................. SUCCESS [ 25.025 s]
[INFO] Brooklyn Messaging Software Entities ............... SUCCESS [ 30.351 s]
[INFO] Brooklyn NoSQL Data Store Software Entities ........ SUCCESS [ 39.521 s]
[INFO] Brooklyn Monitoring Software Entities .............. SUCCESS [  3.563 s]
[INFO] Brooklyn Web App Software Entities ................. SUCCESS [  0.146 s]
[INFO] Brooklyn QA ........................................ SUCCESS [ 10.539 s]
[INFO] Brooklyn Examples Aggregator Project ............... SUCCESS [  0.114 s]
[INFO] Brooklyn Examples Aggregator Project - Webapps ..... SUCCESS [  0.106 s]
[INFO] hello-world-webapp Maven Webapp .................... SUCCESS [  0.695 s]
[INFO] hello-world-sql-webapp Maven Webapp ................ SUCCESS [  2.695 s]
[INFO] Brooklyn Simple Web Cluster Example ................ SUCCESS [  5.375 s]
[INFO] Brooklyn Library Karaf integration ................. SUCCESS [  0.105 s]
[INFO] Brooklyn Library Catalog ........................... SUCCESS [  0.220 s]
[INFO] Brooklyn Library Karaf Features .................... SUCCESS [  1.834 s]
[INFO] Brooklyn Client .................................... SUCCESS [  0.153 s]
[INFO] Brooklyn Client Command Line Interface ............. SUCCESS [ 36.186 s]
[INFO] Brooklyn REST java Client .......................... SUCCESS [ 15.964 s]
[INFO] Brooklyn Downstream Project Parent ................. SUCCESS [  0.452 s]
[INFO] Brooklyn Dist Root ................................. SUCCESS [  0.108 s]
[INFO] Brooklyn All Things ................................ SUCCESS [  3.682 s]
[INFO] Brooklyn Distribution .............................. FAILURE [ 50.914 s]
[INFO] Brooklyn Karaf Distribution Parent ................. SKIPPED
[INFO] Brooklyn Karaf Server Configuration ................ SKIPPED
[INFO] Brooklyn Dist Karaf Features ....................... SKIPPED
[INFO] Brooklyn Karaf Distribution ........................ SKIPPED
[INFO] Brooklyn Karaf pax-exam itest ...................... SKIPPED
[INFO] Brooklyn Vagrant Getting Started Environment ....... SKIPPED
[INFO] Brooklyn Quick-Start Project Archetype ............. SKIPPED
[INFO] Brooklyn Shared Package Files ...................... SKIPPED
[INFO] Brooklyn RPM Package ............................... SKIPPED
[INFO] Brooklyn DEB Package ............................... SKIPPED
[INFO] Brooklyn Root 1.0.0-SNAPSHOT ....................... SKIPPED
[INFO] ------------------------------------------------------------------------
[INFO] BUILD FAILURE
[INFO] ------------------------------------------------------------------------
[INFO] Total time: 48:56 min
[INFO] Finished at: 2018-11-04T08:44:53Z
[INFO] ------------------------------------------------------------------------
[ERROR] Failed to execute goal com.spotify:dockerfile-maven-plugin:1.4.0:build (default) on project brooklyn-dist: Could not build image: java.util.concurrent.ExecutionException: com.spotify.docker.client.shaded.javax.ws.rs.ProcessingException: java.io.IOException: No such file or directory -> [Help 1]
[ERROR] 
[ERROR] To see the full stack trace of the errors, re-run Maven with the -e switch.
[ERROR] Re-run Maven using the -X switch to enable full debug logging.
[ERROR] 
[ERROR] For more information about the errors and possible solutions, please read the following articles:
[ERROR] [Help 1] http://cwiki.apache.org/confluence/display/MAVEN/MojoExecutionException
[ERROR] 
[ERROR] After correcting the problems, you can resume the build with the command
[ERROR]   mvn <goals> -rf :brooklyn-dist
Build step 'Execute shell' marked build as failure
Recording test results
TestNG Reports Processing: START
Looking for TestNG results report in workspace using pattern: **/testng-results.xml
Saving reports...
Processing '/x1/jenkins/jenkins-home/jobs/brooklyn-master-build-docker/builds/916/testng/testng-results-1.xml'
Processing '/x1/jenkins/jenkins-home/jobs/brooklyn-master-build-docker/builds/916/testng/testng-results-10.xml'
Processing '/x1/jenkins/jenkins-home/jobs/brooklyn-master-build-docker/builds/916/testng/testng-results-11.xml'
Processing '/x1/jenkins/jenkins-home/jobs/brooklyn-master-build-docker/builds/916/testng/testng-results-12.xml'
Processing '/x1/jenkins/jenkins-home/jobs/brooklyn-master-build-docker/builds/916/testng/testng-results-13.xml'
Processing '/x1/jenkins/jenkins-home/jobs/brooklyn-master-build-docker/builds/916/testng/testng-results-14.xml'
Processing '/x1/jenkins/jenkins-home/jobs/brooklyn-master-build-docker/builds/916/testng/testng-results-15.xml'
Processing '/x1/jenkins/jenkins-home/jobs/brooklyn-master-build-docker/builds/916/testng/testng-results-16.xml'
Processing '/x1/jenkins/jenkins-home/jobs/brooklyn-master-build-docker/builds/916/testng/testng-results-17.xml'
Processing '/x1/jenkins/jenkins-home/jobs/brooklyn-master-build-docker/builds/916/testng/testng-results-18.xml'
Processing '/x1/jenkins/jenkins-home/jobs/brooklyn-master-build-docker/builds/916/testng/testng-results-19.xml'
Processing '/x1/jenkins/jenkins-home/jobs/brooklyn-master-build-docker/builds/916/testng/testng-results-2.xml'
Processing '/x1/jenkins/jenkins-home/jobs/brooklyn-master-build-docker/builds/916/testng/testng-results-20.xml'
Processing '/x1/jenkins/jenkins-home/jobs/brooklyn-master-build-docker/builds/916/testng/testng-results-21.xml'
Processing '/x1/jenkins/jenkins-home/jobs/brooklyn-master-build-docker/builds/916/testng/testng-results-22.xml'
Processing '/x1/jenkins/jenkins-home/jobs/brooklyn-master-build-docker/builds/916/testng/testng-results-23.xml'
Processing '/x1/jenkins/jenkins-home/jobs/brooklyn-master-build-docker/builds/916/testng/testng-results-24.xml'
Processing '/x1/jenkins/jenkins-home/jobs/brooklyn-master-build-docker/builds/916/testng/testng-results-25.xml'
Processing '/x1/jenkins/jenkins-home/jobs/brooklyn-master-build-docker/builds/916/testng/testng-results-26.xml'
Processing '/x1/jenkins/jenkins-home/jobs/brooklyn-master-build-docker/builds/916/testng/testng-results-27.xml'
Processing '/x1/jenkins/jenkins-home/jobs/brooklyn-master-build-docker/builds/916/testng/testng-results-28.xml'
Processing '/x1/jenkins/jenkins-home/jobs/brooklyn-master-build-docker/builds/916/testng/testng-results-29.xml'
Processing '/x1/jenkins/jenkins-home/jobs/brooklyn-master-build-docker/builds/916/testng/testng-results-3.xml'
Processing '/x1/jenkins/jenkins-home/jobs/brooklyn-master-build-docker/builds/916/testng/testng-results-30.xml'
Processing '/x1/jenkins/jenkins-home/jobs/brooklyn-master-build-docker/builds/916/testng/testng-results-31.xml'
Processing '/x1/jenkins/jenkins-home/jobs/brooklyn-master-build-docker/builds/916/testng/testng-results-32.xml'
Processing '/x1/jenkins/jenkins-home/jobs/brooklyn-master-build-docker/builds/916/testng/testng-results-33.xml'
Processing '/x1/jenkins/jenkins-home/jobs/brooklyn-master-build-docker/builds/916/testng/testng-results-34.xml'
Processing '/x1/jenkins/jenkins-home/jobs/brooklyn-master-build-docker/builds/916/testng/testng-results-35.xml'
Processing '/x1/jenkins/jenkins-home/jobs/brooklyn-master-build-docker/builds/916/testng/testng-results-36.xml'
Processing '/x1/jenkins/jenkins-home/jobs/brooklyn-master-build-docker/builds/916/testng/testng-results-4.xml'
Processing '/x1/jenkins/jenkins-home/jobs/brooklyn-master-build-docker/builds/916/testng/testng-results-5.xml'
Processing '/x1/jenkins/jenkins-home/jobs/brooklyn-master-build-docker/builds/916/testng/testng-results-6.xml'
Processing '/x1/jenkins/jenkins-home/jobs/brooklyn-master-build-docker/builds/916/testng/testng-results-7.xml'
Processing '/x1/jenkins/jenkins-home/jobs/brooklyn-master-build-docker/builds/916/testng/testng-results-8.xml'
Processing '/x1/jenkins/jenkins-home/jobs/brooklyn-master-build-docker/builds/916/testng/testng-results-9.xml'
Processing '/x1/jenkins/jenkins-home/jobs/brooklyn-master-build-docker/builds/916/testng/testng-results.xml'
TestNG Reports Processing: FINISH