osdir.com


[Date Prev][Date Next][Thread Prev][Thread Next][Date Index][Thread Index]

Build failed in Jenkins: brooklyn-client-master-docker #17


See <https://builds.apache.org/job/brooklyn-client-master-docker/17/display/redirect>

------------------------------------------
[...truncated 249.58 KB...]
	at org.apache.brooklyn.rt.felix.EmbeddedFramework.getFramework(EmbeddedFramework.java:30)
	at org.apache.brooklyn.util.core.osgi.Osgis.getFramework(Osgis.java:301)
	at org.apache.brooklyn.core.mgmt.ha.OsgiManager.start(OsgiManager.java:273)
	at org.apache.brooklyn.core.mgmt.internal.LocalManagementContext.<init>(LocalManagementContext.java:184)
	at org.apache.brooklyn.core.mgmt.internal.LocalManagementContext.<init>(LocalManagementContext.java:163)
	at org.apache.brooklyn.core.mgmt.internal.LocalManagementContext.<init>(LocalManagementContext.java:149)
	at org.apache.brooklyn.rest.client.BrooklynApiRestClientTest.getManagementContext(BrooklynApiRestClientTest.java:66)
	at org.apache.brooklyn.rest.client.BrooklynApiRestClientTest.setUp(BrooklynApiRestClientTest.java:77)
Caused by: org.osgi.framework.BundleException: Error creating bundle cache.
	at org.apache.felix.framework.Felix.init(Felix.java:697)
	at org.apache.felix.framework.Felix.init(Felix.java:626)
	at org.apache.brooklyn.rt.felix.EmbeddedFelixFramework.newFrameworkStarted(EmbeddedFelixFramework.java:107)
	... 37 more
Caused by: java.lang.RuntimeException: Unable to create cache directory.
	at org.apache.felix.framework.cache.BundleCache.<init>(BundleCache.java:131)
	at org.apache.felix.framework.Felix.init(Felix.java:692)
	... 39 more
2018-09-19 18:47:37,875 INFO  - TESTNG INVOKING: "Surefire test" - org.apache.brooklyn.rest.client.BrooklynApiRestClientTest.testNoV1InUrl()
2018-09-19 18:47:37,877 INFO  - TESTNG SKIPPED: "Surefire test" - org.apache.brooklyn.rest.client.BrooklynApiRestClientTest.testNoV1InUrl() finished in 0 ms
org.apache.brooklyn.util.exceptions.PropagatedRuntimeException: BundleException: Error creating bundle cache.
	at org.apache.brooklyn.util.exceptions.Exceptions.propagate(Exceptions.java:129)
	at org.apache.brooklyn.rt.felix.EmbeddedFelixFramework.newFrameworkStarted(EmbeddedFelixFramework.java:112)
	at org.apache.brooklyn.rt.felix.EmbeddedFramework.getFramework(EmbeddedFramework.java:30)
	at org.apache.brooklyn.util.core.osgi.Osgis.getFramework(Osgis.java:301)
	at org.apache.brooklyn.core.mgmt.ha.OsgiManager.start(OsgiManager.java:273)
	at org.apache.brooklyn.core.mgmt.internal.LocalManagementContext.<init>(LocalManagementContext.java:184)
	at org.apache.brooklyn.core.mgmt.internal.LocalManagementContext.<init>(LocalManagementContext.java:163)
	at org.apache.brooklyn.core.mgmt.internal.LocalManagementContext.<init>(LocalManagementContext.java:149)
	at org.apache.brooklyn.rest.client.BrooklynApiRestClientTest.getManagementContext(BrooklynApiRestClientTest.java:66)
	at org.apache.brooklyn.rest.client.BrooklynApiRestClientTest.setUp(BrooklynApiRestClientTest.java:77)
Caused by: org.osgi.framework.BundleException: Error creating bundle cache.
	at org.apache.felix.framework.Felix.init(Felix.java:697)
	at org.apache.felix.framework.Felix.init(Felix.java:626)
	at org.apache.brooklyn.rt.felix.EmbeddedFelixFramework.newFrameworkStarted(EmbeddedFelixFramework.java:107)
	... 37 more
Caused by: java.lang.RuntimeException: Unable to create cache directory.
	at org.apache.felix.framework.cache.BundleCache.<init>(BundleCache.java:131)
	at org.apache.felix.framework.Felix.init(Felix.java:692)
	... 39 more
2018-09-19 18:47:37,878 INFO  - TESTNG INVOKING CONFIGURATION: "Surefire test" - @AfterClass org.apache.brooklyn.rest.client.BrooklynApiRestClientTest.tearDown()
2018-09-19 18:47:37,884 INFO  - Added external config supplier named 'brooklyn-demo-sample': org.apache.brooklyn.core.config.external.InPlaceExternalConfigSupplier@4d722ac9
ERROR: Unable to create cache directory: /var/maven/.brooklyn/osgi/cache/IL61WKMH
ERROR: Error creating bundle cache.
java.lang.RuntimeException: Unable to create cache directory.
	at org.apache.felix.framework.cache.BundleCache.<init>(BundleCache.java:131)
	at org.apache.felix.framework.Felix.init(Felix.java:692)
	at org.apache.felix.framework.Felix.init(Felix.java:626)
	at org.apache.brooklyn.rt.felix.EmbeddedFelixFramework.newFrameworkStarted(EmbeddedFelixFramework.java:107)
	at org.apache.brooklyn.rt.felix.EmbeddedFramework.getFramework(EmbeddedFramework.java:30)
	at org.apache.brooklyn.util.core.osgi.Osgis.getFramework(Osgis.java:301)
	at org.apache.brooklyn.core.mgmt.ha.OsgiManager.start(OsgiManager.java:273)
	at org.apache.brooklyn.core.mgmt.internal.LocalManagementContext.<init>(LocalManagementContext.java:184)
	at org.apache.brooklyn.core.mgmt.internal.LocalManagementContext.<init>(LocalManagementContext.java:163)
	at org.apache.brooklyn.core.mgmt.internal.LocalManagementContext.<init>(LocalManagementContext.java:149)
	at org.apache.brooklyn.rest.client.BrooklynApiRestClientTest.getManagementContext(BrooklynApiRestClientTest.java:66)
	at org.apache.brooklyn.rest.client.BrooklynApiRestClientTest.tearDown(BrooklynApiRestClientTest.java:87)
	at sun.reflect.NativeMethodAccessorImpl.invoke0(Native Method)
	at sun.reflect.NativeMethodAccessorImpl.invoke(NativeMethodAccessorImpl.java:62)
	at sun.reflect.DelegatingMethodAccessorImpl.invoke(DelegatingMethodAccessorImpl.java:43)
	at java.lang.reflect.Method.invoke(Method.java:498)
	at org.testng.internal.MethodInvocationHelper.invokeMethod(MethodInvocationHelper.java:104)
	at org.testng.internal.Invoker.invokeConfigurationMethod(Invoker.java:515)
	at org.testng.internal.Invoker.invokeConfigurations(Invoker.java:217)
	at org.testng.internal.Invoker.invokeConfigurations(Invoker.java:144)
	at org.testng.internal.TestMethodWorker.invokeAfterClassMethods(TestMethodWorker.java:217)
	at org.testng.internal.TestMethodWorker.run(TestMethodWorker.java:115)
	at org.testng.TestRunner.privateRun(TestRunner.java:756)
	at org.testng.TestRunner.run(TestRunner.java:610)
	at org.testng.SuiteRunner.runTest(SuiteRunner.java:387)
	at org.testng.SuiteRunner.runSequentially(SuiteRunner.java:382)
	at org.testng.SuiteRunner.privateRun(SuiteRunner.java:340)
	at org.testng.SuiteRunner.run(SuiteRunner.java:289)
	at org.testng.SuiteRunnerWorker.runSuite(SuiteRunnerWorker.java:52)
	at org.testng.SuiteRunnerWorker.run(SuiteRunnerWorker.java:86)
	at org.testng.TestNG.runSuitesSequentially(TestNG.java:1293)
	at org.testng.TestNG.runSuitesLocally(TestNG.java:1218)
	at org.testng.TestNG.runSuites(TestNG.java:1133)
	at org.testng.TestNG.run(TestNG.java:1104)
	at org.apache.maven.surefire.testng.TestNGExecutor.run(TestNGExecutor.java:132)
	at org.apache.maven.surefire.testng.TestNGDirectoryTestSuite.executeMulti(TestNGDirectoryTestSuite.java:193)
	at org.apache.maven.surefire.testng.TestNGDirectoryTestSuite.execute(TestNGDirectoryTestSuite.java:94)
	at org.apache.maven.surefire.testng.TestNGProvider.invoke(TestNGProvider.java:147)
	at org.apache.maven.surefire.booter.ForkedBooter.invokeProviderInSameClassLoader(ForkedBooter.java:290)
	at org.apache.maven.surefire.booter.ForkedBooter.runSuitesInProcess(ForkedBooter.java:242)
	at org.apache.maven.surefire.booter.ForkedBooter.main(ForkedBooter.java:121)
2018-09-19 18:47:37,916 INFO  - TESTNG FAILED CONFIGURATION: "Surefire test" - @AfterClass org.apache.brooklyn.rest.client.BrooklynApiRestClientTest.tearDown() finished in 0 ms
org.apache.brooklyn.util.exceptions.PropagatedRuntimeException: BundleException: Error creating bundle cache.
	at org.apache.brooklyn.util.exceptions.Exceptions.propagate(Exceptions.java:129)
	at org.apache.brooklyn.rt.felix.EmbeddedFelixFramework.newFrameworkStarted(EmbeddedFelixFramework.java:112)
	at org.apache.brooklyn.rt.felix.EmbeddedFramework.getFramework(EmbeddedFramework.java:30)
	at org.apache.brooklyn.util.core.osgi.Osgis.getFramework(Osgis.java:301)
	at org.apache.brooklyn.core.mgmt.ha.OsgiManager.start(OsgiManager.java:273)
	at org.apache.brooklyn.core.mgmt.internal.LocalManagementContext.<init>(LocalManagementContext.java:184)
	at org.apache.brooklyn.core.mgmt.internal.LocalManagementContext.<init>(LocalManagementContext.java:163)
	at org.apache.brooklyn.core.mgmt.internal.LocalManagementContext.<init>(LocalManagementContext.java:149)
	at org.apache.brooklyn.rest.client.BrooklynApiRestClientTest.getManagementContext(BrooklynApiRestClientTest.java:66)
	at org.apache.brooklyn.rest.client.BrooklynApiRestClientTest.tearDown(BrooklynApiRestClientTest.java:87)
Caused by: org.osgi.framework.BundleException: Error creating bundle cache.
	at org.apache.felix.framework.Felix.init(Felix.java:697)
	at org.apache.felix.framework.Felix.init(Felix.java:626)
	at org.apache.brooklyn.rt.felix.EmbeddedFelixFramework.newFrameworkStarted(EmbeddedFelixFramework.java:107)
	... 37 more
Caused by: java.lang.RuntimeException: Unable to create cache directory.
	at org.apache.felix.framework.cache.BundleCache.<init>(BundleCache.java:131)
	at org.apache.felix.framework.Felix.init(Felix.java:692)
	... 39 more
2018-09-19 18:47:37,917 INFO  - TESTNG INVOKING CONFIGURATION: "Surefire test" - @BeforeMethod org.apache.brooklyn.rest.client.BrooklynApiUtilTest.newMockWebServer()
2018-09-19 18:47:37,924 INFO  - TESTNG PASSED CONFIGURATION: "Surefire test" - @BeforeMethod org.apache.brooklyn.rest.client.BrooklynApiUtilTest.newMockWebServer() finished in 7 ms
2018-09-19 18:47:37,925 INFO  - TESTNG INVOKING: "Surefire test" - org.apache.brooklyn.rest.client.BrooklynApiUtilTest.testDeployBlueprint()
[GC (Metadata GC Threshold)  66656K->10640K(753664K), 0.0183660 secs]
[Full GC (Metadata GC Threshold)  10640K->10251K(753664K), 0.0485724 secs]
Sep 19, 2018 6:47:38 PM com.google.mockwebserver.MockWebServer$2 processOneRequest
INFO: Received request: POST /v1/applications HTTP/1.1 and responded: HTTP/1.1 200 OK
2018-09-19 18:47:39,001 INFO  - TESTNG PASSED: "Surefire test" - org.apache.brooklyn.rest.client.BrooklynApiUtilTest.testDeployBlueprint() finished in 1077 ms
2018-09-19 18:47:39,002 INFO  - TESTNG INVOKING CONFIGURATION: "Surefire test" - @AfterMethod org.apache.brooklyn.rest.client.BrooklynApiUtilTest.shutDownServer()
2018-09-19 18:47:39,003 INFO  - TESTNG PASSED CONFIGURATION: "Surefire test" - @AfterMethod org.apache.brooklyn.rest.client.BrooklynApiUtilTest.shutDownServer() finished in 1 ms
2018-09-19 18:47:39,004 INFO  - TESTNG INVOKING CONFIGURATION: "Surefire test" - @BeforeMethod org.apache.brooklyn.rest.client.BrooklynApiUtilTest.newMockWebServer()
2018-09-19 18:47:39,005 INFO  - TESTNG PASSED CONFIGURATION: "Surefire test" - @BeforeMethod org.apache.brooklyn.rest.client.BrooklynApiUtilTest.newMockWebServer() finished in 1 ms
2018-09-19 18:47:39,006 INFO  - TESTNG INVOKING: "Surefire test" - org.apache.brooklyn.rest.client.BrooklynApiUtilTest.testWaitForRunningExitsCleanlyWhenAppRunning()
2018-09-19 18:47:39,036 INFO  - Waiting 5m from Wed Sep 19 18:47:39 UTC 2018 for application appId to be RUNNING
Sep 19, 2018 6:47:39 PM com.google.mockwebserver.MockWebServer$2 processOneRequest
INFO: Received request: GET /v1/applications/appId HTTP/1.1 and responded: HTTP/1.1 200 OK
2018-09-19 18:47:39,089 INFO  - Application appId is RUNNING
2018-09-19 18:47:39,090 INFO  - TESTNG PASSED: "Surefire test" - org.apache.brooklyn.rest.client.BrooklynApiUtilTest.testWaitForRunningExitsCleanlyWhenAppRunning() finished in 83 ms
2018-09-19 18:47:39,090 INFO  - TESTNG INVOKING CONFIGURATION: "Surefire test" - @AfterMethod org.apache.brooklyn.rest.client.BrooklynApiUtilTest.shutDownServer()
2018-09-19 18:47:39,091 INFO  - TESTNG PASSED CONFIGURATION: "Surefire test" - @AfterMethod org.apache.brooklyn.rest.client.BrooklynApiUtilTest.shutDownServer() finished in 1 ms
2018-09-19 18:47:39,092 INFO  - TESTNG INVOKING CONFIGURATION: "Surefire test" - @BeforeMethod org.apache.brooklyn.rest.client.BrooklynApiUtilTest.newMockWebServer()
2018-09-19 18:47:39,092 INFO  - TESTNG PASSED CONFIGURATION: "Surefire test" - @BeforeMethod org.apache.brooklyn.rest.client.BrooklynApiUtilTest.newMockWebServer() finished in 0 ms
2018-09-19 18:47:39,092 INFO  - TESTNG INVOKING: "Surefire test" - org.apache.brooklyn.rest.client.BrooklynApiUtilTest.testWaitForRunningFailsWhenAppStatusError()
2018-09-19 18:47:39,103 INFO  - Waiting 5m from Wed Sep 19 18:47:39 UTC 2018 for application appId to be RUNNING
Sep 19, 2018 6:47:39 PM com.google.mockwebserver.MockWebServer$2 processOneRequest
INFO: Received request: GET /v1/applications/appId HTTP/1.1 and responded: HTTP/1.1 200 OK
2018-09-19 18:47:39,119 WARN  - Application is not RUNNING within 5m. Status is: ERROR
2018-09-19 18:47:39,119 ERROR - Application is not running. Is: error
Sep 19, 2018 6:47:39 PM com.google.mockwebserver.MockWebServer$2 processOneRequest
INFO: Received request: GET /v1/activities/taskId HTTP/1.1 and responded: HTTP/1.1 200 OK
2018-09-19 18:47:39,171 INFO  - TESTNG PASSED: "Surefire test" - org.apache.brooklyn.rest.client.BrooklynApiUtilTest.testWaitForRunningFailsWhenAppStatusError() finished in 79 ms
2018-09-19 18:47:39,172 INFO  - TESTNG INVOKING CONFIGURATION: "Surefire test" - @AfterMethod org.apache.brooklyn.rest.client.BrooklynApiUtilTest.shutDownServer()
2018-09-19 18:47:39,173 INFO  - TESTNG PASSED CONFIGURATION: "Surefire test" - @AfterMethod org.apache.brooklyn.rest.client.BrooklynApiUtilTest.shutDownServer() finished in 1 ms
2018-09-19 18:47:39,173 INFO  - TESTNG INVOKING CONFIGURATION: "Surefire test" - @BeforeMethod org.apache.brooklyn.rest.client.BrooklynApiUtilTest.newMockWebServer()
2018-09-19 18:47:39,174 INFO  - TESTNG PASSED CONFIGURATION: "Surefire test" - @BeforeMethod org.apache.brooklyn.rest.client.BrooklynApiUtilTest.newMockWebServer() finished in 1 ms
2018-09-19 18:47:39,174 INFO  - TESTNG INVOKING: "Surefire test" - org.apache.brooklyn.rest.client.BrooklynApiUtilTest.testWaitForRunningFailsWhenAppStatusUnknown()
2018-09-19 18:47:39,180 INFO  - Waiting 5m from Wed Sep 19 18:47:39 UTC 2018 for application appId to be RUNNING
Sep 19, 2018 6:47:39 PM com.google.mockwebserver.MockWebServer$2 processOneRequest
INFO: Received request: GET /v1/applications/appId HTTP/1.1 and responded: HTTP/1.1 200 OK
2018-09-19 18:47:39,193 WARN  - Application is not RUNNING within 5m. Status is: UNKNOWN
2018-09-19 18:47:39,193 ERROR - Application is not running. Is: unknown
Sep 19, 2018 6:47:39 PM com.google.mockwebserver.MockWebServer$2 processOneRequest
INFO: Received request: GET /v1/activities/taskId HTTP/1.1 and responded: HTTP/1.1 200 OK
2018-09-19 18:47:39,239 INFO  - TESTNG PASSED: "Surefire test" - org.apache.brooklyn.rest.client.BrooklynApiUtilTest.testWaitForRunningFailsWhenAppStatusUnknown() finished in 65 ms
2018-09-19 18:47:39,240 INFO  - TESTNG INVOKING CONFIGURATION: "Surefire test" - @AfterMethod org.apache.brooklyn.rest.client.BrooklynApiUtilTest.shutDownServer()
2018-09-19 18:47:39,240 INFO  - TESTNG PASSED CONFIGURATION: "Surefire test" - @AfterMethod org.apache.brooklyn.rest.client.BrooklynApiUtilTest.shutDownServer() finished in 1 ms
2018-09-19 18:47:39,243 INFO  - TESTNG INVOKING: "Surefire test" - org.apache.brooklyn.rest.client.BrooklynApiGetEntityTest.testGetEntityAllowsEmptyMaps()
2018-09-19 18:47:39,299 INFO  - TESTNG PASSED: "Surefire test" - org.apache.brooklyn.rest.client.BrooklynApiGetEntityTest.testGetEntityAllowsEmptyMaps() finished in 57 ms
2018-09-19 18:47:39,300 INFO  - TESTNG INVOKING: "Surefire test" - org.apache.brooklyn.rest.client.BrooklynApiGetEntityTest.testGetEntityAllowsNull()
2018-09-19 18:47:39,300 INFO  - TESTNG PASSED: "Surefire test" - org.apache.brooklyn.rest.client.BrooklynApiGetEntityTest.testGetEntityAllowsNull() finished in 0 ms
2018-09-19 18:47:39,300 INFO  - TESTNG INVOKING: "Surefire test" - org.apache.brooklyn.rest.client.BrooklynApiGetEntityTest.testGetEntityDisallowsNull()
2018-09-19 18:47:39,301 INFO  - TESTNG PASSED: "Surefire test" - org.apache.brooklyn.rest.client.BrooklynApiGetEntityTest.testGetEntityDisallowsNull() finished in 1 ms
2018-09-19 18:47:39,301 INFO  - TESTNG INVOKING: "Surefire test" - org.apache.brooklyn.rest.client.BrooklynApiGetEntityTest.testGetEntityFailsIfLooksLikeApiError()
2018-09-19 18:47:39,307 INFO  - TESTNG PASSED: "Surefire test" - org.apache.brooklyn.rest.client.BrooklynApiGetEntityTest.testGetEntityFailsIfLooksLikeApiError() finished in 6 ms
2018-09-19 18:47:39,307 INFO  - TESTNG INVOKING: "Surefire test" - org.apache.brooklyn.rest.client.BrooklynApiGetEntityTest.testGetEntityFailsOnNonJson()
2018-09-19 18:47:39,310 INFO  - TESTNG PASSED: "Surefire test" - org.apache.brooklyn.rest.client.BrooklynApiGetEntityTest.testGetEntityFailsOnNonJson() finished in 3 ms
2018-09-19 18:47:39,310 INFO  - TESTNG INVOKING: "Surefire test" - org.apache.brooklyn.rest.client.BrooklynApiGetEntityTest.testGetEntityFailsWithMessageIfLooksLikeApiErrorWithMessage()
2018-09-19 18:47:39,312 INFO  - TESTNG PASSED: "Surefire test" - org.apache.brooklyn.rest.client.BrooklynApiGetEntityTest.testGetEntityFailsWithMessageIfLooksLikeApiErrorWithMessage() finished in 2 ms
2018-09-19 18:47:39,312 INFO  - TESTNG INVOKING: "Surefire test" - org.apache.brooklyn.rest.client.BrooklynApiGetEntityTest.testGetEntityIgnoresErrorResponseCodeInBasicResponse()
2018-09-19 18:47:39,315 INFO  - TESTNG PASSED: "Surefire test" - org.apache.brooklyn.rest.client.BrooklynApiGetEntityTest.testGetEntityIgnoresErrorResponseCodeInBasicResponse() finished in 2 ms
2018-09-19 18:47:39,315 INFO  - TESTNG INVOKING: "Surefire test" - org.apache.brooklyn.rest.client.BrooklynApiGetEntityTest.testGetEntityIgnoresErrorResponseCodeInBuiltResponse()
2018-09-19 18:47:39,317 INFO  - TESTNG PASSED: "Surefire test" - org.apache.brooklyn.rest.client.BrooklynApiGetEntityTest.testGetEntityIgnoresErrorResponseCodeInBuiltResponse() finished in 2 ms
2018-09-19 18:47:39,317 INFO  - TESTNG INVOKING: "Surefire test" - org.apache.brooklyn.rest.client.BrooklynApiGetEntityTest.testGetEntityIgnoresExtraFields()
2018-09-19 18:47:39,319 INFO  - TESTNG PASSED: "Surefire test" - org.apache.brooklyn.rest.client.BrooklynApiGetEntityTest.testGetEntityIgnoresExtraFields() finished in 2 ms
2018-09-19 18:47:39,320 INFO  - TESTNG INVOKING: "Surefire test" - org.apache.brooklyn.rest.client.BrooklynApiGetEntityTest.testGetEntitySucceedsIfLooksLikeApiErrorWhenWantingApiError()
2018-09-19 18:47:39,322 INFO  - TESTNG PASSED: "Surefire test" - org.apache.brooklyn.rest.client.BrooklynApiGetEntityTest.testGetEntitySucceedsIfLooksLikeApiErrorWhenWantingApiError() finished in 2 ms
2018-09-19 18:47:39,323 INFO  - TESTNG INVOKING: "Surefire test" - org.apache.brooklyn.rest.client.BrooklynApiGetEntityTest.testGetEntitySucceedsIfNoErrorCodeWhenApiError()
2018-09-19 18:47:39,325 INFO  - TESTNG PASSED: "Surefire test" - org.apache.brooklyn.rest.client.BrooklynApiGetEntityTest.testGetEntitySucceedsIfNoErrorCodeWhenApiError() finished in 2 ms
2018-09-19 18:47:39,326 INFO  - TESTNG INVOKING: "Surefire test" - org.apache.brooklyn.rest.client.BrooklynApiGetEntityTest.testGetSuccessfulEntityFailsOnAnyError()
2018-09-19 18:47:39,326 INFO  - TESTNG PASSED: "Surefire test" - org.apache.brooklyn.rest.client.BrooklynApiGetEntityTest.testGetSuccessfulEntityFailsOnAnyError() finished in 0 ms
2018-09-19 18:47:39,327 INFO  - TESTNG INVOKING: "Surefire test" - org.apache.brooklyn.rest.client.BrooklynApiGetEntityTest.testGetSuccessfulEntitySucceedsOnNoErrorApiError()
2018-09-19 18:47:39,327 INFO  - TESTNG PASSED: "Surefire test" - org.apache.brooklyn.rest.client.BrooklynApiGetEntityTest.testGetSuccessfulEntitySucceedsOnNoErrorApiError() finished in 0 ms
2018-09-19 18:47:39,381 INFO  - TESTNG 
===============================================
    Surefire test
    Tests run: 25, Failures: 0, Skips: 8
    Configuration Failures: 2, Skips: 0
===============================================
Tests run: 27, Failures: 2, Errors: 0, Skipped: 8, Time elapsed: 3.421 sec <<< FAILURE! - in TestSuite
setUp(org.apache.brooklyn.rest.client.BrooklynApiRestClientTest)  Time elapsed: 1.698 sec  <<< FAILURE!
org.apache.brooklyn.util.exceptions.PropagatedRuntimeException: 
	at org.apache.brooklyn.rest.client.BrooklynApiRestClientTest.getManagementContext(BrooklynApiRestClientTest.java:66)
	at org.apache.brooklyn.rest.client.BrooklynApiRestClientTest.setUp(BrooklynApiRestClientTest.java:77)
Caused by: org.osgi.framework.BundleException: Error creating bundle cache.
	at org.apache.brooklyn.rest.client.BrooklynApiRestClientTest.getManagementContext(BrooklynApiRestClientTest.java:66)
	at org.apache.brooklyn.rest.client.BrooklynApiRestClientTest.setUp(BrooklynApiRestClientTest.java:77)
Caused by: java.lang.RuntimeException: Unable to create cache directory.
	at org.apache.brooklyn.rest.client.BrooklynApiRestClientTest.getManagementContext(BrooklynApiRestClientTest.java:66)
	at org.apache.brooklyn.rest.client.BrooklynApiRestClientTest.setUp(BrooklynApiRestClientTest.java:77)

tearDown(org.apache.brooklyn.rest.client.BrooklynApiRestClientTest)  Time elapsed: 0.042 sec  <<< FAILURE!
org.apache.brooklyn.util.exceptions.PropagatedRuntimeException: 
	at org.apache.brooklyn.rest.client.BrooklynApiRestClientTest.getManagementContext(BrooklynApiRestClientTest.java:66)
	at org.apache.brooklyn.rest.client.BrooklynApiRestClientTest.tearDown(BrooklynApiRestClientTest.java:87)
Caused by: org.osgi.framework.BundleException: Error creating bundle cache.
	at org.apache.brooklyn.rest.client.BrooklynApiRestClientTest.getManagementContext(BrooklynApiRestClientTest.java:66)
	at org.apache.brooklyn.rest.client.BrooklynApiRestClientTest.tearDown(BrooklynApiRestClientTest.java:87)
Caused by: java.lang.RuntimeException: Unable to create cache directory.
	at org.apache.brooklyn.rest.client.BrooklynApiRestClientTest.getManagementContext(BrooklynApiRestClientTest.java:66)
	at org.apache.brooklyn.rest.client.BrooklynApiRestClientTest.tearDown(BrooklynApiRestClientTest.java:87)


Results :

Failed tests: 
  BrooklynApiRestClientTest.setUp:77->getManagementContext:66 » PropagatedRuntime
  BrooklynApiRestClientTest.tearDown:87->getManagementContext:66 » PropagatedRuntime

Tests run: 27, Failures: 2, Errors: 0, Skipped: 8

[INFO] ------------------------------------------------------------------------
[INFO] Reactor Summary:
[INFO] 
[INFO] Brooklyn Client .................................... SUCCESS [  3.315 s]
[INFO] Brooklyn Client Command Line Interface ............. SUCCESS [ 32.448 s]
[INFO] Brooklyn REST java Client .......................... FAILURE [ 35.483 s]
[INFO] ------------------------------------------------------------------------
[INFO] BUILD FAILURE
[INFO] ------------------------------------------------------------------------
[INFO] Total time: 01:15 min
[INFO] Finished at: 2018-09-19T18:47:39Z
[INFO] Final Memory: 71M/657M
[INFO] ------------------------------------------------------------------------
[ERROR] Failed to execute goal org.apache.maven.plugins:maven-surefire-plugin:2.19.1:test (default-test) on project brooklyn-rest-client: There are test failures.
[ERROR] 
[ERROR] Please refer to /usr/build/java/target/surefire-reports for the individual test results.
[ERROR] -> [Help 1]
[ERROR] 
[ERROR] To see the full stack trace of the errors, re-run Maven with the -e switch.
[ERROR] Re-run Maven using the -X switch to enable full debug logging.
[ERROR] 
[ERROR] For more information about the errors and possible solutions, please read the following articles:
[ERROR] [Help 1] http://cwiki.apache.org/confluence/display/MAVEN/MojoFailureException
[ERROR] 
[ERROR] After correcting the problems, you can resume the build with the command
[ERROR]   mvn <goals> -rf :brooklyn-rest-client
Build step 'Execute shell' marked build as failure
Recording test results
TestNG Reports Processing: START
Looking for TestNG results report in workspace using pattern: **/testng-results.xml
Saving reports...
Processing '/x1/jenkins/jenkins-home/jobs/brooklyn-client-master-docker/builds/17/testng/testng-results.xml'
TestNG Reports Processing: FINISH