osdir.com


[Date Prev][Date Next][Thread Prev][Thread Next][Date Index][Thread Index]

Build failed in Jenkins: brooklyn-master-build-docker #695


See <https://builds.apache.org/job/brooklyn-master-build-docker/695/display/redirect>

------------------------------------------
[...truncated 24.38 MB...]
[INFO] Exclude: **/src/test/resources/ssl/certs/localhost/info.txt
[INFO] Exclude: **/src/main/history/dependencies.xml
[INFO] Exclude: **/sandbox/examples/src/main/scripts/amis.txt
[INFO] Exclude: docs/**
[INFO] Exclude: **/.m2/**
[INFO] Exclude: scripts/README.md
[INFO] Exclude: docker/README.md
[INFO] 5 resources included (use -debug for more details)
[INFO] Rat check: Summary over all files. Unapproved: 0, unknown: 0, generated: 0, approved: 5 licenses.
[INFO] 
[INFO] --- maven-source-plugin:2.4:jar-no-fork (attach-sources) @ deb-packaging ---
[INFO] 
[INFO] --- maven-source-plugin:2.4:test-jar-no-fork (attach-sources) @ deb-packaging ---
[INFO] 
[INFO] --- maven-install-plugin:2.5.2:install (default-install) @ deb-packaging ---
[INFO] Installing /usr/build/brooklyn-dist/deb-packaging/pom.xml to /root/.m2/repository/org/apache/brooklyn/deb-packaging/1.0.0-SNAPSHOT/deb-packaging-1.0.0-SNAPSHOT.pom
[INFO] Installing /usr/build/brooklyn-dist/deb-packaging/target/apache-brooklyn-1.0.0-SNAPSHOT-all.deb to /root/.m2/repository/org/apache/brooklyn/deb-packaging/1.0.0-SNAPSHOT/deb-packaging-1.0.0-SNAPSHOT-all.deb
[INFO] 
[INFO] ------------------------------------------------------------------------
[INFO] Building Brooklyn Root 1.0.0-SNAPSHOT
[INFO] ------------------------------------------------------------------------
[INFO] 
[INFO] --- maven-clean-plugin:2.5:clean (default-clean) @ brooklyn ---
[INFO] Deleting /usr/build/target
[INFO] 
[INFO] --- maven-remote-resources-plugin:1.5:process (default) @ brooklyn ---
[INFO] 
[INFO] --- maven-site-plugin:3.4:attach-descriptor (attach-descriptor) @ brooklyn ---
[INFO] 
[INFO] --- maven-install-plugin:2.5.2:install (default-install) @ brooklyn ---
[INFO] Installing /usr/build/pom.xml to /root/.m2/repository/org/apache/brooklyn/brooklyn/1.0.0-SNAPSHOT/brooklyn-1.0.0-SNAPSHOT.pom
[INFO] ------------------------------------------------------------------------
[INFO] Reactor Summary:
[INFO] 
[INFO] Brooklyn Server Root ............................... SUCCESS [  4.767 s]
[INFO] Brooklyn Parent Project ............................ SUCCESS [  6.311 s]
[INFO] Brooklyn Test Support Utilities .................... SUCCESS [ 11.114 s]
[INFO] Brooklyn Logback Includable Configuration .......... SUCCESS [  0.602 s]
[INFO] Brooklyn Common Utilities .......................... SUCCESS [ 33.639 s]
[INFO] Brooklyn API ....................................... SUCCESS [  2.231 s]
[INFO] CAMP Server Parent Project ......................... SUCCESS [  0.165 s]
[INFO] CAMP Base .......................................... SUCCESS [  4.281 s]
[INFO] Brooklyn Test Support .............................. SUCCESS [  1.435 s]
[INFO] Brooklyn REST Swagger Apidoc Utilities ............. SUCCESS [ 14.601 s]
[INFO] Brooklyn Logback Configuration ..................... SUCCESS [  0.278 s]
[INFO] CAMP Server ........................................ SUCCESS [ 13.522 s]
[INFO] Brooklyn Felix Runtime ............................. SUCCESS [  4.011 s]
[INFO] Brooklyn Groovy Utilities .......................... SUCCESS [  2.699 s]
[INFO] Brooklyn Core ...................................... SUCCESS [04:51 min]
[INFO] Brooklyn Policies .................................. SUCCESS [ 40.034 s]
[INFO] Brooklyn WinRM Software Entities ................... SUCCESS [ 23.540 s]
[INFO] Brooklyn Secure JMXMP Agent ........................ SUCCESS [  9.242 s]
[INFO] Brooklyn JMX RMI Agent ............................. SUCCESS [  0.499 s]
[INFO] Brooklyn Jclouds Location Targets .................. SUCCESS [01:14 min]
[INFO] Brooklyn Software Base ............................. SUCCESS [01:40 min]
[INFO] Brooklyn CAMP ...................................... SUCCESS [03:18 min]
[INFO] Brooklyn Launcher Common ........................... SUCCESS [  5.280 s]
[INFO] Brooklyn REST API .................................. SUCCESS [  9.782 s]
[INFO] Brooklyn REST Resources ............................ SUCCESS [01:00 min]
[INFO] Brooklyn REST Server ............................... SUCCESS [ 29.507 s]
[INFO] Brooklyn Launcher .................................. SUCCESS [03:15 min]
[INFO] Brooklyn Container Location Targets ................ SUCCESS [ 13.830 s]
[INFO] Brooklyn Command Line Interface .................... SUCCESS [ 14.561 s]
[INFO] Brooklyn Test Framework ............................ SUCCESS [ 27.105 s]
[INFO] Brooklyn OSGi init ................................. SUCCESS [  5.911 s]
[INFO] Brooklyn OSGi start ................................ SUCCESS [  3.062 s]
[INFO] Brooklyn Karaf ..................................... SUCCESS [  0.029 s]
[INFO] Jetty config fragment .............................. SUCCESS [  1.609 s]
[INFO] Apache Http Component extension .................... SUCCESS [  0.290 s]
[INFO] Brooklyn Karaf Features ............................ SUCCESS [  1.016 s]
[INFO] Brooklyn Karaf Shell Commands ...................... SUCCESS [  9.770 s]
[INFO] Brooklyn UI :: Parent .............................. SUCCESS [  2.388 s]
[INFO] Brooklyn UI :: Modularity Server (parent) .......... SUCCESS [  0.129 s]
[INFO] Brooklyn UI :: Modularity Server :: UI Module API .. SUCCESS [  4.278 s]
[INFO] Brooklyn UI :: Modularity Server :: UI Module Registry SUCCESS [  2.230 s]
[INFO] Brooklyn UI :: Modularity Server :: UI Proxy ....... SUCCESS [  4.594 s]
[INFO] Brooklyn UI :: Modularity Server :: UI Metadata Registry SUCCESS [  0.682 s]
[INFO] Brooklyn UI :: Modularity Server :: External UI Modules Registration Hooks SUCCESS [  5.879 s]
[INFO] Brooklyn UI :: Modularity Server :: Features ....... SUCCESS [ 45.406 s]
[INFO] Brooklyn UI :: Modules (parent) .................... SUCCESS [  0.169 s]
[INFO] Brooklyn UI :: Modules - UI Utils .................. SUCCESS [ 55.750 s]
[INFO] Brooklyn UI :: Modules - Home ...................... SUCCESS [05:00 min]
[INFO] Brooklyn UI :: Modules - App inspector ............. SUCCESS [03:38 min]
[INFO] Brooklyn UI :: Modules - Blueprint composer ........ SUCCESS [03:33 min]
[INFO] Brooklyn UI :: Modules - Blueprint importer ........ SUCCESS [04:04 min]
[INFO] Brooklyn UI :: Modules - Catalog ................... SUCCESS [04:01 min]
[INFO] Brooklyn UI :: Modules - Location manager .......... SUCCESS [03:38 min]
[INFO] Brooklyn UI :: Modules - REST API Docs ............. SUCCESS [03:10 min]
[INFO] Brooklyn UI :: Modules - Groovy console ............ SUCCESS [03:14 min]
[INFO] Brooklyn UI :: Modules - Logout .................... SUCCESS [03:07 min]
[INFO] Brooklyn UI :: Modules - Features .................. SUCCESS [  7.949 s]
[INFO] Brooklyn UI :: Features ............................ SUCCESS [  0.155 s]
[INFO] Brooklyn Library Root .............................. SUCCESS [  0.185 s]
[INFO] Brooklyn CM Chef ................................... SUCCESS [  8.489 s]
[INFO] Brooklyn CM SaltStack .............................. SUCCESS [  6.450 s]
[INFO] Brooklyn CM Ansible ................................ SUCCESS [  4.635 s]
[INFO] Brooklyn CM Integration Root ....................... SUCCESS [  0.137 s]
[INFO] Brooklyn Network Software Entities ................. SUCCESS [  5.002 s]
[INFO] Brooklyn OSGi Software Entities .................... SUCCESS [  3.808 s]
[INFO] Brooklyn Database Software Entities ................ SUCCESS [  9.810 s]
[INFO] Brooklyn Web App Software Entities ................. SUCCESS [ 27.693 s]
[INFO] Brooklyn Messaging Software Entities ............... SUCCESS [ 30.496 s]
[INFO] Brooklyn NoSQL Data Store Software Entities ........ SUCCESS [ 41.376 s]
[INFO] Brooklyn Monitoring Software Entities .............. SUCCESS [  3.847 s]
[INFO] Brooklyn Web App Software Entities ................. SUCCESS [  0.212 s]
[INFO] Brooklyn QA ........................................ SUCCESS [ 11.946 s]
[INFO] Brooklyn Examples Aggregator Project ............... SUCCESS [  0.133 s]
[INFO] Brooklyn Examples Aggregator Project - Webapps ..... SUCCESS [  0.127 s]
[INFO] hello-world-webapp Maven Webapp .................... SUCCESS [  0.858 s]
[INFO] hello-world-sql-webapp Maven Webapp ................ SUCCESS [  2.714 s]
[INFO] Brooklyn Simple Web Cluster Example ................ SUCCESS [  5.993 s]
[INFO] Brooklyn Library Karaf integration ................. SUCCESS [  0.113 s]
[INFO] Brooklyn Library Catalog ........................... SUCCESS [  0.149 s]
[INFO] Brooklyn Library Karaf Features .................... SUCCESS [  0.352 s]
[INFO] Brooklyn Client .................................... SUCCESS [  0.121 s]
[INFO] Brooklyn Client Command Line Interface ............. SUCCESS [ 41.250 s]
[INFO] Brooklyn REST java Client .......................... SUCCESS [ 17.751 s]
[INFO] Brooklyn Downstream Project Parent ................. SUCCESS [  0.442 s]
[INFO] Brooklyn Dist Root ................................. SUCCESS [  0.128 s]
[INFO] Brooklyn All Things ................................ SUCCESS [  4.224 s]
[INFO] Brooklyn Distribution .............................. SUCCESS [ 18.499 s]
[INFO] Brooklyn Karaf Distribution Parent ................. SUCCESS [  0.025 s]
[INFO] Brooklyn Karaf Server Configuration ................ SUCCESS [  0.551 s]
[INFO] Brooklyn Dist Karaf Features ....................... SUCCESS [  0.049 s]
[INFO] Brooklyn Karaf Distribution ........................ SUCCESS [ 30.405 s]
[INFO] Brooklyn Karaf pax-exam itest ...................... SUCCESS [01:52 min]
[INFO] Brooklyn Vagrant Getting Started Environment ....... SUCCESS [  0.200 s]
[INFO] Brooklyn Quick-Start Project Archetype ............. SUCCESS [ 32.494 s]
[INFO] Brooklyn Shared Package Files ...................... SUCCESS [  0.274 s]
[INFO] Brooklyn RPM Package ............................... SUCCESS [ 20.428 s]
[INFO] Brooklyn DEB Package ............................... SUCCESS [ 14.804 s]
[INFO] Brooklyn Root ...................................... SUCCESS [  0.373 s]
[INFO] ------------------------------------------------------------------------
[INFO] BUILD SUCCESS
[INFO] ------------------------------------------------------------------------
[INFO] Total time: 01:03 h
[INFO] Finished at: 2018-09-19T09:55:58Z
[INFO] Final Memory: 225M/981M
[INFO] ------------------------------------------------------------------------
[Current build status] check if current [SUCCESS] is worse or equals then [SUCCESS] and better or equals then [SUCCESS]
Run condition [Current build status] enabling perform for step [Execute shell]
FATAL: Unable to produce a script file
Also:   hudson.remoting.Channel$CallSiteStackTrace: Remote call to H33
		at hudson.remoting.Channel.attachCallSiteStackTrace(Channel.java:1741)
		at hudson.remoting.UserRequest$ExceptionResponse.retrieve(UserRequest.java:357)
		at hudson.remoting.Channel.call(Channel.java:955)
		at hudson.FilePath.act(FilePath.java:1036)
		at hudson.FilePath.act(FilePath.java:1025)
		at hudson.FilePath.createTextTempFile(FilePath.java:1423)
		at hudson.tasks.CommandInterpreter.createScriptFile(CommandInterpreter.java:162)
		at hudson.tasks.CommandInterpreter.perform(CommandInterpreter.java:94)
		at hudson.tasks.CommandInterpreter.perform(CommandInterpreter.java:66)
		at org.jenkins_ci.plugins.run_condition.BuildStepRunner$2.run(BuildStepRunner.java:110)
		at org.jenkins_ci.plugins.run_condition.BuildStepRunner$Fail.conditionalRun(BuildStepRunner.java:154)
		at org.jenkins_ci.plugins.run_condition.BuildStepRunner.perform(BuildStepRunner.java:105)
		at org.jenkinsci.plugins.conditionalbuildstep.singlestep.SingleConditionalBuilder.perform(SingleConditionalBuilder.java:108)
		at hudson.tasks.BuildStepMonitor$1.perform(BuildStepMonitor.java:20)
		at hudson.model.AbstractBuild$AbstractBuildExecution.perform(AbstractBuild.java:744)
		at hudson.model.Build$BuildExecution.build(Build.java:206)
		at hudson.model.Build$BuildExecution.doRun(Build.java:163)
		at hudson.model.AbstractBuild$AbstractBuildExecution.run(AbstractBuild.java:504)
		at hudson.model.Run.execute(Run.java:1794)
		at hudson.model.FreeStyleBuild.run(FreeStyleBuild.java:43)
		at hudson.model.ResourceController.execute(ResourceController.java:97)
		at hudson.model.Executor.run(Executor.java:429)
java.io.IOException: No space left on device
	at java.io.FileOutputStream.writeBytes(Native Method)
	at java.io.FileOutputStream.write(FileOutputStream.java:326)
	at sun.nio.cs.StreamEncoder.writeBytes(StreamEncoder.java:221)
	at sun.nio.cs.StreamEncoder.implClose(StreamEncoder.java:316)
	at sun.nio.cs.StreamEncoder.close(StreamEncoder.java:149)
	at java.io.OutputStreamWriter.close(OutputStreamWriter.java:233)
	at hudson.FilePath$CreateTextTempFile.invoke(FilePath.java:1456)
	at hudson.FilePath$CreateTextTempFile.invoke(FilePath.java:1428)
	at hudson.FilePath$FileCallableWrapper.call(FilePath.java:2918)
	at hudson.remoting.UserRequest.perform(UserRequest.java:212)
	at hudson.remoting.UserRequest.perform(UserRequest.java:54)
	at hudson.remoting.Request$2.run(Request.java:369)
	at hudson.remoting.InterceptingExecutorService$1.call(InterceptingExecutorService.java:72)
	at java.util.concurrent.FutureTask.run(FutureTask.java:266)
	at java.util.concurrent.ThreadPoolExecutor.runWorker(ThreadPoolExecutor.java:1142)
	at java.util.concurrent.ThreadPoolExecutor$Worker.run(ThreadPoolExecutor.java:617)
	at java.lang.Thread.run(Thread.java:748)
Caused: java.io.IOException: remote file operation failed: <https://builds.apache.org/job/brooklyn-master-build-docker/ws/> at hudson.remoting.Channel@151643a6:H33
	at hudson.FilePath.act(FilePath.java:1043)
	at hudson.FilePath.act(FilePath.java:1025)
	at hudson.FilePath.createTextTempFile(FilePath.java:1423)
Caused: java.io.IOException: Failed to create a temp file on <https://builds.apache.org/job/brooklyn-master-build-docker/ws/>
	at hudson.FilePath.createTextTempFile(FilePath.java:1425)
	at hudson.tasks.CommandInterpreter.createScriptFile(CommandInterpreter.java:162)
	at hudson.tasks.CommandInterpreter.perform(CommandInterpreter.java:94)
	at hudson.tasks.CommandInterpreter.perform(CommandInterpreter.java:66)
	at org.jenkins_ci.plugins.run_condition.BuildStepRunner$2.run(BuildStepRunner.java:110)
	at org.jenkins_ci.plugins.run_condition.BuildStepRunner$Fail.conditionalRun(BuildStepRunner.java:154)
	at org.jenkins_ci.plugins.run_condition.BuildStepRunner.perform(BuildStepRunner.java:105)
	at org.jenkinsci.plugins.conditionalbuildstep.singlestep.SingleConditionalBuilder.perform(SingleConditionalBuilder.java:108)
	at hudson.tasks.BuildStepMonitor$1.perform(BuildStepMonitor.java:20)
	at hudson.model.AbstractBuild$AbstractBuildExecution.perform(AbstractBuild.java:744)
	at hudson.model.Build$BuildExecution.build(Build.java:206)
	at hudson.model.Build$BuildExecution.doRun(Build.java:163)
	at hudson.model.AbstractBuild$AbstractBuildExecution.run(AbstractBuild.java:504)
	at hudson.model.Run.execute(Run.java:1794)
	at hudson.model.FreeStyleBuild.run(FreeStyleBuild.java:43)
	at hudson.model.ResourceController.execute(ResourceController.java:97)
	at hudson.model.Executor.run(Executor.java:429)
Build step 'Conditional step (single)' marked build as failure
Recording test results
TestNG Reports Processing: START
Looking for TestNG results report in workspace using pattern: **/testng-results.xml
Saving reports...
Processing '/x1/jenkins/jenkins-home/jobs/brooklyn-master-build-docker/builds/695/testng/testng-results-1.xml'
Processing '/x1/jenkins/jenkins-home/jobs/brooklyn-master-build-docker/builds/695/testng/testng-results-10.xml'
Processing '/x1/jenkins/jenkins-home/jobs/brooklyn-master-build-docker/builds/695/testng/testng-results-11.xml'
Processing '/x1/jenkins/jenkins-home/jobs/brooklyn-master-build-docker/builds/695/testng/testng-results-12.xml'
Processing '/x1/jenkins/jenkins-home/jobs/brooklyn-master-build-docker/builds/695/testng/testng-results-13.xml'
Processing '/x1/jenkins/jenkins-home/jobs/brooklyn-master-build-docker/builds/695/testng/testng-results-14.xml'
Processing '/x1/jenkins/jenkins-home/jobs/brooklyn-master-build-docker/builds/695/testng/testng-results-15.xml'
Processing '/x1/jenkins/jenkins-home/jobs/brooklyn-master-build-docker/builds/695/testng/testng-results-16.xml'
Processing '/x1/jenkins/jenkins-home/jobs/brooklyn-master-build-docker/builds/695/testng/testng-results-17.xml'
Processing '/x1/jenkins/jenkins-home/jobs/brooklyn-master-build-docker/builds/695/testng/testng-results-18.xml'
Processing '/x1/jenkins/jenkins-home/jobs/brooklyn-master-build-docker/builds/695/testng/testng-results-19.xml'
Processing '/x1/jenkins/jenkins-home/jobs/brooklyn-master-build-docker/builds/695/testng/testng-results-2.xml'
Processing '/x1/jenkins/jenkins-home/jobs/brooklyn-master-build-docker/builds/695/testng/testng-results-20.xml'
Processing '/x1/jenkins/jenkins-home/jobs/brooklyn-master-build-docker/builds/695/testng/testng-results-21.xml'
Processing '/x1/jenkins/jenkins-home/jobs/brooklyn-master-build-docker/builds/695/testng/testng-results-22.xml'
Processing '/x1/jenkins/jenkins-home/jobs/brooklyn-master-build-docker/builds/695/testng/testng-results-23.xml'
Processing '/x1/jenkins/jenkins-home/jobs/brooklyn-master-build-docker/builds/695/testng/testng-results-24.xml'
Processing '/x1/jenkins/jenkins-home/jobs/brooklyn-master-build-docker/builds/695/testng/testng-results-25.xml'
Processing '/x1/jenkins/jenkins-home/jobs/brooklyn-master-build-docker/builds/695/testng/testng-results-26.xml'
Processing '/x1/jenkins/jenkins-home/jobs/brooklyn-master-build-docker/builds/695/testng/testng-results-27.xml'
Processing '/x1/jenkins/jenkins-home/jobs/brooklyn-master-build-docker/builds/695/testng/testng-results-28.xml'
Processing '/x1/jenkins/jenkins-home/jobs/brooklyn-master-build-docker/builds/695/testng/testng-results-29.xml'
Processing '/x1/jenkins/jenkins-home/jobs/brooklyn-master-build-docker/builds/695/testng/testng-results-3.xml'
Processing '/x1/jenkins/jenkins-home/jobs/brooklyn-master-build-docker/builds/695/testng/testng-results-30.xml'
Processing '/x1/jenkins/jenkins-home/jobs/brooklyn-master-build-docker/builds/695/testng/testng-results-31.xml'
Processing '/x1/jenkins/jenkins-home/jobs/brooklyn-master-build-docker/builds/695/testng/testng-results-32.xml'
Processing '/x1/jenkins/jenkins-home/jobs/brooklyn-master-build-docker/builds/695/testng/testng-results-33.xml'
Processing '/x1/jenkins/jenkins-home/jobs/brooklyn-master-build-docker/builds/695/testng/testng-results-34.xml'
Processing '/x1/jenkins/jenkins-home/jobs/brooklyn-master-build-docker/builds/695/testng/testng-results-35.xml'
Processing '/x1/jenkins/jenkins-home/jobs/brooklyn-master-build-docker/builds/695/testng/testng-results-36.xml'
Processing '/x1/jenkins/jenkins-home/jobs/brooklyn-master-build-docker/builds/695/testng/testng-results-37.xml'
Processing '/x1/jenkins/jenkins-home/jobs/brooklyn-master-build-docker/builds/695/testng/testng-results-4.xml'
Processing '/x1/jenkins/jenkins-home/jobs/brooklyn-master-build-docker/builds/695/testng/testng-results-5.xml'
Processing '/x1/jenkins/jenkins-home/jobs/brooklyn-master-build-docker/builds/695/testng/testng-results-6.xml'
Processing '/x1/jenkins/jenkins-home/jobs/brooklyn-master-build-docker/builds/695/testng/testng-results-7.xml'
Processing '/x1/jenkins/jenkins-home/jobs/brooklyn-master-build-docker/builds/695/testng/testng-results-8.xml'
Processing '/x1/jenkins/jenkins-home/jobs/brooklyn-master-build-docker/builds/695/testng/testng-results-9.xml'
Processing '/x1/jenkins/jenkins-home/jobs/brooklyn-master-build-docker/builds/695/testng/testng-results.xml'
TestNG Reports Processing: FINISH