osdir.com


[Date Prev][Date Next][Thread Prev][Thread Next][Date Index][Thread Index]

Build failed in Jenkins: brooklyn-master-build-docker #683


See <https://builds.apache.org/job/brooklyn-master-build-docker/683/display/redirect>

------------------------------------------
[...truncated 13.27 MB...]
2018-09-16 23:48:34,291 INFO  - GeoDns removing reference to TestEntityImpl{id=fdhifyd7dx}
2018-09-16 23:48:34,291 INFO  - GeoDns removing reference to TestEntityImpl{id=fomexqo883}
2018-09-16 23:48:34,295 WARN  mmarZhmr-[pkkjwrrbku] When unsubscribing from all of DynamicRegionsFabricImpl{id=ryjja1m88k}, unsubscribe of Subscription[y00kuNwp;DynamicRegionsFabricImpl{id=ryjja1m88k}@fdhifyd7dx:group.members.count] returned false
2018-09-16 23:48:34,295 WARN  mmarZhmr-[pkkjwrrbku] When unsubscribing from all of DynamicRegionsFabricImpl{id=ryjja1m88k}, unsubscribe of Subscription[G2RWQD7c;DynamicRegionsFabricImpl{id=ryjja1m88k}@fomexqo883:service.isUp] returned false
2018-09-16 23:48:34,295 WARN  mmarZhmr-[pkkjwrrbku] When unsubscribing from all of DynamicRegionsFabricImpl{id=ryjja1m88k}, unsubscribe of Subscription[FQ5K308q;DynamicRegionsFabricImpl{id=ryjja1m88k}@fomexqo883:service.state] returned false
2018-09-16 23:48:34,296 WARN  - Error calculating and setting aggregate for enricher Aggregator{uniqueTag=aggregator:fabric.size, running=true, entity=DynamicRegionsFabricImpl{id=ryjja1m88k}, id=lce7xcbd0a}
java.lang.IllegalStateException: Entity DynamicRegionsFabricImpl{id=ryjja1m88k} is no longer managed, when trying to publish Sensor: fabric.size (java.lang.Integer) 0
	at org.apache.brooklyn.core.entity.AbstractEntity$BasicSensorSupport.emitInternal(AbstractEntity.java:1082) ~[brooklyn-core-1.0.0-SNAPSHOT.jar:1.0.0-SNAPSHOT]
2018-09-16 23:48:34,296 ERROR - Problem refreshing group membership: java.lang.IllegalStateException: Entity DynamicGroupImpl{id=p7ef3ha40h} is no longer managed; execution context not available
java.lang.IllegalStateException: Entity DynamicGroupImpl{id=p7ef3ha40h} is no longer managed; execution context not available
	at org.apache.brooklyn.core.mgmt.internal.NonDeploymentManagementContext.getExecutionContext(NonDeploymentManagementContext.java:282) ~[brooklyn-core-1.0.0-SNAPSHOT.jar:1.0.0-SNAPSHOT]
2018-09-16 23:48:34,298 INFO  - TESTNG PASSED CONFIGURATION: "Surefire test" - @AfterMethod org.apache.brooklyn.core.test.BrooklynMgmtUnitTestSupport.tearDown() finished in 12 ms
2018-09-16 23:48:34,298 INFO  - TESTNG INVOKING CONFIGURATION: "Surefire test" - @BeforeMethod org.apache.brooklyn.entity.dns.AbstractGeoDnsServiceTest.setUp()
2018-09-16 23:48:34,298 INFO  - Added external config supplier named 'brooklyn-demo-sample': org.apache.brooklyn.core.config.external.InPlaceExternalConfigSupplier@57f9b467
2018-09-16 23:48:34,314 WARN  - Deprecated use of unmanaged location (SshMachineLocation[West child:null@100.0.0.1/100.0.0.1:22(id=dbu23jw6so)]); will be managed automatically now but not supported in future versions
2018-09-16 23:48:34,316 WARN  - Deprecated use of unmanaged location (SshMachineLocation[West child with location:null@100.0.0.1/100.0.0.1:22(id=frhjl5wrm6)]); will be managed automatically now but not supported in future versions
2018-09-16 23:48:34,317 WARN  - Deprecated use of unmanaged location (SshMachineLocation[East child:null@100.0.0.2/100.0.0.2:22(id=pyd8awz840)]); will be managed automatically now but not supported in future versions
2018-09-16 23:48:34,319 WARN  - Deprecated use of unmanaged location (SshMachineLocation[East child with location:null@100.0.0.2/100.0.0.2:22(id=s5c248558g)]); will be managed automatically now but not supported in future versions
2018-09-16 23:48:34,320 WARN  - Deprecated use of unmanaged location (SshMachineLocation[North child:null@10.0.0.1/10.0.0.1:22(id=r2dcuzcsgg)]); will be managed automatically now but not supported in future versions
2018-09-16 23:48:34,351 INFO  - TESTNG PASSED CONFIGURATION: "Surefire test" - @BeforeMethod org.apache.brooklyn.entity.dns.AbstractGeoDnsServiceTest.setUp() finished in 53 ms
2018-09-16 23:48:34,352 INFO  - TESTNG INVOKING: "Surefire test" - org.apache.brooklyn.entity.dns.AbstractGeoDnsServiceTest.testGeoInfoOnParentLocation()
2018-09-16 23:48:34,355 INFO  UCu3kco6-[atnjmtr9ls,gyx616gs1o] Creating entity in fabric DynamicRegionsFabricImpl{id=gyx616gs1o} at SshMachineLocation[West child:null@100.0.0.1/100.0.0.1:22(id=dbu23jw6so)]
2018-09-16 23:48:34,365 INFO  UCu3kco6-[atnjmtr9ls,gyx616gs1o] Creating entity in fabric DynamicRegionsFabricImpl{id=gyx616gs1o} at SshMachineLocation[East child:null@100.0.0.2/100.0.0.2:22(id=pyd8awz840)]
2018-09-16 23:48:34,367 INFO  - GeoDns TestService adding target host TestEntityImpl{id=ovg58pgrb6} HostGeoInfo[West child: <address-ignored> at (0.0,-60.0)]
2018-09-16 23:48:34,369 INFO  - GeoDns TestService adding target host TestEntityImpl{id=ovg58pgrb6} HostGeoInfo[West child: <address-ignored> at (0.0,-60.0)]
2018-09-16 23:48:34,370 INFO  - GeoDns TestService adding target host TestEntityImpl{id=ovg58pgrb6} HostGeoInfo[West child: <address-ignored> at (0.0,-60.0)]
2018-09-16 23:48:34,371 INFO  - GeoDns TestService adding target host TestEntityImpl{id=ovg58pgrb6} HostGeoInfo[West child: <address-ignored> at (0.0,-60.0)]
2018-09-16 23:48:34,373 INFO  - GeoDns TestService adding target host TestEntityImpl{id=ovg58pgrb6} HostGeoInfo[West child: <address-ignored> at (0.0,-60.0)]
2018-09-16 23:48:34,373 INFO  - GeoDns TestService adding target host TestEntityImpl{id=lj9tm3h5g3} HostGeoInfo[East child: <address-ignored> at (0.0,60.0)]
2018-09-16 23:48:34,374 INFO  - GeoDns TestService adding target host TestEntityImpl{id=ovg58pgrb6} HostGeoInfo[West child: <address-ignored> at (0.0,-60.0)]
2018-09-16 23:48:34,374 INFO  - GeoDns TestService adding target host TestEntityImpl{id=lj9tm3h5g3} HostGeoInfo[East child: <address-ignored> at (0.0,60.0)]
2018-09-16 23:48:34,375 INFO  - GeoDns TestService adding target host TestEntityImpl{id=ovg58pgrb6} HostGeoInfo[West child: <address-ignored> at (0.0,-60.0)]
2018-09-16 23:48:34,375 INFO  - GeoDns TestService adding target host TestEntityImpl{id=lj9tm3h5g3} HostGeoInfo[East child: <address-ignored> at (0.0,60.0)]
2018-09-16 23:48:34,385 INFO  - TESTNG PASSED: "Surefire test" - org.apache.brooklyn.entity.dns.AbstractGeoDnsServiceTest.testGeoInfoOnParentLocation() finished in 34 ms
2018-09-16 23:48:34,385 INFO  - TESTNG INVOKING CONFIGURATION: "Surefire test" - @AfterMethod org.apache.brooklyn.core.test.BrooklynMgmtUnitTestSupport.tearDown()
2018-09-16 23:48:34,389 INFO  - GeoDns removing reference to TestEntityImpl{id=ovg58pgrb6}
2018-09-16 23:48:34,389 INFO  - GeoDns removing reference to TestEntityImpl{id=lj9tm3h5g3}
2018-09-16 23:48:34,394 WARN  aqeCqWDC-[ud9xjiiv6t] Autodeployment not available for DynamicGroupImpl{id=ud9xjiiv6t}.rescanEntities
2018-09-16 23:48:34,394 WARN  aqeCqWDC-[ud9xjiiv6t] Error invoking rescanEntities at DynamicGroupImpl{id=ud9xjiiv6t}: Non-deployment context NonDeploymentManagementContext{entity=ud9xjiiv6t, mode=MANAGEMENT_STOPPED} is not valid for this operation: cannot invoke effector rescanEntities[] on entity DynamicGroupImpl{id=ud9xjiiv6t}
2018-09-16 23:48:34,396 INFO  - TESTNG PASSED CONFIGURATION: "Surefire test" - @AfterMethod org.apache.brooklyn.core.test.BrooklynMgmtUnitTestSupport.tearDown() finished in 11 ms
2018-09-16 23:48:34,396 INFO  - TESTNG INVOKING CONFIGURATION: "Surefire test" - @BeforeMethod org.apache.brooklyn.entity.dns.AbstractGeoDnsServiceTest.setUp()
2018-09-16 23:48:34,397 ERROR - Problem refreshing group membership: org.apache.brooklyn.core.mgmt.internal.EffectorUtils$EffectorCallPropagatedRuntimeException: Error invoking rescanEntities at DynamicGroupImpl{id=ud9xjiiv6t}: Non-deployment context NonDeploymentManagementContext{entity=ud9xjiiv6t, mode=MANAGEMENT_STOPPED} is not valid for this operation: cannot invoke effector rescanEntities[] on entity DynamicGroupImpl{id=ud9xjiiv6t}
org.apache.brooklyn.core.mgmt.internal.EffectorUtils$EffectorCallPropagatedRuntimeException: Error invoking rescanEntities at DynamicGroupImpl{id=ud9xjiiv6t}
	at org.apache.brooklyn.core.mgmt.internal.EffectorUtils$EffectorCallPropagatedRuntimeException.propagate(EffectorUtils.java:316) ~[brooklyn-core-1.0.0-SNAPSHOT.jar:1.0.0-SNAPSHOT]
Caused by: java.lang.IllegalStateException: Non-deployment context NonDeploymentManagementContext{entity=ud9xjiiv6t, mode=MANAGEMENT_STOPPED} is not valid for this operation: cannot invoke effector rescanEntities[] on entity DynamicGroupImpl{id=ud9xjiiv6t}
	at org.apache.brooklyn.core.mgmt.internal.NonDeploymentManagementContext.invokeEffectorMethodSync(NonDeploymentManagementContext.java:393) ~[brooklyn-core-1.0.0-SNAPSHOT.jar:1.0.0-SNAPSHOT]
2018-09-16 23:48:34,397 INFO  - Added external config supplier named 'brooklyn-demo-sample': org.apache.brooklyn.core.config.external.InPlaceExternalConfigSupplier@2373ad99
2018-09-16 23:48:34,409 WARN  - Deprecated use of unmanaged location (SshMachineLocation[West child:null@100.0.0.1/100.0.0.1:22(id=po2yliiftw)]); will be managed automatically now but not supported in future versions
2018-09-16 23:48:34,411 WARN  - Deprecated use of unmanaged location (SshMachineLocation[West child with location:null@100.0.0.1/100.0.0.1:22(id=fwgk6ivwpw)]); will be managed automatically now but not supported in future versions
2018-09-16 23:48:34,412 WARN  - Deprecated use of unmanaged location (SshMachineLocation[East child:null@100.0.0.2/100.0.0.2:22(id=vuwkr1ep2z)]); will be managed automatically now but not supported in future versions
2018-09-16 23:48:34,413 WARN  - Deprecated use of unmanaged location (SshMachineLocation[East child with location:null@100.0.0.2/100.0.0.2:22(id=q3mgolmjpv)]); will be managed automatically now but not supported in future versions
2018-09-16 23:48:34,415 WARN  - Deprecated use of unmanaged location (SshMachineLocation[North child:null@10.0.0.1/10.0.0.1:22(id=exj186eq6t)]); will be managed automatically now but not supported in future versions
2018-09-16 23:48:34,443 INFO  - TESTNG PASSED CONFIGURATION: "Surefire test" - @BeforeMethod org.apache.brooklyn.entity.dns.AbstractGeoDnsServiceTest.setUp() finished in 47 ms
2018-09-16 23:48:34,443 INFO  - TESTNG INVOKING: "Surefire test" - org.apache.brooklyn.entity.dns.AbstractGeoDnsServiceTest.testSubscribesToHostname()
2018-09-16 23:48:34,446 INFO  O3fmPAnM-[f7v8j5xijt,tndtu086rj] Creating entity in fabric DynamicRegionsFabricImpl{id=tndtu086rj} at SshMachineLocation[West child:null@100.0.0.1/100.0.0.1:22(id=po2yliiftw)]
2018-09-16 23:48:34,456 INFO  O3fmPAnM-[f7v8j5xijt,tndtu086rj] Creating entity in fabric DynamicRegionsFabricImpl{id=tndtu086rj} at SshMachineLocation[East child with location:null@100.0.0.2/100.0.0.2:22(id=q3mgolmjpv)]
2018-09-16 23:48:34,473 INFO  - GeoDns adding TestEntityImpl{id=yy419cnpjk} at HostGeoInfo[West child: 100.0.0.1 at (0.0,-60.0)]
2018-09-16 23:48:34,474 INFO  - GeoDns adding TestEntityImpl{id=kq5t3c9a1l} at HostGeoInfo[East child with location: 100.0.0.2 at (0.0,60.0)]
2018-09-16 23:48:34,474 INFO  - TESTNG PASSED: "Surefire test" - org.apache.brooklyn.entity.dns.AbstractGeoDnsServiceTest.testSubscribesToHostname() finished in 31 ms
2018-09-16 23:48:34,475 INFO  - TESTNG INVOKING CONFIGURATION: "Surefire test" - @AfterMethod org.apache.brooklyn.core.test.BrooklynMgmtUnitTestSupport.tearDown()
2018-09-16 23:48:34,478 INFO  - GeoDns removing reference to TestEntityImpl{id=yy419cnpjk}
2018-09-16 23:48:34,478 INFO  - GeoDns removing reference to TestEntityImpl{id=kq5t3c9a1l}
2018-09-16 23:48:34,484 WARN  - Error calculating and setting aggregate for enricher Aggregator{uniqueTag=aggregator:fabric.size, running=true, entity=DynamicRegionsFabricImpl{id=tndtu086rj}, id=j4f5dkmpiz}
java.lang.IllegalStateException: Entity DynamicRegionsFabricImpl{id=tndtu086rj} is no longer managed, when trying to publish Sensor: fabric.size (java.lang.Integer) 0
	at org.apache.brooklyn.core.entity.AbstractEntity$BasicSensorSupport.emitInternal(AbstractEntity.java:1082) ~[brooklyn-core-1.0.0-SNAPSHOT.jar:1.0.0-SNAPSHOT]
2018-09-16 23:48:34,485 ERROR O3fmPAnM-[f7v8j5xijt,tndtu086rj] Problem refreshing group membership: java.lang.IllegalStateException: Entity DynamicGroupImpl{id=sucfx0xpk7} is no longer managed; execution context not available
java.lang.IllegalStateException: Entity DynamicGroupImpl{id=sucfx0xpk7} is no longer managed; execution context not available
	at org.apache.brooklyn.core.mgmt.internal.NonDeploymentManagementContext.getExecutionContext(NonDeploymentManagementContext.java:282) ~[brooklyn-core-1.0.0-SNAPSHOT.jar:1.0.0-SNAPSHOT]
2018-09-16 23:48:34,485 INFO  - TESTNG PASSED CONFIGURATION: "Surefire test" - @AfterMethod org.apache.brooklyn.core.test.BrooklynMgmtUnitTestSupport.tearDown() finished in 10 ms
2018-09-16 23:48:34,485 INFO  - TESTNG INVOKING: "Surefire test" - org.apache.brooklyn.entity.proxy.ProxySslConfigTest.testFromMap()
2018-09-16 23:48:34,487 INFO  - TESTNG PASSED: "Surefire test" - org.apache.brooklyn.entity.proxy.ProxySslConfigTest.testFromMap() finished in 2 ms
2018-09-16 23:48:34,488 INFO  - TESTNG INVOKING: "Surefire test" - org.apache.brooklyn.entity.proxy.ProxySslConfigTest.testFromMapWithNullsAndDefaults()
2018-09-16 23:48:34,488 INFO  - TESTNG PASSED: "Surefire test" - org.apache.brooklyn.entity.proxy.ProxySslConfigTest.testFromMapWithNullsAndDefaults() finished in 0 ms
2018-09-16 23:48:34,528 INFO  - TESTNG 
===============================================
    Surefire test
    Tests run: 47, Failures: 1, Skips: 0
===============================================
Tests run: 47, Failures: 1, Errors: 0, Skipped: 0, Time elapsed: 15.927 sec <<< FAILURE! - in TestSuite
testStopOnChildUnmanaged(org.apache.brooklyn.entity.webapp.ControlledDynamicWebAppClusterTest)  Time elapsed: 0.217 sec  <<< FAILURE!
java.lang.AssertionError: entity=ControlledDynamicWebAppClusterImpl{id=iuo85eibik}; attribute=Sensor: service.state (org.apache.brooklyn.core.entity.lifecycle.Lifecycle) expected [stopped] but found [on-fire]
	at org.apache.brooklyn.entity.webapp.ControlledDynamicWebAppClusterTest.testStopOnChildUnmanaged(ControlledDynamicWebAppClusterTest.java:211)


Results :

Failed tests: 
  ControlledDynamicWebAppClusterTest.testStopOnChildUnmanaged:211 entity=ControlledDynamicWebAppClusterImpl{id=iuo85eibik}; attribute=Sensor: service.state (org.apache.brooklyn.core.entity.lifecycle.Lifecycle) expected [stopped] but found [on-fire]

Tests run: 47, Failures: 1, Errors: 0, Skipped: 0

[INFO] ------------------------------------------------------------------------
[INFO] Reactor Summary:
[INFO] 
[INFO] Brooklyn Server Root ............................... SUCCESS [  5.051 s]
[INFO] Brooklyn Parent Project ............................ SUCCESS [  4.940 s]
[INFO] Brooklyn Test Support Utilities .................... SUCCESS [ 10.079 s]
[INFO] Brooklyn Logback Includable Configuration .......... SUCCESS [  0.356 s]
[INFO] Brooklyn Common Utilities .......................... SUCCESS [ 28.566 s]
[INFO] Brooklyn API ....................................... SUCCESS [  1.350 s]
[INFO] CAMP Server Parent Project ......................... SUCCESS [  0.100 s]
[INFO] CAMP Base .......................................... SUCCESS [  3.957 s]
[INFO] Brooklyn Test Support .............................. SUCCESS [  0.876 s]
[INFO] Brooklyn REST Swagger Apidoc Utilities ............. SUCCESS [ 18.201 s]
[INFO] Brooklyn Logback Configuration ..................... SUCCESS [  0.173 s]
[INFO] CAMP Server ........................................ SUCCESS [ 14.334 s]
[INFO] Brooklyn Felix Runtime ............................. SUCCESS [  3.485 s]
[INFO] Brooklyn Groovy Utilities .......................... SUCCESS [  2.043 s]
[INFO] Brooklyn Core ...................................... SUCCESS [03:17 min]
[INFO] Brooklyn Policies .................................. SUCCESS [ 28.173 s]
[INFO] Brooklyn WinRM Software Entities ................... SUCCESS [ 22.200 s]
[INFO] Brooklyn Secure JMXMP Agent ........................ SUCCESS [  8.145 s]
[INFO] Brooklyn JMX RMI Agent ............................. SUCCESS [  0.334 s]
[INFO] Brooklyn Jclouds Location Targets .................. SUCCESS [01:18 min]
[INFO] Brooklyn Software Base ............................. SUCCESS [01:08 min]
[INFO] Brooklyn CAMP ...................................... SUCCESS [02:07 min]
[INFO] Brooklyn Launcher Common ........................... SUCCESS [  5.267 s]
[INFO] Brooklyn REST API .................................. SUCCESS [  8.013 s]
[INFO] Brooklyn REST Resources ............................ SUCCESS [ 50.657 s]
[INFO] Brooklyn REST Server ............................... SUCCESS [ 23.603 s]
[INFO] Brooklyn Launcher .................................. SUCCESS [01:07 min]
[INFO] Brooklyn Container Location Targets ................ SUCCESS [ 13.601 s]
[INFO] Brooklyn Command Line Interface .................... SUCCESS [ 11.549 s]
[INFO] Brooklyn Test Framework ............................ SUCCESS [ 20.344 s]
[INFO] Brooklyn OSGi init ................................. SUCCESS [  5.893 s]
[INFO] Brooklyn OSGi start ................................ SUCCESS [  1.785 s]
[INFO] Brooklyn Karaf ..................................... SUCCESS [  0.023 s]
[INFO] Jetty config fragment .............................. SUCCESS [  1.293 s]
[INFO] Apache Http Component extension .................... SUCCESS [  0.213 s]
[INFO] Brooklyn Karaf Features ............................ SUCCESS [  0.789 s]
[INFO] Brooklyn Karaf Shell Commands ...................... SUCCESS [ 10.154 s]
[INFO] Brooklyn UI :: Parent .............................. SUCCESS [  2.251 s]
[INFO] Brooklyn UI :: Modularity Server (parent) .......... SUCCESS [  0.090 s]
[INFO] Brooklyn UI :: Modularity Server :: UI Module API .. SUCCESS [  4.405 s]
[INFO] Brooklyn UI :: Modularity Server :: UI Module Registry SUCCESS [  2.380 s]
[INFO] Brooklyn UI :: Modularity Server :: UI Proxy ....... SUCCESS [  4.226 s]
[INFO] Brooklyn UI :: Modularity Server :: UI Metadata Registry SUCCESS [  0.528 s]
[INFO] Brooklyn UI :: Modularity Server :: External UI Modules Registration Hooks SUCCESS [  4.760 s]
[INFO] Brooklyn UI :: Modularity Server :: Features ....... SUCCESS [ 49.230 s]
[INFO] Brooklyn UI :: Modules (parent) .................... SUCCESS [  0.155 s]
[INFO] Brooklyn UI :: Modules - UI Utils .................. SUCCESS [ 51.032 s]
[INFO] Brooklyn UI :: Modules - Home ...................... SUCCESS [03:20 min]
[INFO] Brooklyn UI :: Modules - App inspector ............. SUCCESS [03:09 min]
[INFO] Brooklyn UI :: Modules - Blueprint composer ........ SUCCESS [03:19 min]
[INFO] Brooklyn UI :: Modules - Blueprint importer ........ SUCCESS [02:55 min]
[INFO] Brooklyn UI :: Modules - Catalog ................... SUCCESS [03:08 min]
[INFO] Brooklyn UI :: Modules - Location manager .......... SUCCESS [02:57 min]
[INFO] Brooklyn UI :: Modules - REST API Docs ............. SUCCESS [03:00 min]
[INFO] Brooklyn UI :: Modules - Groovy console ............ SUCCESS [02:53 min]
[INFO] Brooklyn UI :: Modules - Logout .................... SUCCESS [02:56 min]
[INFO] Brooklyn UI :: Modules - Features .................. SUCCESS [  5.846 s]
[INFO] Brooklyn UI :: Features ............................ SUCCESS [  0.109 s]
[INFO] Brooklyn Library Root .............................. SUCCESS [  0.120 s]
[INFO] Brooklyn CM Chef ................................... SUCCESS [  6.283 s]
[INFO] Brooklyn CM SaltStack .............................. SUCCESS [  5.485 s]
[INFO] Brooklyn CM Ansible ................................ SUCCESS [  3.859 s]
[INFO] Brooklyn CM Integration Root ....................... SUCCESS [  0.096 s]
[INFO] Brooklyn Network Software Entities ................. SUCCESS [  4.291 s]
[INFO] Brooklyn OSGi Software Entities .................... SUCCESS [  3.505 s]
[INFO] Brooklyn Database Software Entities ................ SUCCESS [  8.633 s]
[INFO] Brooklyn Web App Software Entities ................. FAILURE [ 23.517 s]
[INFO] Brooklyn Messaging Software Entities ............... SKIPPED
[INFO] Brooklyn NoSQL Data Store Software Entities ........ SKIPPED
[INFO] Brooklyn Monitoring Software Entities .............. SKIPPED
[INFO] Brooklyn Web App Software Entities ................. SKIPPED
[INFO] Brooklyn QA ........................................ SKIPPED
[INFO] Brooklyn Examples Aggregator Project ............... SKIPPED
[INFO] Brooklyn Examples Aggregator Project - Webapps ..... SKIPPED
[INFO] hello-world-webapp Maven Webapp .................... SKIPPED
[INFO] hello-world-sql-webapp Maven Webapp ................ SKIPPED
[INFO] Brooklyn Simple Web Cluster Example ................ SKIPPED
[INFO] Brooklyn Library Karaf integration ................. SKIPPED
[INFO] Brooklyn Library Catalog ........................... SKIPPED
[INFO] Brooklyn Library Karaf Features .................... SKIPPED
[INFO] Brooklyn Client .................................... SKIPPED
[INFO] Brooklyn Client Command Line Interface ............. SKIPPED
[INFO] Brooklyn REST java Client .......................... SKIPPED
[INFO] Brooklyn Downstream Project Parent ................. SKIPPED
[INFO] Brooklyn Dist Root ................................. SKIPPED
[INFO] Brooklyn All Things ................................ SKIPPED
[INFO] Brooklyn Distribution .............................. SKIPPED
[INFO] Brooklyn Karaf Distribution Parent ................. SKIPPED
[INFO] Brooklyn Karaf Server Configuration ................ SKIPPED
[INFO] Brooklyn Dist Karaf Features ....................... SKIPPED
[INFO] Brooklyn Karaf Distribution ........................ SKIPPED
[INFO] Brooklyn Karaf pax-exam itest ...................... SKIPPED
[INFO] Brooklyn Vagrant Getting Started Environment ....... SKIPPED
[INFO] Brooklyn Quick-Start Project Archetype ............. SKIPPED
[INFO] Brooklyn Shared Package Files ...................... SKIPPED
[INFO] Brooklyn RPM Package ............................... SKIPPED
[INFO] Brooklyn DEB Package ............................... SKIPPED
[INFO] Brooklyn Root ...................................... SKIPPED
[INFO] ------------------------------------------------------------------------
[INFO] BUILD FAILURE
[INFO] ------------------------------------------------------------------------
[INFO] Total time: 45:04 min
[INFO] Finished at: 2018-09-16T23:48:35Z
[INFO] Final Memory: 173M/971M
[INFO] ------------------------------------------------------------------------
[ERROR] Failed to execute goal org.apache.maven.plugins:maven-surefire-plugin:2.19.1:test (default-test) on project brooklyn-software-webapp: There are test failures.
[ERROR] 
[ERROR] Please refer to /usr/build/brooklyn-library/software/webapp/target/surefire-reports for the individual test results.
[ERROR] -> [Help 1]
[ERROR] 
[ERROR] To see the full stack trace of the errors, re-run Maven with the -e switch.
[ERROR] Re-run Maven using the -X switch to enable full debug logging.
[ERROR] 
[ERROR] For more information about the errors and possible solutions, please read the following articles:
[ERROR] [Help 1] http://cwiki.apache.org/confluence/display/MAVEN/MojoFailureException
[ERROR] 
[ERROR] After correcting the problems, you can resume the build with the command
[ERROR]   mvn <goals> -rf :brooklyn-software-webapp
Build step 'Execute shell' marked build as failure
Recording test results
TestNG Reports Processing: START
Looking for TestNG results report in workspace using pattern: **/testng-results.xml
Saving reports...
Processing '/x1/jenkins/jenkins-home/jobs/brooklyn-master-build-docker/builds/683/testng/testng-results-1.xml'
Processing '/x1/jenkins/jenkins-home/jobs/brooklyn-master-build-docker/builds/683/testng/testng-results-10.xml'
Processing '/x1/jenkins/jenkins-home/jobs/brooklyn-master-build-docker/builds/683/testng/testng-results-11.xml'
Processing '/x1/jenkins/jenkins-home/jobs/brooklyn-master-build-docker/builds/683/testng/testng-results-12.xml'
Processing '/x1/jenkins/jenkins-home/jobs/brooklyn-master-build-docker/builds/683/testng/testng-results-13.xml'
Processing '/x1/jenkins/jenkins-home/jobs/brooklyn-master-build-docker/builds/683/testng/testng-results-14.xml'
Processing '/x1/jenkins/jenkins-home/jobs/brooklyn-master-build-docker/builds/683/testng/testng-results-15.xml'
Processing '/x1/jenkins/jenkins-home/jobs/brooklyn-master-build-docker/builds/683/testng/testng-results-16.xml'
Processing '/x1/jenkins/jenkins-home/jobs/brooklyn-master-build-docker/builds/683/testng/testng-results-17.xml'
Processing '/x1/jenkins/jenkins-home/jobs/brooklyn-master-build-docker/builds/683/testng/testng-results-18.xml'
Processing '/x1/jenkins/jenkins-home/jobs/brooklyn-master-build-docker/builds/683/testng/testng-results-19.xml'
Processing '/x1/jenkins/jenkins-home/jobs/brooklyn-master-build-docker/builds/683/testng/testng-results-2.xml'
Processing '/x1/jenkins/jenkins-home/jobs/brooklyn-master-build-docker/builds/683/testng/testng-results-20.xml'
Processing '/x1/jenkins/jenkins-home/jobs/brooklyn-master-build-docker/builds/683/testng/testng-results-21.xml'
Processing '/x1/jenkins/jenkins-home/jobs/brooklyn-master-build-docker/builds/683/testng/testng-results-22.xml'
Processing '/x1/jenkins/jenkins-home/jobs/brooklyn-master-build-docker/builds/683/testng/testng-results-23.xml'
Processing '/x1/jenkins/jenkins-home/jobs/brooklyn-master-build-docker/builds/683/testng/testng-results-24.xml'
Processing '/x1/jenkins/jenkins-home/jobs/brooklyn-master-build-docker/builds/683/testng/testng-results-25.xml'
Processing '/x1/jenkins/jenkins-home/jobs/brooklyn-master-build-docker/builds/683/testng/testng-results-26.xml'
Processing '/x1/jenkins/jenkins-home/jobs/brooklyn-master-build-docker/builds/683/testng/testng-results-27.xml'
Processing '/x1/jenkins/jenkins-home/jobs/brooklyn-master-build-docker/builds/683/testng/testng-results-28.xml'
Processing '/x1/jenkins/jenkins-home/jobs/brooklyn-master-build-docker/builds/683/testng/testng-results-29.xml'
Processing '/x1/jenkins/jenkins-home/jobs/brooklyn-master-build-docker/builds/683/testng/testng-results-3.xml'
Processing '/x1/jenkins/jenkins-home/jobs/brooklyn-master-build-docker/builds/683/testng/testng-results-4.xml'
Processing '/x1/jenkins/jenkins-home/jobs/brooklyn-master-build-docker/builds/683/testng/testng-results-5.xml'
Processing '/x1/jenkins/jenkins-home/jobs/brooklyn-master-build-docker/builds/683/testng/testng-results-6.xml'
Processing '/x1/jenkins/jenkins-home/jobs/brooklyn-master-build-docker/builds/683/testng/testng-results-7.xml'
Processing '/x1/jenkins/jenkins-home/jobs/brooklyn-master-build-docker/builds/683/testng/testng-results-8.xml'
Processing '/x1/jenkins/jenkins-home/jobs/brooklyn-master-build-docker/builds/683/testng/testng-results-9.xml'
Processing '/x1/jenkins/jenkins-home/jobs/brooklyn-master-build-docker/builds/683/testng/testng-results.xml'
0.019623% of tests failed, which exceeded threshold of 0%. Marking build as UNSTABLE
TestNG Reports Processing: FINISH