osdir.com


[Date Prev][Date Next][Thread Prev][Thread Next][Date Index][Thread Index]

Build failed in Jenkins: brooklyn-server-master-docker #121


See <https://builds.apache.org/job/brooklyn-server-master-docker/121/display/redirect?page=changes>

Changes:

[aled.sage] Bump karaf to 4.1.6 (from 4.1.2)

------------------------------------------
[...truncated 5.84 MB...]
2018-09-15 21:40:18,597 INFO  - Added external config supplier named 'brooklyn-demo-sample': org.apache.brooklyn.core.config.external.InPlaceExternalConfigSupplier@60dc1a4e
2018-09-15 21:40:18,629 INFO  - TESTNG PASSED CONFIGURATION: "Surefire test" - @BeforeMethod org.apache.brooklyn.policy.ha.ServiceRestarterTest.setUp() finished in 32 ms
2018-09-15 21:40:18,629 INFO  - TESTNG INVOKING: "Surefire test" - org.apache.brooklyn.policy.ha.ServiceRestarterTest.testDoesNotSetOnFireOnFailure()
2018-09-15 21:40:18,649 INFO  - ServiceRestarter notified; dispatching job for FailingEntityImpl{id=slik0oc0q5} (FailureDescriptor{component=FailingEntityImpl{id=slik0oc0q5}, description=simulate failure})
2018-09-15 21:40:18,649 WARN  - ServiceRestarter acting on failure detected at FailingEntityImpl{id=slik0oc0q5} (FailureDescriptor{component=FailingEntityImpl{id=slik0oc0q5}, description=simulate failure})
2018-09-15 21:40:18,651 WARN  LVjbczqS-[de2g67rijf,slik0oc0q5] Error invoking restart at FailingEntityImpl{id=slik0oc0q5}: Simulating entity restart failure for test
2018-09-15 21:40:18,654 WARN  - ServiceRestarter failed for FailingEntityImpl{id=slik0oc0q5}: Restart failure (error java.util.concurrent.ExecutionException: org.apache.brooklyn.core.mgmt.internal.EffectorUtils$EffectorCallPropagatedRuntimeException: Error invoking restart at FailingEntityImpl{id=slik0oc0q5}: Simulating entity restart failure for test) at FailingEntityImpl{id=slik0oc0q5}: FailureDescriptor{component=FailingEntityImpl{id=slik0oc0q5}, description=simulate failure}
2018-09-15 21:40:19,652 INFO  - TESTNG PASSED: "Surefire test" - org.apache.brooklyn.policy.ha.ServiceRestarterTest.testDoesNotSetOnFireOnFailure() finished in 1023 ms
2018-09-15 21:40:19,652 INFO  - TESTNG INVOKING CONFIGURATION: "Surefire test" - @AfterMethod org.apache.brooklyn.core.test.BrooklynMgmtUnitTestSupport.tearDown()
2018-09-15 21:40:19,663 INFO  - TESTNG PASSED CONFIGURATION: "Surefire test" - @AfterMethod org.apache.brooklyn.core.test.BrooklynMgmtUnitTestSupport.tearDown() finished in 11 ms
2018-09-15 21:40:19,664 INFO  - TESTNG INVOKING CONFIGURATION: "Surefire test" - @BeforeMethod org.apache.brooklyn.policy.ha.ServiceRestarterTest.setUp()
2018-09-15 21:40:19,664 INFO  - Added external config supplier named 'brooklyn-demo-sample': org.apache.brooklyn.core.config.external.InPlaceExternalConfigSupplier@5e5ddfbc
2018-09-15 21:40:19,691 INFO  - TESTNG PASSED CONFIGURATION: "Surefire test" - @BeforeMethod org.apache.brooklyn.policy.ha.ServiceRestarterTest.setUp() finished in 28 ms
2018-09-15 21:40:19,692 INFO  - TESTNG INVOKING: "Surefire test" - org.apache.brooklyn.policy.ha.ServiceRestarterTest.testEmitsFailureEventWhenRestarterFails()
2018-09-15 21:40:19,707 INFO  - ServiceRestarter notified; dispatching job for FailingEntityImpl{id=qab770p1u4} (FailureDescriptor{component=FailingEntityImpl{id=qab770p1u4}, description=simulate failure})
2018-09-15 21:40:19,708 WARN  - ServiceRestarter acting on failure detected at FailingEntityImpl{id=qab770p1u4} (FailureDescriptor{component=FailingEntityImpl{id=qab770p1u4}, description=simulate failure})
2018-09-15 21:40:19,710 WARN  dlB8bZy5-[wymaqgissd,qab770p1u4] Setting FailingEntityImpl{id=qab770p1u4} on-fire due to problems when expected running, up=false, not-up-indicators: null
2018-09-15 21:40:19,711 WARN  dlB8bZy5-[wymaqgissd,qab770p1u4] Error invoking restart at FailingEntityImpl{id=qab770p1u4}: Simulating entity restart failure for test
2018-09-15 21:40:19,713 WARN  - ServiceRestarter failed for FailingEntityImpl{id=qab770p1u4}: Restart failure (error java.util.concurrent.ExecutionException: org.apache.brooklyn.core.mgmt.internal.EffectorUtils$EffectorCallPropagatedRuntimeException: Error invoking restart at FailingEntityImpl{id=qab770p1u4}: Simulating entity restart failure for test) at FailingEntityImpl{id=qab770p1u4}: FailureDescriptor{component=FailingEntityImpl{id=qab770p1u4}, description=simulate failure}
2018-09-15 21:40:19,715 INFO  - TESTNG PASSED: "Surefire test" - org.apache.brooklyn.policy.ha.ServiceRestarterTest.testEmitsFailureEventWhenRestarterFails() finished in 24 ms
2018-09-15 21:40:19,716 INFO  - TESTNG INVOKING CONFIGURATION: "Surefire test" - @AfterMethod org.apache.brooklyn.core.test.BrooklynMgmtUnitTestSupport.tearDown()
2018-09-15 21:40:19,724 INFO  - TESTNG PASSED CONFIGURATION: "Surefire test" - @AfterMethod org.apache.brooklyn.core.test.BrooklynMgmtUnitTestSupport.tearDown() finished in 7 ms
2018-09-15 21:40:19,724 INFO  - TESTNG INVOKING CONFIGURATION: "Surefire test" - @BeforeMethod org.apache.brooklyn.policy.ha.ServiceRestarterTest.setUp()
2018-09-15 21:40:19,724 INFO  - Added external config supplier named 'brooklyn-demo-sample': org.apache.brooklyn.core.config.external.InPlaceExternalConfigSupplier@89caf47
2018-09-15 21:40:19,747 INFO  - TESTNG PASSED CONFIGURATION: "Surefire test" - @BeforeMethod org.apache.brooklyn.policy.ha.ServiceRestarterTest.setUp() finished in 23 ms
2018-09-15 21:40:19,747 INFO  - TESTNG INVOKING: "Surefire test" - org.apache.brooklyn.policy.ha.ServiceRestarterTest.testRestartDoesNotBlockOtherSubscriptions()
2018-09-15 21:40:19,762 INFO  - ServiceRestarter notified; dispatching job for FailingEntityImpl{id=bzx1tf6zn5} (FailureDescriptor{component=TestEntityImpl{id=nkeg7oell4}, description=simulate failure})
2018-09-15 21:40:19,762 WARN  - ServiceRestarter acting on failure detected at FailingEntityImpl{id=bzx1tf6zn5} (FailureDescriptor{component=TestEntityImpl{id=nkeg7oell4}, description=simulate failure})
2018-09-15 21:40:19,767 WARN  SRrsytPY-[on6svtd88z,bzx1tf6zn5] Setting FailingEntityImpl{id=bzx1tf6zn5} on-fire due to problems when expected running, up=false, not-up-indicators: null
2018-09-15 21:40:19,769 INFO  - TESTNG PASSED: "Surefire test" - org.apache.brooklyn.policy.ha.ServiceRestarterTest.testRestartDoesNotBlockOtherSubscriptions() finished in 22 ms
2018-09-15 21:40:19,770 INFO  - TESTNG INVOKING CONFIGURATION: "Surefire test" - @AfterMethod org.apache.brooklyn.core.test.BrooklynMgmtUnitTestSupport.tearDown()
2018-09-15 21:40:19,770 WARN  SRrsytPY-[on6svtd88z,bzx1tf6zn5] Error invoking restart at FailingEntityImpl{id=bzx1tf6zn5}: Simulating entity restart failure for test
2018-09-15 21:40:19,772 WARN  - ServiceRestarter failed for FailingEntityImpl{id=bzx1tf6zn5}: Restart failure (error java.util.concurrent.ExecutionException: org.apache.brooklyn.core.mgmt.internal.EffectorUtils$EffectorCallPropagatedRuntimeException: Error invoking restart at FailingEntityImpl{id=bzx1tf6zn5}: Simulating entity restart failure for test) at FailingEntityImpl{id=bzx1tf6zn5}: FailureDescriptor{component=TestEntityImpl{id=nkeg7oell4}, description=simulate failure}
2018-09-15 21:40:19,779 INFO  - TESTNG PASSED CONFIGURATION: "Surefire test" - @AfterMethod org.apache.brooklyn.core.test.BrooklynMgmtUnitTestSupport.tearDown() finished in 10 ms
2018-09-15 21:40:19,780 INFO  - TESTNG INVOKING CONFIGURATION: "Surefire test" - @BeforeMethod org.apache.brooklyn.policy.ha.ServiceRestarterTest.setUp()
2018-09-15 21:40:19,780 INFO  - Added external config supplier named 'brooklyn-demo-sample': org.apache.brooklyn.core.config.external.InPlaceExternalConfigSupplier@1472208d
2018-09-15 21:40:19,800 INFO  - TESTNG PASSED CONFIGURATION: "Surefire test" - @BeforeMethod org.apache.brooklyn.policy.ha.ServiceRestarterTest.setUp() finished in 20 ms
2018-09-15 21:40:19,800 INFO  - TESTNG INVOKING: "Surefire test" - org.apache.brooklyn.policy.ha.ServiceRestarterTest.testRestartsOnFailure()
2018-09-15 21:40:19,801 INFO  - ServiceRestarter notified; dispatching job for TestEntityImpl{id=dzcr306rqq} (FailureDescriptor{component=TestEntityImpl{id=dzcr306rqq}, description=simulate failure})
2018-09-15 21:40:19,801 WARN  - ServiceRestarter acting on failure detected at TestEntityImpl{id=dzcr306rqq} (FailureDescriptor{component=TestEntityImpl{id=dzcr306rqq}, description=simulate failure})
2018-09-15 21:40:19,803 INFO  - TESTNG PASSED: "Surefire test" - org.apache.brooklyn.policy.ha.ServiceRestarterTest.testRestartsOnFailure() finished in 2 ms
2018-09-15 21:40:19,803 INFO  - TESTNG INVOKING CONFIGURATION: "Surefire test" - @AfterMethod org.apache.brooklyn.core.test.BrooklynMgmtUnitTestSupport.tearDown()
2018-09-15 21:40:19,808 INFO  - TESTNG PASSED CONFIGURATION: "Surefire test" - @AfterMethod org.apache.brooklyn.core.test.BrooklynMgmtUnitTestSupport.tearDown() finished in 5 ms
2018-09-15 21:40:19,871 INFO  - TESTNG 
===============================================
    Surefire test
    Tests run: 137, Failures: 1, Skips: 0
===============================================
Tests run: 137, Failures: 1, Errors: 0, Skipped: 0, Time elapsed: 75.05 sec <<< FAILURE! - in TestSuite
testLoadBalancingManyItemsQuickTest(org.apache.brooklyn.policy.loadbalancing.LoadBalancingPolicySoakTest)  Time elapsed: 40.264 sec  <<< FAILURE!
java.lang.AssertionError: 
failed succeeds-eventually, 94 attempts, 40005ms elapsed: AssertionError: containers=[MockContainer[container-1], MockContainer[container-2], MockContainer[container-3.1.1], MockContainer[container-4], MockContainer[container-5]]; containerRates=[1123.0, 200.0, 0.0, 52.0, 50.0]; itemDistributionByContainer={MockContainer[container-1]=[MockItem[item-5], MockItem[item-6], MockItem[item-8], MockItem[item-9], MockItem[item-10], MockItem[item-11], MockItem[item-12], MockItem[item-13], MockItem[item-14], MockItem[item-15], MockItem[item-17], MockItem[item-18], MockItem[item-19], MockItem[item-20], MockItem[item-21], MockItem[item-22], MockItem[item-23], MockItem[item-25], MockItem[item-26], MockItem[item-27], MockItem[item-28], MockItem[item-29], MockItem[item-30], MockItem[item-4.1.1]], MockContainer[container-2]=[MockItem[item-1], MockItem[item-16], MockItem[item-7], MockItem[item-2]], MockContainer[container-3.1.1]=[], MockContainer[container-4]=[MockItem[item-3]], MockContainer[container-5]=[MockItem[item-24]]}; itemDistributionByItem={MockItem[item-1]=MockContainer[container-2], MockItem[item-2]=MockContainer[container-2], MockItem[item-3]=MockContainer[container-4], MockItem[item-4.1.1]=MockContainer[container-1], MockItem[item-5]=MockContainer[container-1], MockItem[item-6]=MockContainer[container-1], MockItem[item-7]=MockContainer[container-2], MockItem[item-8]=MockContainer[container-1], MockItem[item-9]=MockContainer[container-1], MockItem[item-10]=MockContainer[container-1], MockItem[item-11]=MockContainer[container-1], MockItem[item-12]=MockContainer[container-1], MockItem[item-13]=MockContainer[container-1], MockItem[item-14]=MockContainer[container-1], MockItem[item-15]=MockContainer[container-1], MockItem[item-16]=MockContainer[container-2], MockItem[item-17]=MockContainer[container-1], MockItem[item-18]=MockContainer[container-1], MockItem[item-19]=MockContainer[container-1], MockItem[item-20]=MockContainer[container-1], MockItem[item-21]=MockContainer[container-1], MockItem[item-22]=MockContainer[container-1], MockItem[item-23]=MockContainer[container-1], MockItem[item-24]=MockContainer[container-5], MockItem[item-25]=MockContainer[container-1], MockItem[item-26]=MockContainer[container-1], MockItem[item-27]=MockContainer[container-1], MockItem[item-28]=MockContainer[container-1], MockItem[item-29]=MockContainer[container-1], MockItem[item-30]=MockContainer[container-1]}; model=Container 'MockContainer[container-2]': 
	Item 'MockItem[item-7]' (50.0)
	Item 'MockItem[item-2]' (50.0)
	Item 'MockItem[item-16]' (50.0)
	Item 'MockItem[item-1]' (50.0)
Container 'MockContainer[container-1]': 
	Item 'MockItem[item-9]' (47.0)
	Item 'MockItem[item-23]' (49.0)
	Item 'MockItem[item-22]' (48.0)
	Item 'MockItem[item-17]' (45.0)
	Item 'MockItem[item-27]' (46.0)
	Item 'MockItem[item-28]' (46.0)
	Item 'MockItem[item-12]' (48.0)
	Item 'MockItem[item-29]' (45.0)
	Item 'MockItem[item-26]' (45.0)
	Item 'MockItem[item-13]' (45.0)
	Item 'MockItem[item-15]' (48.0)
	Item 'MockItem[item-19]' (47.0)
	Item 'MockItem[item-11]' (46.0)
	Item 'MockItem[item-5]' (47.0)
	Item 'MockItem[item-21]' (45.0)
	Item 'MockItem[item-14]' (47.0)
	Item 'MockItem[item-8]' (49.0)
	Item 'MockItem[item-10]' (49.0)
	Item 'MockItem[item-18]' (48.0)
	Item 'MockItem[item-4.1.1]' (46.0)
	Item 'MockItem[item-6]' (46.0)
	Item 'MockItem[item-30]' (44.0)
	Item 'MockItem[item-25]' (47.0)
	Item 'MockItem[item-20]' (50.0)
Container 'MockContainer[container-4]': 
	Item 'MockItem[item-3]' (52.0)
Container 'MockContainer[container-5]': 
	Item 'MockItem[item-24]' (50.0)
Container 'MockContainer[container-3]': 
Container 'MockContainer[container-3.1.1]': 
; totalMoves=49; lastMoveTime=2018-09-15 21:39:22.870; itemRates=[50, 50, 52, 46, 47, 46, 50, 49, 47, 49, 46, 48, 45, 47, 48, 50, 45, 48, 47, 50, 45, 48, 49, 50, 47, 45, 46, 46, 45, 44] expected [true] but found [false]
	at org.apache.brooklyn.policy.loadbalancing.LoadBalancingPolicySoakTest.runLoadBalancingSoakTest(LoadBalancingPolicySoakTest.java:177)
	at org.apache.brooklyn.policy.loadbalancing.LoadBalancingPolicySoakTest.testLoadBalancingManyItemsQuickTest(LoadBalancingPolicySoakTest.java:71)
Caused by: java.lang.AssertionError: 
containers=[MockContainer[container-1], MockContainer[container-2], MockContainer[container-3.1.1], MockContainer[container-4], MockContainer[container-5]]; containerRates=[1123.0, 200.0, 0.0, 52.0, 50.0]; itemDistributionByContainer={MockContainer[container-1]=[MockItem[item-5], MockItem[item-6], MockItem[item-8], MockItem[item-9], MockItem[item-10], MockItem[item-11], MockItem[item-12], MockItem[item-13], MockItem[item-14], MockItem[item-15], MockItem[item-17], MockItem[item-18], MockItem[item-19], MockItem[item-20], MockItem[item-21], MockItem[item-22], MockItem[item-23], MockItem[item-25], MockItem[item-26], MockItem[item-27], MockItem[item-28], MockItem[item-29], MockItem[item-30], MockItem[item-4.1.1]], MockContainer[container-2]=[MockItem[item-1], MockItem[item-16], MockItem[item-7], MockItem[item-2]], MockContainer[container-3.1.1]=[], MockContainer[container-4]=[MockItem[item-3]], MockContainer[container-5]=[MockItem[item-24]]}; itemDistributionByItem={MockItem[item-1]=MockContainer[container-2], MockItem[item-2]=MockContainer[container-2], MockItem[item-3]=MockContainer[container-4], MockItem[item-4.1.1]=MockContainer[container-1], MockItem[item-5]=MockContainer[container-1], MockItem[item-6]=MockContainer[container-1], MockItem[item-7]=MockContainer[container-2], MockItem[item-8]=MockContainer[container-1], MockItem[item-9]=MockContainer[container-1], MockItem[item-10]=MockContainer[container-1], MockItem[item-11]=MockContainer[container-1], MockItem[item-12]=MockContainer[container-1], MockItem[item-13]=MockContainer[container-1], MockItem[item-14]=MockContainer[container-1], MockItem[item-15]=MockContainer[container-1], MockItem[item-16]=MockContainer[container-2], MockItem[item-17]=MockContainer[container-1], MockItem[item-18]=MockContainer[container-1], MockItem[item-19]=MockContainer[container-1], MockItem[item-20]=MockContainer[container-1], MockItem[item-21]=MockContainer[container-1], MockItem[item-22]=MockContainer[container-1], MockItem[item-23]=MockContainer[container-1], MockItem[item-24]=MockContainer[container-5], MockItem[item-25]=MockContainer[container-1], MockItem[item-26]=MockContainer[container-1], MockItem[item-27]=MockContainer[container-1], MockItem[item-28]=MockContainer[container-1], MockItem[item-29]=MockContainer[container-1], MockItem[item-30]=MockContainer[container-1]}; model=Container 'MockContainer[container-2]': 
	Item 'MockItem[item-7]' (50.0)
	Item 'MockItem[item-2]' (50.0)
	Item 'MockItem[item-16]' (50.0)
	Item 'MockItem[item-1]' (50.0)
Container 'MockContainer[container-1]': 
	Item 'MockItem[item-9]' (47.0)
	Item 'MockItem[item-23]' (49.0)
	Item 'MockItem[item-22]' (48.0)
	Item 'MockItem[item-17]' (45.0)
	Item 'MockItem[item-27]' (46.0)
	Item 'MockItem[item-28]' (46.0)
	Item 'MockItem[item-12]' (48.0)
	Item 'MockItem[item-29]' (45.0)
	Item 'MockItem[item-26]' (45.0)
	Item 'MockItem[item-13]' (45.0)
	Item 'MockItem[item-15]' (48.0)
	Item 'MockItem[item-19]' (47.0)
	Item 'MockItem[item-11]' (46.0)
	Item 'MockItem[item-5]' (47.0)
	Item 'MockItem[item-21]' (45.0)
	Item 'MockItem[item-14]' (47.0)
	Item 'MockItem[item-8]' (49.0)
	Item 'MockItem[item-10]' (49.0)
	Item 'MockItem[item-18]' (48.0)
	Item 'MockItem[item-4.1.1]' (46.0)
	Item 'MockItem[item-6]' (46.0)
	Item 'MockItem[item-30]' (44.0)
	Item 'MockItem[item-25]' (47.0)
	Item 'MockItem[item-20]' (50.0)
Container 'MockContainer[container-4]': 
	Item 'MockItem[item-3]' (52.0)
Container 'MockContainer[container-5]': 
	Item 'MockItem[item-24]' (50.0)
Container 'MockContainer[container-3]': 
Container 'MockContainer[container-3.1.1]': 
; totalMoves=49; lastMoveTime=2018-09-15 21:39:22.870; itemRates=[50, 50, 52, 46, 47, 46, 50, 49, 47, 49, 46, 48, 45, 47, 48, 50, 45, 48, 47, 50, 45, 48, 49, 50, 47, 45, 46, 46, 45, 44] expected [true] but found [false]
	at org.apache.brooklyn.policy.loadbalancing.LoadBalancingPolicySoakTest.runLoadBalancingSoakTest(LoadBalancingPolicySoakTest.java:177)
	at org.apache.brooklyn.policy.loadbalancing.LoadBalancingPolicySoakTest.testLoadBalancingManyItemsQuickTest(LoadBalancingPolicySoakTest.java:71)


Results :

Failed tests: 
  LoadBalancingPolicySoakTest.testLoadBalancingManyItemsQuickTest:71->runLoadBalancingSoakTest:177 failed succeeds-eventually, 94 attempts, 40005ms elapsed: AssertionError: containers=[MockContainer[container-1], MockContainer[container-2], MockContainer[container-3.1.1], MockContainer[container-4], MockContainer[container-5]]; containerRates=[1123.0, 200.0, 0.0, 52.0, 50.0]; itemDistributionByContainer={MockContainer[container-1]=[MockItem[item-5], MockItem[item-6], MockItem[item-8], MockItem[item-9], MockItem[item-10], MockItem[item-11], MockItem[item-12], MockItem[item-13], MockItem[item-14], MockItem[item-15], MockItem[item-17], MockItem[item-18], MockItem[item-19], MockItem[item-20], MockItem[item-21], MockItem[item-22], MockItem[item-23], MockItem[item-25], MockItem[item-26], MockItem[item-27], MockItem[item-28], MockItem[item-29], MockItem[item-30], MockItem[item-4.1.1]], MockContainer[container-2]=[MockItem[item-1], MockItem[item-16], MockItem[item-7], MockItem[item-2]], MockContainer[container-3.1.1]=[], MockContainer[container-4]=[MockItem[item-3]], MockContainer[container-5]=[MockItem[item-24]]}; itemDistributionByItem={MockItem[item-1]=MockContainer[container-2], MockItem[item-2]=MockContainer[container-2], MockItem[item-3]=MockContainer[container-4], MockItem[item-4.1.1]=MockContainer[container-1], MockItem[item-5]=MockContainer[container-1], MockItem[item-6]=MockContainer[container-1], MockItem[item-7]=MockContainer[container-2], MockItem[item-8]=MockContainer[container-1], MockItem[item-9]=MockContainer[container-1], MockItem[item-10]=MockContainer[container-1], MockItem[item-11]=MockContainer[container-1], MockItem[item-12]=MockContainer[container-1], MockItem[item-13]=MockContainer[container-1], MockItem[item-14]=MockContainer[container-1], MockItem[item-15]=MockContainer[container-1], MockItem[item-16]=MockContainer[container-2], MockItem[item-17]=MockContainer[container-1], MockItem[item-18]=MockContainer[container-1], MockItem[item-19]=MockContainer[container-1], MockItem[item-20]=MockContainer[container-1], MockItem[item-21]=MockContainer[container-1], MockItem[item-22]=MockContainer[container-1], MockItem[item-23]=MockContainer[container-1], MockItem[item-24]=MockContainer[container-5], MockItem[item-25]=MockContainer[container-1], MockItem[item-26]=MockContainer[container-1], MockItem[item-27]=MockContainer[container-1], MockItem[item-28]=MockContainer[container-1], MockItem[item-29]=MockContainer[container-1], MockItem[item-30]=MockContainer[container-1]}; model=Container 'MockContainer[container-2]': 
	Item 'MockItem[item-7]' (50.0)
	Item 'MockItem[item-2]' (50.0)
	Item 'MockItem[item-16]' (50.0)
	Item 'MockItem[item-1]' (50.0)
Container 'MockContainer[container-1]': 
	Item 'MockItem[item-9]' (47.0)
	Item 'MockItem[item-23]' (49.0)
	Item 'MockItem[item-22]' (48.0)
	Item 'MockItem[item-17]' (45.0)
	Item 'MockItem[item-27]' (46.0)
	Item 'MockItem[item-28]' (46.0)
	Item 'MockItem[item-12]' (48.0)
	Item 'MockItem[item-29]' (45.0)
	Item 'MockItem[item-26]' (45.0)
	Item 'MockItem[item-13]' (45.0)
	Item 'MockItem[item-15]' (48.0)
	Item 'MockItem[item-19]' (47.0)
	Item 'MockItem[item-11]' (46.0)
	Item 'MockItem[item-5]' (47.0)
	Item 'MockItem[item-21]' (45.0)
	Item 'MockItem[item-14]' (47.0)
	Item 'MockItem[item-8]' (49.0)
	Item 'MockItem[item-10]' (49.0)
	Item 'MockItem[item-18]' (48.0)
	Item 'MockItem[item-4.1.1]' (46.0)
	Item 'MockItem[item-6]' (46.0)
	Item 'MockItem[item-30]' (44.0)
	Item 'MockItem[item-25]' (47.0)
	Item 'MockItem[item-20]' (50.0)
Container 'MockContainer[container-4]': 
	Item 'MockItem[item-3]' (52.0)
Container 'MockContainer[container-5]': 
	Item 'MockItem[item-24]' (50.0)
Container 'MockContainer[container-3]': 
Container 'MockContainer[container-3.1.1]': 
; totalMoves=49; lastMoveTime=2018-09-15 21:39:22.870; itemRates=[50, 50, 52, 46, 47, 46, 50, 49, 47, 49, 46, 48, 45, 47, 48, 50, 45, 48, 47, 50, 45, 48, 49, 50, 47, 45, 46, 46, 45, 44] expected [true] but found [false]

Tests run: 137, Failures: 1, Errors: 0, Skipped: 0

[INFO] ------------------------------------------------------------------------
[INFO] Reactor Summary:
[INFO] 
[INFO] Brooklyn Server Root ............................... SUCCESS [  5.076 s]
[INFO] Brooklyn Parent Project ............................ SUCCESS [  6.399 s]
[INFO] Brooklyn Test Support Utilities .................... SUCCESS [  9.434 s]
[INFO] Brooklyn Logback Includable Configuration .......... SUCCESS [  0.573 s]
[INFO] Brooklyn Common Utilities .......................... SUCCESS [ 35.911 s]
[INFO] Brooklyn API ....................................... SUCCESS [  2.378 s]
[INFO] CAMP Server Parent Project ......................... SUCCESS [  0.187 s]
[INFO] CAMP Base .......................................... SUCCESS [  4.371 s]
[INFO] Brooklyn Test Support .............................. SUCCESS [  1.509 s]
[INFO] Brooklyn REST Swagger Apidoc Utilities ............. SUCCESS [ 11.763 s]
[INFO] Brooklyn Logback Configuration ..................... SUCCESS [  0.264 s]
[INFO] CAMP Server ........................................ SUCCESS [ 13.051 s]
[INFO] Brooklyn Felix Runtime ............................. SUCCESS [  4.312 s]
[INFO] Brooklyn Groovy Utilities .......................... SUCCESS [  2.796 s]
[INFO] Brooklyn Core ...................................... SUCCESS [05:02 min]
[INFO] Brooklyn Policies .................................. FAILURE [01:21 min]
[INFO] Brooklyn WinRM Software Entities ................... SKIPPED
[INFO] Brooklyn Secure JMXMP Agent ........................ SKIPPED
[INFO] Brooklyn JMX RMI Agent ............................. SKIPPED
[INFO] Brooklyn Jclouds Location Targets .................. SKIPPED
[INFO] Brooklyn Software Base ............................. SKIPPED
[INFO] Brooklyn CAMP ...................................... SKIPPED
[INFO] Brooklyn Launcher Common ........................... SKIPPED
[INFO] Brooklyn REST API .................................. SKIPPED
[INFO] Brooklyn REST Resources ............................ SKIPPED
[INFO] Brooklyn REST Server ............................... SKIPPED
[INFO] Brooklyn Launcher .................................. SKIPPED
[INFO] Brooklyn Container Location Targets ................ SKIPPED
[INFO] Brooklyn Command Line Interface .................... SKIPPED
[INFO] Brooklyn Test Framework ............................ SKIPPED
[INFO] Brooklyn OSGi init ................................. SKIPPED
[INFO] Brooklyn OSGi start ................................ SKIPPED
[INFO] Brooklyn Karaf ..................................... SKIPPED
[INFO] Jetty config fragment .............................. SKIPPED
[INFO] Apache Http Component extension .................... SKIPPED
[INFO] Brooklyn Karaf Features ............................ SKIPPED
[INFO] Brooklyn Karaf Shell Commands ...................... SKIPPED
[INFO] ------------------------------------------------------------------------
[INFO] BUILD FAILURE
[INFO] ------------------------------------------------------------------------
[INFO] Total time: 08:16 min
[INFO] Finished at: 2018-09-15T21:40:20Z
[INFO] Final Memory: 80M/712M
[INFO] ------------------------------------------------------------------------
[ERROR] Failed to execute goal org.apache.maven.plugins:maven-surefire-plugin:2.19.1:test (default-test) on project brooklyn-policy: There are test failures.
[ERROR] 
[ERROR] Please refer to /usr/build/policy/target/surefire-reports for the individual test results.
[ERROR] -> [Help 1]
[ERROR] 
[ERROR] To see the full stack trace of the errors, re-run Maven with the -e switch.
[ERROR] Re-run Maven using the -X switch to enable full debug logging.
[ERROR] 
[ERROR] For more information about the errors and possible solutions, please read the following articles:
[ERROR] [Help 1] http://cwiki.apache.org/confluence/display/MAVEN/MojoFailureException
[ERROR] 
[ERROR] After correcting the problems, you can resume the build with the command
[ERROR]   mvn <goals> -rf :brooklyn-policy
Build step 'Execute shell' marked build as failure
Recording test results
TestNG Reports Processing: START
Looking for TestNG results report in workspace using pattern: **/testng-results.xml
Saving reports...
Processing '/x1/jenkins/jenkins-home/jobs/brooklyn-server-master-docker/builds/121/testng/testng-results-1.xml'
Processing '/x1/jenkins/jenkins-home/jobs/brooklyn-server-master-docker/builds/121/testng/testng-results-2.xml'
Processing '/x1/jenkins/jenkins-home/jobs/brooklyn-server-master-docker/builds/121/testng/testng-results-3.xml'
Processing '/x1/jenkins/jenkins-home/jobs/brooklyn-server-master-docker/builds/121/testng/testng-results-4.xml'
Processing '/x1/jenkins/jenkins-home/jobs/brooklyn-server-master-docker/builds/121/testng/testng-results-5.xml'
Processing '/x1/jenkins/jenkins-home/jobs/brooklyn-server-master-docker/builds/121/testng/testng-results-6.xml'
Processing '/x1/jenkins/jenkins-home/jobs/brooklyn-server-master-docker/builds/121/testng/testng-results.xml'
0.032552% of tests failed, which exceeded threshold of 0%. Marking build as UNSTABLE
TestNG Reports Processing: FINISH