OSDir


[Date Prev][Date Next][Thread Prev][Thread Next][Date Index][Thread Index]

Build failed in Jenkins: brooklyn-master-build-docker #665


See <https://builds.apache.org/job/brooklyn-master-build-docker/665/display/redirect>

------------------------------------------
[...truncated 5.73 MB...]
2018-09-11 23:08:32,327 WARN  - Retrieving value with deprecated config key name 'oldConfMapDeepMerge' for key confMapDeepMerge[MapConfigKey:java.util.Map<java.lang.String, java.lang.String>]
2018-09-11 23:08:32,327 WARN  - Retrieving value with deprecated config key name 'oldConfMapDeepMerge' for key confMapDeepMerge[MapConfigKey:java.util.Map<java.lang.String, java.lang.String>]
2018-09-11 23:08:32,327 INFO  - TESTNG PASSED: "Surefire test" - org.apache.brooklyn.core.config.MapConfigKeyAndFriendsDeprecationTest.testMergesDeprecatedKeyFromRuntimeParent() finished in 23 ms
2018-09-11 23:08:32,327 INFO  - TESTNG INVOKING CONFIGURATION: "Surefire test" - @AfterMethod org.apache.brooklyn.core.test.BrooklynMgmtUnitTestSupport.tearDown()
2018-09-11 23:08:32,332 INFO  - TESTNG PASSED CONFIGURATION: "Surefire test" - @AfterMethod org.apache.brooklyn.core.test.BrooklynMgmtUnitTestSupport.tearDown() finished in 5 ms
2018-09-11 23:08:32,332 INFO  - TESTNG INVOKING CONFIGURATION: "Surefire test" - @BeforeMethod org.apache.brooklyn.core.test.BrooklynAppUnitTestSupport.setUp()
2018-09-11 23:08:32,333 INFO  - Added external config supplier named 'brooklyn-demo-sample': org.apache.brooklyn.core.config.external.InPlaceExternalConfigSupplier@7733b40e
2018-09-11 23:08:32,343 INFO  - TESTNG PASSED CONFIGURATION: "Surefire test" - @BeforeMethod org.apache.brooklyn.core.test.BrooklynAppUnitTestSupport.setUp() finished in 11 ms
2018-09-11 23:08:32,343 INFO  - TESTNG INVOKING: "Surefire test" - org.apache.brooklyn.core.config.MapConfigKeyAndFriendsDeprecationTest.testMergesDeprecatedKeyFromRuntimeParentWithOwn()
2018-09-11 23:08:32,351 WARN  - Unsupported flags when configuring TestEntityImpl{id=it4hmigi67}; storing: {oldConfMapDeepMerge={mykey=myval}}
2018-09-11 23:08:32,360 WARN  - Retrieving value with deprecated config key name 'oldConfMapDeepMerge' for key confMapDeepMerge[MapConfigKey:java.util.Map<java.lang.String, java.lang.String>]
2018-09-11 23:08:32,360 WARN  - Retrieving value with deprecated config key name 'oldConfMapDeepMerge' for key confMapDeepMerge[MapConfigKey:java.util.Map<java.lang.String, java.lang.String>]
2018-09-11 23:08:32,361 WARN  - Retrieving value with deprecated config key name 'oldConfMapDeepMerge' for key confMapDeepMerge[MapConfigKey:java.util.Map<java.lang.String, java.lang.String>]
2018-09-11 23:08:32,361 WARN  - Retrieving value with deprecated config key name 'oldConfMapDeepMerge' for key confMapDeepMerge[MapConfigKey:java.util.Map<java.lang.String, java.lang.String>]
2018-09-11 23:08:32,362 INFO  - TESTNG PASSED: "Surefire test" - org.apache.brooklyn.core.config.MapConfigKeyAndFriendsDeprecationTest.testMergesDeprecatedKeyFromRuntimeParentWithOwn() finished in 19 ms
2018-09-11 23:08:32,362 INFO  - TESTNG INVOKING CONFIGURATION: "Surefire test" - @AfterMethod org.apache.brooklyn.core.test.BrooklynMgmtUnitTestSupport.tearDown()
2018-09-11 23:08:32,366 INFO  - TESTNG PASSED CONFIGURATION: "Surefire test" - @AfterMethod org.apache.brooklyn.core.test.BrooklynMgmtUnitTestSupport.tearDown() finished in 4 ms
2018-09-11 23:08:32,366 INFO  - TESTNG INVOKING CONFIGURATION: "Surefire test" - @BeforeMethod org.apache.brooklyn.core.test.BrooklynAppUnitTestSupport.setUp()
2018-09-11 23:08:32,366 INFO  - Added external config supplier named 'brooklyn-demo-sample': org.apache.brooklyn.core.config.external.InPlaceExternalConfigSupplier@4f78020
2018-09-11 23:08:32,376 INFO  - TESTNG PASSED CONFIGURATION: "Surefire test" - @BeforeMethod org.apache.brooklyn.core.test.BrooklynAppUnitTestSupport.setUp() finished in 10 ms
2018-09-11 23:08:32,376 INFO  - TESTNG INVOKING: "Surefire test" - org.apache.brooklyn.core.config.MapConfigKeyAndFriendsDeprecationTest.testMergesKeyFromRuntimeParentWithOwnDeprecated()
2018-09-11 23:08:32,384 WARN  - Unsupported flags when configuring TestEntityImpl{id=ppy9c9tvr8}; storing: {confMapDeepMerge={mykey=myval}}
2018-09-11 23:08:32,394 INFO  - TESTNG PASSED: "Surefire test" - org.apache.brooklyn.core.config.MapConfigKeyAndFriendsDeprecationTest.testMergesKeyFromRuntimeParentWithOwnDeprecated() finished in 18 ms
2018-09-11 23:08:32,395 INFO  - TESTNG INVOKING CONFIGURATION: "Surefire test" - @AfterMethod org.apache.brooklyn.core.test.BrooklynMgmtUnitTestSupport.tearDown()
2018-09-11 23:08:32,400 INFO  - TESTNG PASSED CONFIGURATION: "Surefire test" - @AfterMethod org.apache.brooklyn.core.test.BrooklynMgmtUnitTestSupport.tearDown() finished in 6 ms
2018-09-11 23:08:32,400 INFO  - TESTNG INVOKING CONFIGURATION: "Surefire test" - @BeforeMethod org.apache.brooklyn.core.test.BrooklynAppUnitTestSupport.setUp()
2018-09-11 23:08:32,400 INFO  - Added external config supplier named 'brooklyn-demo-sample': org.apache.brooklyn.core.config.external.InPlaceExternalConfigSupplier@409a3d8f
2018-09-11 23:08:32,410 INFO  - TESTNG PASSED CONFIGURATION: "Surefire test" - @BeforeMethod org.apache.brooklyn.core.test.BrooklynAppUnitTestSupport.setUp() finished in 10 ms
2018-09-11 23:08:32,411 INFO  - TESTNG INVOKING: "Surefire test" - org.apache.brooklyn.core.config.MapConfigKeyAndFriendsDeprecationTest.testPrefersNonDeprecatedName()
2018-09-11 23:08:32,419 INFO  - TESTNG PASSED: "Surefire test" - org.apache.brooklyn.core.config.MapConfigKeyAndFriendsDeprecationTest.testPrefersNonDeprecatedName() finished in 8 ms
2018-09-11 23:08:32,419 INFO  - TESTNG INVOKING CONFIGURATION: "Surefire test" - @AfterMethod org.apache.brooklyn.core.test.BrooklynMgmtUnitTestSupport.tearDown()
2018-09-11 23:08:32,422 INFO  - TESTNG PASSED CONFIGURATION: "Surefire test" - @AfterMethod org.apache.brooklyn.core.test.BrooklynMgmtUnitTestSupport.tearDown() finished in 3 ms
2018-09-11 23:08:32,422 INFO  - TESTNG INVOKING CONFIGURATION: "Surefire test" - @BeforeMethod org.apache.brooklyn.core.test.BrooklynAppUnitTestSupport.setUp()
2018-09-11 23:08:32,423 INFO  - Added external config supplier named 'brooklyn-demo-sample': org.apache.brooklyn.core.config.external.InPlaceExternalConfigSupplier@257597e8
2018-09-11 23:08:32,433 INFO  - TESTNG PASSED CONFIGURATION: "Surefire test" - @BeforeMethod org.apache.brooklyn.core.test.BrooklynAppUnitTestSupport.setUp() finished in 11 ms
2018-09-11 23:08:32,434 INFO  - TESTNG INVOKING: "Surefire test" - org.apache.brooklyn.core.config.MapConfigKeyAndFriendsDeprecationTest.testUsingDeprecatedName()
2018-09-11 23:08:32,443 INFO  - TESTNG PASSED: "Surefire test" - org.apache.brooklyn.core.config.MapConfigKeyAndFriendsDeprecationTest.testUsingDeprecatedName() finished in 10 ms
2018-09-11 23:08:32,443 INFO  - TESTNG INVOKING CONFIGURATION: "Surefire test" - @AfterMethod org.apache.brooklyn.core.test.BrooklynMgmtUnitTestSupport.tearDown()
2018-09-11 23:08:32,447 INFO  - TESTNG PASSED CONFIGURATION: "Surefire test" - @AfterMethod org.apache.brooklyn.core.test.BrooklynMgmtUnitTestSupport.tearDown() finished in 4 ms
2018-09-11 23:08:32,447 INFO  - TESTNG INVOKING CONFIGURATION: "Surefire test" - @BeforeMethod org.apache.brooklyn.core.test.BrooklynAppUnitTestSupport.setUp()
2018-09-11 23:08:32,447 INFO  - Added external config supplier named 'brooklyn-demo-sample': org.apache.brooklyn.core.config.external.InPlaceExternalConfigSupplier@27594afb
2018-09-11 23:08:32,459 INFO  - TESTNG PASSED CONFIGURATION: "Surefire test" - @BeforeMethod org.apache.brooklyn.core.test.BrooklynAppUnitTestSupport.setUp() finished in 12 ms
2018-09-11 23:08:32,459 INFO  - TESTNG INVOKING: "Surefire test" - org.apache.brooklyn.core.config.MapConfigKeyAndFriendsDeprecationTest.testUsingDeprecatedNameSubkey()
2018-09-11 23:08:32,466 WARN  - Unsupported flags when configuring MyEntityImpl{id=nkaoobuplq}; storing: {confMapDeepMerge.mykey=myval}
2018-09-11 23:08:32,468 INFO  - TESTNG PASSED: "Surefire test" - org.apache.brooklyn.core.config.MapConfigKeyAndFriendsDeprecationTest.testUsingDeprecatedNameSubkey() finished in 9 ms
2018-09-11 23:08:32,468 INFO  - TESTNG INVOKING CONFIGURATION: "Surefire test" - @AfterMethod org.apache.brooklyn.core.test.BrooklynMgmtUnitTestSupport.tearDown()
2018-09-11 23:08:32,471 INFO  - TESTNG PASSED CONFIGURATION: "Surefire test" - @AfterMethod org.apache.brooklyn.core.test.BrooklynMgmtUnitTestSupport.tearDown() finished in 3 ms
2018-09-11 23:08:32,471 INFO  - TESTNG INVOKING: "Surefire test" - org.apache.brooklyn.core.config.BrooklynPropertiesTest.testAddFromUrlClasspath()
2018-09-11 23:08:32,472 INFO  - TESTNG PASSED: "Surefire test" - org.apache.brooklyn.core.config.BrooklynPropertiesTest.testAddFromUrlClasspath() finished in 1 ms
2018-09-11 23:08:32,472 INFO  - TESTNG INVOKING: "Surefire test" - org.apache.brooklyn.core.config.BrooklynPropertiesTest.testAddFromUrlSimple()
2018-09-11 23:08:32,472 INFO  - TESTNG PASSED: "Surefire test" - org.apache.brooklyn.core.config.BrooklynPropertiesTest.testAddFromUrlSimple() finished in 0 ms
2018-09-11 23:08:32,472 INFO  - TESTNG INVOKING: "Surefire test" - org.apache.brooklyn.core.config.BrooklynPropertiesTest.testAddMultipleFromUrl()
2018-09-11 23:08:32,473 INFO  - TESTNG PASSED: "Surefire test" - org.apache.brooklyn.core.config.BrooklynPropertiesTest.testAddMultipleFromUrl() finished in 1 ms
2018-09-11 23:08:32,473 INFO  - TESTNG INVOKING: "Surefire test" - org.apache.brooklyn.core.config.BrooklynPropertiesTest.testGetAndPutConfig()
2018-09-11 23:08:32,473 INFO  - TESTNG PASSED: "Surefire test" - org.apache.brooklyn.core.config.BrooklynPropertiesTest.testGetAndPutConfig() finished in 0 ms
2018-09-11 23:08:32,474 INFO  - TESTNG INVOKING: "Surefire test" - org.apache.brooklyn.core.config.BrooklynPropertiesTest.testGetFirst()
2018-09-11 23:08:32,474 INFO  - TESTNG PASSED: "Surefire test" - org.apache.brooklyn.core.config.BrooklynPropertiesTest.testGetFirst() finished in 1 ms
2018-09-11 23:08:32,474 INFO  - TESTNG INVOKING: "Surefire test" - org.apache.brooklyn.core.config.BrooklynPropertiesTest.testGetFirstUsingDefaultIfNone()
2018-09-11 23:08:32,474 INFO  - TESTNG PASSED: "Surefire test" - org.apache.brooklyn.core.config.BrooklynPropertiesTest.testGetFirstUsingDefaultIfNone() finished in 0 ms
2018-09-11 23:08:32,474 INFO  - TESTNG INVOKING: "Surefire test" - org.apache.brooklyn.core.config.BrooklynPropertiesTest.testGetFirstUsingFailIfNone()
2018-09-11 23:08:32,474 INFO  - TESTNG PASSED: "Surefire test" - org.apache.brooklyn.core.config.BrooklynPropertiesTest.testGetFirstUsingFailIfNone() finished in 0 ms
2018-09-11 23:08:32,474 INFO  - TESTNG INVOKING: "Surefire test" - org.apache.brooklyn.core.config.BrooklynPropertiesTest.testGetFirstUsingFailIfNoneFalse()
2018-09-11 23:08:32,474 INFO  - TESTNG PASSED: "Surefire test" - org.apache.brooklyn.core.config.BrooklynPropertiesTest.testGetFirstUsingFailIfNoneFalse() finished in 0 ms
2018-09-11 23:08:32,474 INFO  - TESTNG INVOKING: "Surefire test" - org.apache.brooklyn.core.config.BrooklynPropertiesTest.testGetSubMap()
2018-09-11 23:08:32,475 INFO  - TESTNG PASSED: "Surefire test" - org.apache.brooklyn.core.config.BrooklynPropertiesTest.testGetSubMap() finished in 1 ms
2018-09-11 23:08:32,475 INFO  - TESTNG INVOKING: "Surefire test" - org.apache.brooklyn.core.config.BrooklynPropertiesTest.testTrickyAddMultipleFromUrl()
2018-09-11 23:08:32,475 INFO  - TESTNG PASSED: "Surefire test" - org.apache.brooklyn.core.config.BrooklynPropertiesTest.testTrickyAddMultipleFromUrl() finished in 0 ms
2018-09-11 23:08:32,476 INFO  - TESTNG INVOKING: "Surefire test" - org.apache.brooklyn.core.config.BrooklynPropertiesFromGroovyTest.testGetFirstMultiArgUsingFailIfNoneWithClosure()
2018-09-11 23:08:32,507 WARN  - Use of groovy.lang.Closure is deprecated as value for 'failIfNone', in BrooklynProperties.getFirst()
2018-09-11 23:08:32,517 INFO  - TESTNG PASSED: "Surefire test" - org.apache.brooklyn.core.config.BrooklynPropertiesFromGroovyTest.testGetFirstMultiArgUsingFailIfNoneWithClosure() finished in 41 ms
2018-09-11 23:08:32,517 INFO  - TESTNG INVOKING: "Surefire test" - org.apache.brooklyn.core.config.BrooklynPropertiesFromGroovyTest.testGetFirstUsingFailIfNoneWithClosure()
2018-09-11 23:08:32,519 WARN  - Use of groovy.lang.Closure is deprecated as value for 'failIfNone', in BrooklynProperties.getFirst()
2018-09-11 23:08:32,519 INFO  - TESTNG PASSED: "Surefire test" - org.apache.brooklyn.core.config.BrooklynPropertiesFromGroovyTest.testGetFirstUsingFailIfNoneWithClosure() finished in 2 ms
2018-09-11 23:08:32,519 INFO  - TESTNG INVOKING: "Surefire test" - org.apache.brooklyn.core.config.external.InPlaceExternalConfigSupplierTest.testInPlace()
2018-09-11 23:08:32,519 INFO  - Added external config supplier named 'brooklyn-demo-sample': org.apache.brooklyn.core.config.external.InPlaceExternalConfigSupplier@144b8b28
2018-09-11 23:08:32,520 INFO  - Added external config supplier named 'foo': org.apache.brooklyn.core.config.external.InPlaceExternalConfigSupplier@a7cf44a
2018-09-11 23:08:32,520 INFO  - TESTNG PASSED: "Surefire test" - org.apache.brooklyn.core.config.external.InPlaceExternalConfigSupplierTest.testInPlace() finished in 1 ms
2018-09-11 23:08:32,520 INFO  - TESTNG INVOKING CONFIGURATION: "Surefire test" - @AfterMethod org.apache.brooklyn.core.config.external.InPlaceExternalConfigSupplierTest.tearDown()
2018-09-11 23:08:32,521 INFO  - TESTNG PASSED CONFIGURATION: "Surefire test" - @AfterMethod org.apache.brooklyn.core.config.external.InPlaceExternalConfigSupplierTest.tearDown() finished in 1 ms
2018-09-11 23:08:32,521 INFO  - TESTNG INVOKING CONFIGURATION: "Surefire test" - @BeforeMethod org.apache.brooklyn.core.config.external.PropertiesFileExternalConfigSupplierTest.setUp()
2018-09-11 23:08:32,521 INFO  - TESTNG PASSED CONFIGURATION: "Surefire test" - @BeforeMethod org.apache.brooklyn.core.config.external.PropertiesFileExternalConfigSupplierTest.setUp() finished in 0 ms
2018-09-11 23:08:32,521 INFO  - TESTNG INVOKING: "Surefire test" - org.apache.brooklyn.core.config.external.PropertiesFileExternalConfigSupplierTest.testFromProperties()
2018-09-11 23:08:32,522 INFO  - Added external config supplier named 'brooklyn-demo-sample': org.apache.brooklyn.core.config.external.InPlaceExternalConfigSupplier@779705a0
2018-09-11 23:08:32,523 INFO  - Added external config supplier named 'foo': org.apache.brooklyn.core.config.external.PropertiesFileExternalConfigSupplier@744da15
2018-09-11 23:08:32,523 INFO  - TESTNG PASSED: "Surefire test" - org.apache.brooklyn.core.config.external.PropertiesFileExternalConfigSupplierTest.testFromProperties() finished in 2 ms
2018-09-11 23:08:32,523 INFO  - TESTNG INVOKING CONFIGURATION: "Surefire test" - @AfterMethod org.apache.brooklyn.core.config.external.PropertiesFileExternalConfigSupplierTest.tearDown()
2018-09-11 23:08:32,524 INFO  - TESTNG PASSED CONFIGURATION: "Surefire test" - @AfterMethod org.apache.brooklyn.core.config.external.PropertiesFileExternalConfigSupplierTest.tearDown() finished in 1 ms
2018-09-11 23:08:32,738 INFO  - TESTNG 
===============================================
    Surefire test
    Tests run: 2329, Failures: 1, Skips: 0
===============================================
[GC (Allocation Failure)  483090K->289067K(753152K), 0.0187712 secs]
[GC (Allocation Failure)  485654K->287075K(756736K), 0.0119987 secs]
[GC (Allocation Failure)  488803K->286499K(755712K), 0.0070175 secs]
[GC (Allocation Failure)  488227K->286459K(758784K), 0.0112561 secs]
[GC (Allocation Failure)  491984K->286451K(757760K), 0.0188678 secs]
[GC (Allocation Failure)  492275K->286475K(760832K), 0.0089766 secs]
[GC (Allocation Failure)  496395K->288039K(759808K), 0.0092486 secs]
Tests run: 2329, Failures: 1, Errors: 0, Skipped: 0, Time elapsed: 140.291 sec <<< FAILURE! - in TestSuite
testRebindWithDefaultZoneFailureDetector(org.apache.brooklyn.entity.group.DynamicClusterWithAvailabilityZonesRebindTest)  Time elapsed: 0.178 sec  <<< FAILURE!
org.apache.brooklyn.util.exceptions.CompoundRuntimeException: Failure rebinding; 2 errors including: Too many dangling references: 1 of 21
	at org.apache.brooklyn.entity.group.DynamicClusterWithAvailabilityZonesRebindTest.testRebindWithDefaultZoneFailureDetector(DynamicClusterWithAvailabilityZonesRebindTest.java:92)
Caused by: java.lang.IllegalStateException: Too many dangling references: 1 of 21
	at org.apache.brooklyn.entity.group.DynamicClusterWithAvailabilityZonesRebindTest.testRebindWithDefaultZoneFailureDetector(DynamicClusterWithAvailabilityZonesRebindTest.java:92)

2018-09-11 23:08:35,404 INFO  - Brooklyn shutdown: stopping entities [TestEntityImpl{id=rgylcorhop}, TestEntityImpl{id=kkw3d0umy0}, BlockingEntityImpl{id=u7sqrd0rd7}]

Results :

Failed tests: 
  DynamicClusterWithAvailabilityZonesRebindTest.testRebindWithDefaultZoneFailureDetector:92->RebindTestFixture.rebind:243->RebindTestFixtureWithApp.rebind:33->RebindTestFixtureWithApp.rebind:61->RebindTestFixture.rebind:262 » CompoundRuntime

Tests run: 2329, Failures: 1, Errors: 0, Skipped: 0

[INFO] ------------------------------------------------------------------------
[INFO] Reactor Summary:
[INFO] 
[INFO] Brooklyn Server Root ............................... SUCCESS [  4.151 s]
[INFO] Brooklyn Parent Project ............................ SUCCESS [  4.748 s]
[INFO] Brooklyn Test Support Utilities .................... SUCCESS [  8.783 s]
[INFO] Brooklyn Logback Includable Configuration .......... SUCCESS [  0.415 s]
[INFO] Brooklyn Common Utilities .......................... SUCCESS [ 31.653 s]
[INFO] Brooklyn API ....................................... SUCCESS [  1.461 s]
[INFO] CAMP Server Parent Project ......................... SUCCESS [  0.095 s]
[INFO] CAMP Base .......................................... SUCCESS [  3.591 s]
[INFO] Brooklyn Test Support .............................. SUCCESS [  0.873 s]
[INFO] Brooklyn REST Swagger Apidoc Utilities ............. SUCCESS [ 18.538 s]
[INFO] Brooklyn Logback Configuration ..................... SUCCESS [  0.180 s]
[INFO] CAMP Server ........................................ SUCCESS [ 13.580 s]
[INFO] Brooklyn Felix Runtime ............................. SUCCESS [  3.246 s]
[INFO] Brooklyn Groovy Utilities .......................... SUCCESS [  2.037 s]
[INFO] Brooklyn Core ...................................... FAILURE [03:09 min]
[INFO] Brooklyn Policies .................................. SKIPPED
[INFO] Brooklyn WinRM Software Entities ................... SKIPPED
[INFO] Brooklyn Secure JMXMP Agent ........................ SKIPPED
[INFO] Brooklyn JMX RMI Agent ............................. SKIPPED
[INFO] Brooklyn Jclouds Location Targets .................. SKIPPED
[INFO] Brooklyn Software Base ............................. SKIPPED
[INFO] Brooklyn CAMP ...................................... SKIPPED
[INFO] Brooklyn Launcher Common ........................... SKIPPED
[INFO] Brooklyn REST API .................................. SKIPPED
[INFO] Brooklyn REST Resources ............................ SKIPPED
[INFO] Brooklyn REST Server ............................... SKIPPED
[INFO] Brooklyn Launcher .................................. SKIPPED
[INFO] Brooklyn Container Location Targets ................ SKIPPED
[INFO] Brooklyn Command Line Interface .................... SKIPPED
[INFO] Brooklyn Test Framework ............................ SKIPPED
[INFO] Brooklyn OSGi init ................................. SKIPPED
[INFO] Brooklyn OSGi start ................................ SKIPPED
[INFO] Brooklyn Karaf ..................................... SKIPPED
[INFO] Jetty config fragment .............................. SKIPPED
[INFO] Apache Http Component extension .................... SKIPPED
[INFO] Brooklyn Karaf Features ............................ SKIPPED
[INFO] Brooklyn Karaf Shell Commands ...................... SKIPPED
[INFO] Brooklyn UI :: Parent .............................. SKIPPED
[INFO] Brooklyn UI :: Modularity Server (parent) .......... SKIPPED
[INFO] Brooklyn UI :: Modularity Server :: UI Module API .. SKIPPED
[INFO] Brooklyn UI :: Modularity Server :: UI Module Registry SKIPPED
[INFO] Brooklyn UI :: Modularity Server :: UI Proxy ....... SKIPPED
[INFO] Brooklyn UI :: Modularity Server :: UI Metadata Registry SKIPPED
[INFO] Brooklyn UI :: Modularity Server :: External UI Modules Registration Hooks SKIPPED
[INFO] Brooklyn UI :: Modularity Server :: Features ....... SKIPPED
[INFO] Brooklyn UI :: Modules (parent) .................... SKIPPED
[INFO] Brooklyn UI :: Modules - UI Utils .................. SKIPPED
[INFO] Brooklyn UI :: Modules - Home ...................... SKIPPED
[INFO] Brooklyn UI :: Modules - App inspector ............. SKIPPED
[INFO] Brooklyn UI :: Modules - Blueprint composer ........ SKIPPED
[INFO] Brooklyn UI :: Modules - Blueprint importer ........ SKIPPED
[INFO] Brooklyn UI :: Modules - Catalog ................... SKIPPED
[INFO] Brooklyn UI :: Modules - Location manager .......... SKIPPED
[INFO] Brooklyn UI :: Modules - REST API Docs ............. SKIPPED
[INFO] Brooklyn UI :: Modules - Groovy console ............ SKIPPED
[INFO] Brooklyn UI :: Modules - Logout .................... SKIPPED
[INFO] Brooklyn UI :: Modules - Features .................. SKIPPED
[INFO] Brooklyn UI :: Features ............................ SKIPPED
[INFO] Brooklyn Library Root .............................. SKIPPED
[INFO] Brooklyn CM Chef ................................... SKIPPED
[INFO] Brooklyn CM SaltStack .............................. SKIPPED
[INFO] Brooklyn CM Ansible ................................ SKIPPED
[INFO] Brooklyn CM Integration Root ....................... SKIPPED
[INFO] Brooklyn Network Software Entities ................. SKIPPED
[INFO] Brooklyn OSGi Software Entities .................... SKIPPED
[INFO] Brooklyn Database Software Entities ................ SKIPPED
[INFO] Brooklyn Web App Software Entities ................. SKIPPED
[INFO] Brooklyn Messaging Software Entities ............... SKIPPED
[INFO] Brooklyn NoSQL Data Store Software Entities ........ SKIPPED
[INFO] Brooklyn Monitoring Software Entities .............. SKIPPED
[INFO] Brooklyn Web App Software Entities ................. SKIPPED
[INFO] Brooklyn QA ........................................ SKIPPED
[INFO] Brooklyn Examples Aggregator Project ............... SKIPPED
[INFO] Brooklyn Examples Aggregator Project - Webapps ..... SKIPPED
[INFO] hello-world-webapp Maven Webapp .................... SKIPPED
[INFO] hello-world-sql-webapp Maven Webapp ................ SKIPPED
[INFO] Brooklyn Simple Web Cluster Example ................ SKIPPED
[INFO] Brooklyn Library Karaf integration ................. SKIPPED
[INFO] Brooklyn Library Catalog ........................... SKIPPED
[INFO] Brooklyn Library Karaf Features .................... SKIPPED
[INFO] Brooklyn Client .................................... SKIPPED
[INFO] Brooklyn Client Command Line Interface ............. SKIPPED
[INFO] Brooklyn REST java Client .......................... SKIPPED
[INFO] Brooklyn Downstream Project Parent ................. SKIPPED
[INFO] Brooklyn Dist Root ................................. SKIPPED
[INFO] Brooklyn All Things ................................ SKIPPED
[INFO] Brooklyn Distribution .............................. SKIPPED
[INFO] Brooklyn Karaf Distribution Parent ................. SKIPPED
[INFO] Brooklyn Karaf Server Configuration ................ SKIPPED
[INFO] Brooklyn Dist Karaf Features ....................... SKIPPED
[INFO] Brooklyn Karaf Distribution ........................ SKIPPED
[INFO] Brooklyn Karaf pax-exam itest ...................... SKIPPED
[INFO] Brooklyn Vagrant Getting Started Environment ....... SKIPPED
[INFO] Brooklyn Quick-Start Project Archetype ............. SKIPPED
[INFO] Brooklyn Shared Package Files ...................... SKIPPED
[INFO] Brooklyn RPM Package ............................... SKIPPED
[INFO] Brooklyn DEB Package ............................... SKIPPED
[INFO] Brooklyn Root ...................................... SKIPPED
[INFO] ------------------------------------------------------------------------
[INFO] BUILD FAILURE
[INFO] ------------------------------------------------------------------------
[INFO] Total time: 05:02 min
[INFO] Finished at: 2018-09-11T23:08:35Z
[INFO] Final Memory: 121M/733M
[INFO] ------------------------------------------------------------------------
[ERROR] Failed to execute goal org.apache.maven.plugins:maven-surefire-plugin:2.19.1:test (default-test) on project brooklyn-core: There are test failures.
[ERROR] 
[ERROR] Please refer to /usr/build/brooklyn-server/core/target/surefire-reports for the individual test results.
[ERROR] -> [Help 1]
[ERROR] 
[ERROR] To see the full stack trace of the errors, re-run Maven with the -e switch.
[ERROR] Re-run Maven using the -X switch to enable full debug logging.
[ERROR] 
[ERROR] For more information about the errors and possible solutions, please read the following articles:
[ERROR] [Help 1] http://cwiki.apache.org/confluence/display/MAVEN/MojoFailureException
[ERROR] 
[ERROR] After correcting the problems, you can resume the build with the command
[ERROR]   mvn <goals> -rf :brooklyn-core
Build step 'Execute shell' marked build as failure
Recording test results
TestNG Reports Processing: START
Looking for TestNG results report in workspace using pattern: **/testng-results.xml
Saving reports...
Processing '/x1/jenkins/jenkins-home/jobs/brooklyn-master-build-docker/builds/665/testng/testng-results-1.xml'
Processing '/x1/jenkins/jenkins-home/jobs/brooklyn-master-build-docker/builds/665/testng/testng-results-2.xml'
Processing '/x1/jenkins/jenkins-home/jobs/brooklyn-master-build-docker/builds/665/testng/testng-results-3.xml'
Processing '/x1/jenkins/jenkins-home/jobs/brooklyn-master-build-docker/builds/665/testng/testng-results-4.xml'
Processing '/x1/jenkins/jenkins-home/jobs/brooklyn-master-build-docker/builds/665/testng/testng-results-5.xml'
Processing '/x1/jenkins/jenkins-home/jobs/brooklyn-master-build-docker/builds/665/testng/testng-results.xml'
0.034072% of tests failed, which exceeded threshold of 0%. Marking build as UNSTABLE
TestNG Reports Processing: FINISH