OSDir


[Date Prev][Date Next][Thread Prev][Thread Next][Date Index][Thread Index]

Build failed in Jenkins: brooklyn-master-build-docker #664


See <https://builds.apache.org/job/brooklyn-master-build-docker/664/display/redirect>

------------------------------------------
[...truncated 5.69 MB...]
2018-09-11 21:33:31,262 INFO  - in-mem-test-UuD8 requesting planeId -->7; totals: out=218 B in=28 B
2018-09-11 21:33:31,262 INFO  - in-mem-test-UuD8 reading planeId <--0; totals: out=218 B in=28 B
2018-09-11 21:33:31,262 INFO  - in-mem-test-UuD8 requesting list nodes -->6; totals: out=224 B in=28 B
2018-09-11 21:33:31,262 INFO  - in-mem-test-UuD8 receiving list nodes <--2; totals: out=224 B in=30 B
2018-09-11 21:33:31,290 INFO  - TESTNG PASSED CONFIGURATION: "Surefire test" - @BeforeMethod org.apache.brooklyn.core.mgmt.persist.BrooklynMementoPersisterTestFixture.setUp() finished in 43 ms
2018-09-11 21:33:31,290 INFO  - TESTNG INVOKING: "Surefire test" - org.apache.brooklyn.core.mgmt.persist.BrooklynMementoPersisterTestFixture.testLoadAndCheckpointRawMemento()
2018-09-11 21:33:31,292 INFO  - in-mem-test-UuD8 requesting planeId -->7; totals: out=231 B in=30 B
2018-09-11 21:33:31,293 INFO  - in-mem-test-UuD8 reading planeId <--0; totals: out=231 B in=30 B
2018-09-11 21:33:31,293 INFO  - in-mem-test-UuD8 writing planeId -->8; totals: out=239 B in=30 B
2018-09-11 21:33:31,296 INFO  - in-mem-test-UuD8 writing entities/o2zkv1qf4m -->3075; totals: out=3.31 kB in=30 B
2018-09-11 21:33:31,301 INFO  - in-mem-test-UuD8 writing locations/iaye3x94dz -->988; totals: out=4.83 kB in=30 B
2018-09-11 21:33:31,301 INFO  - in-mem-test-UuD8 writing policies/fmwophxaeb -->377; totals: out=5.21 kB in=30 B
2018-09-11 21:33:31,305 INFO  - in-mem-test-UuD8 writing entities/ktu07ccgxq -->532; totals: out=3.85 kB in=30 B
2018-09-11 21:33:31,306 INFO  - in-mem-test-UuD8 writing enrichers/jb4nmgojfs -->553; totals: out=5.76 kB in=30 B
2018-09-11 21:33:31,310 INFO  - in-mem-test-UuD8 writing enrichers/hdsxsa7vsq -->698; totals: out=6.46 kB in=30 B
2018-09-11 21:33:31,311 INFO  - in-mem-test-UuD8 writing enrichers/w9g9nk6ybm -->1787; totals: out=8.25 kB in=30 B
2018-09-11 21:33:31,313 INFO  - in-mem-test-UuD8 writing enrichers/esigiiq2c7 -->3303; totals: out=14.9 kB in=30 B
2018-09-11 21:33:31,313 INFO  - in-mem-test-UuD8 writing enrichers/hf80kjincf -->3303; totals: out=11.6 kB in=30 B
2018-09-11 21:33:31,313 INFO  - in-mem-test-UuD8 writing enrichers/aixukrgnfz -->553; totals: out=15.4 kB in=30 B
2018-09-11 21:33:31,314 INFO  - in-mem-test-UuD8 requesting list entities -->9; totals: out=15.4 kB in=30 B
2018-09-11 21:33:31,314 INFO  - in-mem-test-UuD8 receiving list entities <--42; totals: out=15.4 kB in=72 B
2018-09-11 21:33:31,314 INFO  - in-mem-test-UuD8 requesting list locations -->10; totals: out=15.4 kB in=72 B
2018-09-11 21:33:31,315 INFO  - in-mem-test-UuD8 receiving list locations <--22; totals: out=15.4 kB in=94 B
2018-09-11 21:33:31,315 INFO  - in-mem-test-UuD8 requesting list policies -->9; totals: out=15.4 kB in=94 B
2018-09-11 21:33:31,315 INFO  - in-mem-test-UuD8 receiving list policies <--21; totals: out=15.4 kB in=115 B
2018-09-11 21:33:31,315 INFO  - in-mem-test-UuD8 requesting list enrichers -->10; totals: out=15.4 kB in=115 B
2018-09-11 21:33:31,316 INFO  - in-mem-test-UuD8 receiving list enrichers <--132; totals: out=15.4 kB in=247 B
2018-09-11 21:33:31,316 INFO  - in-mem-test-UuD8 requesting list feeds -->6; totals: out=15.5 kB in=247 B
2018-09-11 21:33:31,317 INFO  - in-mem-test-UuD8 receiving list feeds <--2; totals: out=15.5 kB in=249 B
2018-09-11 21:33:31,317 INFO  - in-mem-test-UuD8 requesting list catalog -->8; totals: out=15.5 kB in=249 B
2018-09-11 21:33:31,317 INFO  - in-mem-test-UuD8 receiving list catalog <--2; totals: out=15.5 kB in=251 B
2018-09-11 21:33:31,317 INFO  - in-mem-test-UuD8 requesting list bundles -->8; totals: out=15.5 kB in=251 B
2018-09-11 21:33:31,318 INFO  - in-mem-test-UuD8 receiving list bundles <--2; totals: out=15.5 kB in=253 B
2018-09-11 21:33:31,318 INFO  - in-mem-test-UuD8 requesting planeId -->7; totals: out=15.5 kB in=253 B
2018-09-11 21:33:31,319 INFO  - in-mem-test-UuD8 reading planeId <--8; totals: out=15.5 kB in=261 B
2018-09-11 21:33:31,319 INFO  - in-mem-test-UuD8 requesting entities/ktu07ccgxq -->19; totals: out=15.5 kB in=261 B
2018-09-11 21:33:31,319 INFO  - in-mem-test-UuD8 requesting entities/o2zkv1qf4m -->19; totals: out=15.5 kB in=793 B
2018-09-11 21:33:31,319 INFO  - in-mem-test-UuD8 reading entities/ktu07ccgxq <--532; totals: out=15.5 kB in=793 B
2018-09-11 21:33:31,319 INFO  - in-mem-test-UuD8 reading entities/o2zkv1qf4m <--3075; totals: out=15.5 kB in=3.87 kB
2018-09-11 21:33:31,320 INFO  - in-mem-test-UuD8 requesting locations/iaye3x94dz -->20; totals: out=15.5 kB in=3.87 kB
2018-09-11 21:33:31,320 INFO  - in-mem-test-UuD8 reading locations/iaye3x94dz <--988; totals: out=15.5 kB in=4.86 kB
2018-09-11 21:33:31,321 INFO  - in-mem-test-UuD8 requesting policies/fmwophxaeb -->19; totals: out=15.6 kB in=4.86 kB
2018-09-11 21:33:31,321 INFO  - in-mem-test-UuD8 reading policies/fmwophxaeb <--377; totals: out=15.6 kB in=5.23 kB
2018-09-11 21:33:31,321 INFO  - in-mem-test-UuD8 requesting enrichers/w9g9nk6ybm -->20; totals: out=15.6 kB in=5.23 kB
2018-09-11 21:33:31,321 INFO  - in-mem-test-UuD8 reading enrichers/w9g9nk6ybm <--1787; totals: out=15.6 kB in=7.02 kB
2018-09-11 21:33:31,321 INFO  - in-mem-test-UuD8 requesting enrichers/jb4nmgojfs -->20; totals: out=15.6 kB in=7.02 kB
2018-09-11 21:33:31,321 INFO  - in-mem-test-UuD8 reading enrichers/jb4nmgojfs <--553; totals: out=15.6 kB in=7.57 kB
2018-09-11 21:33:31,321 INFO  - in-mem-test-UuD8 requesting enrichers/hf80kjincf -->20; totals: out=15.6 kB in=7.57 kB
2018-09-11 21:33:31,322 INFO  - in-mem-test-UuD8 reading enrichers/hf80kjincf <--3303; totals: out=15.6 kB in=10.9 kB
2018-09-11 21:33:31,322 INFO  - in-mem-test-UuD8 requesting enrichers/esigiiq2c7 -->20; totals: out=15.6 kB in=10.9 kB
2018-09-11 21:33:31,322 INFO  - in-mem-test-UuD8 reading enrichers/esigiiq2c7 <--3303; totals: out=15.6 kB in=14.2 kB
2018-09-11 21:33:31,322 INFO  - in-mem-test-UuD8 requesting enrichers/hdsxsa7vsq -->20; totals: out=15.7 kB in=14.2 kB
2018-09-11 21:33:31,322 INFO  - in-mem-test-UuD8 reading enrichers/hdsxsa7vsq <--698; totals: out=15.7 kB in=14.9 kB
2018-09-11 21:33:31,322 INFO  - in-mem-test-UuD8 requesting enrichers/aixukrgnfz -->20; totals: out=15.7 kB in=14.9 kB
2018-09-11 21:33:31,323 INFO  - in-mem-test-UuD8 reading enrichers/aixukrgnfz <--553; totals: out=15.7 kB in=15.4 kB
2018-09-11 21:33:31,324 INFO  - in-mem-test-UuD8 requesting planeId -->7; totals: out=15.7 kB in=15.4 kB
2018-09-11 21:33:31,325 INFO  - in-mem-test-UuD8 reading planeId <--8; totals: out=15.7 kB in=15.4 kB
2018-09-11 21:33:31,325 INFO  - in-mem-test-UuD8 writing entities/o2zkv1qf4m -->3075; totals: out=19.3 kB in=15.4 kB
2018-09-11 21:33:31,325 INFO  - in-mem-test-UuD8 writing entities/ktu07ccgxq -->532; totals: out=16.2 kB in=15.4 kB
2018-09-11 21:33:31,325 INFO  - in-mem-test-UuD8 writing locations/iaye3x94dz -->988; totals: out=20.3 kB in=15.4 kB
2018-09-11 21:33:31,325 INFO  - in-mem-test-UuD8 writing policies/fmwophxaeb -->377; totals: out=20.7 kB in=15.4 kB
2018-09-11 21:33:31,325 INFO  - in-mem-test-UuD8 writing enrichers/jb4nmgojfs -->553; totals: out=23.0 kB in=15.4 kB
2018-09-11 21:33:31,325 INFO  - in-mem-test-UuD8 writing enrichers/esigiiq2c7 -->3303; totals: out=29.6 kB in=15.4 kB
2018-09-11 21:33:31,325 INFO  - in-mem-test-UuD8 writing enrichers/hf80kjincf -->3303; totals: out=26.3 kB in=15.4 kB
2018-09-11 21:33:31,325 INFO  - in-mem-test-UuD8 writing enrichers/hdsxsa7vsq -->698; totals: out=30.3 kB in=15.4 kB
2018-09-11 21:33:31,326 INFO  - in-mem-test-UuD8 writing enrichers/aixukrgnfz -->553; totals: out=30.8 kB in=15.4 kB
2018-09-11 21:33:31,325 INFO  - in-mem-test-UuD8 writing enrichers/w9g9nk6ybm -->1787; totals: out=22.4 kB in=15.4 kB
2018-09-11 21:33:31,327 INFO  - TESTNG PASSED: "Surefire test" - org.apache.brooklyn.core.mgmt.persist.BrooklynMementoPersisterTestFixture.testLoadAndCheckpointRawMemento() finished in 37 ms
2018-09-11 21:33:31,327 INFO  - TESTNG INVOKING CONFIGURATION: "Surefire test" - @AfterMethod org.apache.brooklyn.core.mgmt.persist.BrooklynMementoPersisterTestFixture.tearDown()
2018-09-11 21:33:31,337 INFO  - in-mem-test-UuD8 deleting entities/o2zkv1qf4m -->19; totals: out=30.9 kB in=15.4 kB
2018-09-11 21:33:31,337 INFO  - in-mem-test-UuD8 deleting entities/ktu07ccgxq -->19; totals: out=30.9 kB in=15.4 kB
2018-09-11 21:33:31,337 INFO  - in-mem-test-UuD8 deleting locations/iaye3x94dz -->20; totals: out=30.9 kB in=15.4 kB
2018-09-11 21:33:31,337 INFO  - in-mem-test-UuD8 deleting policies/fmwophxaeb -->19; totals: out=30.9 kB in=15.4 kB
2018-09-11 21:33:31,337 INFO  - in-mem-test-UuD8 deleting enrichers/hf80kjincf -->20; totals: out=30.9 kB in=15.4 kB
2018-09-11 21:33:31,337 INFO  - in-mem-test-UuD8 deleting enrichers/jb4nmgojfs -->20; totals: out=31.0 kB in=15.4 kB
2018-09-11 21:33:31,337 INFO  - in-mem-test-UuD8 deleting enrichers/hdsxsa7vsq -->20; totals: out=31.0 kB in=15.4 kB
2018-09-11 21:33:31,338 INFO  - in-mem-test-UuD8 deleting enrichers/esigiiq2c7 -->20; totals: out=31.0 kB in=15.4 kB
2018-09-11 21:33:31,338 INFO  - in-mem-test-UuD8 deleting enrichers/aixukrgnfz -->20; totals: out=31.0 kB in=15.4 kB
2018-09-11 21:33:31,337 INFO  - in-mem-test-UuD8 deleting enrichers/w9g9nk6ybm -->20; totals: out=31.0 kB in=15.4 kB
2018-09-11 21:33:31,339 WARN  - Entities.destroyAll invoked on non-deployment NonDeploymentManagementContext{entity=o2zkv1qf4m, mode=MANAGEMENT_STOPPED} - not likely to have much effect! (This usually means the mgmt context has been taken from an entity that has been destroyed. To destroy other things on the management context ensure you keep a handle to the context before the entity is destroyed, such as by creating the management context first.)
2018-09-11 21:33:31,339 INFO  - in-mem-test-J0Sw deleting completely -->1; totals: out=23.7 kB in=30 B
2018-09-11 21:33:31,339 INFO  - TESTNG PASSED CONFIGURATION: "Surefire test" - @AfterMethod org.apache.brooklyn.core.mgmt.persist.BrooklynMementoPersisterTestFixture.tearDown() finished in 12 ms
2018-09-11 21:33:31,340 INFO  - TESTNG INVOKING: "Surefire test" - org.apache.brooklyn.core.mgmt.persist.DeserializingClassRenamesProviderTest.testRename()
2018-09-11 21:33:31,340 INFO  - TESTNG PASSED: "Surefire test" - org.apache.brooklyn.core.mgmt.persist.DeserializingClassRenamesProviderTest.testRename() finished in 0 ms
2018-09-11 21:33:31,340 INFO  - TESTNG INVOKING: "Surefire test" - org.apache.brooklyn.core.mgmt.persist.DeserializingClassRenamesProviderTest.testRenameInnerClass()
2018-09-11 21:33:31,340 INFO  - TESTNG PASSED: "Surefire test" - org.apache.brooklyn.core.mgmt.persist.DeserializingClassRenamesProviderTest.testRenameInnerClass() finished in 0 ms
2018-09-11 21:33:31,340 INFO  - TESTNG INVOKING: "Surefire test" - org.apache.brooklyn.core.mgmt.persist.DeserializingClassRenamesProviderTest.testRenameNoopIfNotInProperties()
2018-09-11 21:33:31,341 INFO  - TESTNG PASSED: "Surefire test" - org.apache.brooklyn.core.mgmt.persist.DeserializingClassRenamesProviderTest.testRenameNoopIfNotInProperties() finished in 1 ms
2018-09-11 21:33:31,546 INFO  - TESTNG 
===============================================
    Surefire test
    Tests run: 2329, Failures: 1, Skips: 0
===============================================
[GC (Allocation Failure)  498455K->294212K(759296K), 0.0084025 secs]
[GC (Allocation Failure)  501572K->293526K(758784K), 0.0071061 secs]
[GC (Allocation Failure)  500886K->293118K(760832K), 0.0053837 secs]
[GC (Allocation Failure)  503038K->292863K(759808K), 0.0069697 secs]
[GC (Allocation Failure)  502783K->292799K(761856K), 0.0056896 secs]
[GC (Allocation Failure)  505279K->293823K(761344K), 0.0115478 secs]
Tests run: 2329, Failures: 1, Errors: 0, Skipped: 0, Time elapsed: 154.344 sec <<< FAILURE! - in TestSuite
testRebindWithDefaultZoneFailureDetector(org.apache.brooklyn.entity.group.DynamicClusterWithAvailabilityZonesRebindTest)  Time elapsed: 0.202 sec  <<< FAILURE!
org.apache.brooklyn.util.exceptions.CompoundRuntimeException: Failure rebinding; 2 errors including: Too many dangling references: 1 of 21
	at org.apache.brooklyn.entity.group.DynamicClusterWithAvailabilityZonesRebindTest.testRebindWithDefaultZoneFailureDetector(DynamicClusterWithAvailabilityZonesRebindTest.java:92)
Caused by: java.lang.IllegalStateException: Too many dangling references: 1 of 21
	at org.apache.brooklyn.entity.group.DynamicClusterWithAvailabilityZonesRebindTest.testRebindWithDefaultZoneFailureDetector(DynamicClusterWithAvailabilityZonesRebindTest.java:92)

2018-09-11 21:33:34,046 INFO  - Brooklyn shutdown: stopping entities [TestEntityImpl{id=rli19ie2q0}, TestEntityImpl{id=w7shx4rklv}, BlockingEntityImpl{id=hx6im9b9ay}]

Results :

Failed tests: 
  DynamicClusterWithAvailabilityZonesRebindTest.testRebindWithDefaultZoneFailureDetector:92->RebindTestFixture.rebind:243->RebindTestFixtureWithApp.rebind:33->RebindTestFixtureWithApp.rebind:61->RebindTestFixture.rebind:262 » CompoundRuntime

Tests run: 2329, Failures: 1, Errors: 0, Skipped: 0

[INFO] ------------------------------------------------------------------------
[INFO] Reactor Summary:
[INFO] 
[INFO] Brooklyn Server Root ............................... SUCCESS [  3.941 s]
[INFO] Brooklyn Parent Project ............................ SUCCESS [  4.769 s]
[INFO] Brooklyn Test Support Utilities .................... SUCCESS [  8.341 s]
[INFO] Brooklyn Logback Includable Configuration .......... SUCCESS [  0.314 s]
[INFO] Brooklyn Common Utilities .......................... SUCCESS [ 30.773 s]
[INFO] Brooklyn API ....................................... SUCCESS [  1.711 s]
[INFO] CAMP Server Parent Project ......................... SUCCESS [  0.101 s]
[INFO] CAMP Base .......................................... SUCCESS [  3.833 s]
[INFO] Brooklyn Test Support .............................. SUCCESS [  0.980 s]
[INFO] Brooklyn REST Swagger Apidoc Utilities ............. SUCCESS [ 17.096 s]
[INFO] Brooklyn Logback Configuration ..................... SUCCESS [  0.222 s]
[INFO] CAMP Server ........................................ SUCCESS [ 13.838 s]
[INFO] Brooklyn Felix Runtime ............................. SUCCESS [  3.201 s]
[INFO] Brooklyn Groovy Utilities .......................... SUCCESS [  2.183 s]
[INFO] Brooklyn Core ...................................... FAILURE [03:33 min]
[INFO] Brooklyn Policies .................................. SKIPPED
[INFO] Brooklyn WinRM Software Entities ................... SKIPPED
[INFO] Brooklyn Secure JMXMP Agent ........................ SKIPPED
[INFO] Brooklyn JMX RMI Agent ............................. SKIPPED
[INFO] Brooklyn Jclouds Location Targets .................. SKIPPED
[INFO] Brooklyn Software Base ............................. SKIPPED
[INFO] Brooklyn CAMP ...................................... SKIPPED
[INFO] Brooklyn Launcher Common ........................... SKIPPED
[INFO] Brooklyn REST API .................................. SKIPPED
[INFO] Brooklyn REST Resources ............................ SKIPPED
[INFO] Brooklyn REST Server ............................... SKIPPED
[INFO] Brooklyn Launcher .................................. SKIPPED
[INFO] Brooklyn Container Location Targets ................ SKIPPED
[INFO] Brooklyn Command Line Interface .................... SKIPPED
[INFO] Brooklyn Test Framework ............................ SKIPPED
[INFO] Brooklyn OSGi init ................................. SKIPPED
[INFO] Brooklyn OSGi start ................................ SKIPPED
[INFO] Brooklyn Karaf ..................................... SKIPPED
[INFO] Jetty config fragment .............................. SKIPPED
[INFO] Apache Http Component extension .................... SKIPPED
[INFO] Brooklyn Karaf Features ............................ SKIPPED
[INFO] Brooklyn Karaf Shell Commands ...................... SKIPPED
[INFO] Brooklyn UI :: Parent .............................. SKIPPED
[INFO] Brooklyn UI :: Modularity Server (parent) .......... SKIPPED
[INFO] Brooklyn UI :: Modularity Server :: UI Module API .. SKIPPED
[INFO] Brooklyn UI :: Modularity Server :: UI Module Registry SKIPPED
[INFO] Brooklyn UI :: Modularity Server :: UI Proxy ....... SKIPPED
[INFO] Brooklyn UI :: Modularity Server :: UI Metadata Registry SKIPPED
[INFO] Brooklyn UI :: Modularity Server :: External UI Modules Registration Hooks SKIPPED
[INFO] Brooklyn UI :: Modularity Server :: Features ....... SKIPPED
[INFO] Brooklyn UI :: Modules (parent) .................... SKIPPED
[INFO] Brooklyn UI :: Modules - UI Utils .................. SKIPPED
[INFO] Brooklyn UI :: Modules - Home ...................... SKIPPED
[INFO] Brooklyn UI :: Modules - App inspector ............. SKIPPED
[INFO] Brooklyn UI :: Modules - Blueprint composer ........ SKIPPED
[INFO] Brooklyn UI :: Modules - Blueprint importer ........ SKIPPED
[INFO] Brooklyn UI :: Modules - Catalog ................... SKIPPED
[INFO] Brooklyn UI :: Modules - Location manager .......... SKIPPED
[INFO] Brooklyn UI :: Modules - REST API Docs ............. SKIPPED
[INFO] Brooklyn UI :: Modules - Groovy console ............ SKIPPED
[INFO] Brooklyn UI :: Modules - Logout .................... SKIPPED
[INFO] Brooklyn UI :: Modules - Features .................. SKIPPED
[INFO] Brooklyn UI :: Features ............................ SKIPPED
[INFO] Brooklyn Library Root .............................. SKIPPED
[INFO] Brooklyn CM Chef ................................... SKIPPED
[INFO] Brooklyn CM SaltStack .............................. SKIPPED
[INFO] Brooklyn CM Ansible ................................ SKIPPED
[INFO] Brooklyn CM Integration Root ....................... SKIPPED
[INFO] Brooklyn Network Software Entities ................. SKIPPED
[INFO] Brooklyn OSGi Software Entities .................... SKIPPED
[INFO] Brooklyn Database Software Entities ................ SKIPPED
[INFO] Brooklyn Web App Software Entities ................. SKIPPED
[INFO] Brooklyn Messaging Software Entities ............... SKIPPED
[INFO] Brooklyn NoSQL Data Store Software Entities ........ SKIPPED
[INFO] Brooklyn Monitoring Software Entities .............. SKIPPED
[INFO] Brooklyn Web App Software Entities ................. SKIPPED
[INFO] Brooklyn QA ........................................ SKIPPED
[INFO] Brooklyn Examples Aggregator Project ............... SKIPPED
[INFO] Brooklyn Examples Aggregator Project - Webapps ..... SKIPPED
[INFO] hello-world-webapp Maven Webapp .................... SKIPPED
[INFO] hello-world-sql-webapp Maven Webapp ................ SKIPPED
[INFO] Brooklyn Simple Web Cluster Example ................ SKIPPED
[INFO] Brooklyn Library Karaf integration ................. SKIPPED
[INFO] Brooklyn Library Catalog ........................... SKIPPED
[INFO] Brooklyn Library Karaf Features .................... SKIPPED
[INFO] Brooklyn Client .................................... SKIPPED
[INFO] Brooklyn Client Command Line Interface ............. SKIPPED
[INFO] Brooklyn REST java Client .......................... SKIPPED
[INFO] Brooklyn Downstream Project Parent ................. SKIPPED
[INFO] Brooklyn Dist Root ................................. SKIPPED
[INFO] Brooklyn All Things ................................ SKIPPED
[INFO] Brooklyn Distribution .............................. SKIPPED
[INFO] Brooklyn Karaf Distribution Parent ................. SKIPPED
[INFO] Brooklyn Karaf Server Configuration ................ SKIPPED
[INFO] Brooklyn Dist Karaf Features ....................... SKIPPED
[INFO] Brooklyn Karaf Distribution ........................ SKIPPED
[INFO] Brooklyn Karaf pax-exam itest ...................... SKIPPED
[INFO] Brooklyn Vagrant Getting Started Environment ....... SKIPPED
[INFO] Brooklyn Quick-Start Project Archetype ............. SKIPPED
[INFO] Brooklyn Shared Package Files ...................... SKIPPED
[INFO] Brooklyn RPM Package ............................... SKIPPED
[INFO] Brooklyn DEB Package ............................... SKIPPED
[INFO] Brooklyn Root ...................................... SKIPPED
[INFO] ------------------------------------------------------------------------
[INFO] BUILD FAILURE
[INFO] ------------------------------------------------------------------------
[INFO] Total time: 05:23 min
[INFO] Finished at: 2018-09-11T21:33:34Z
[INFO] Final Memory: 121M/858M
[INFO] ------------------------------------------------------------------------
[ERROR] Failed to execute goal org.apache.maven.plugins:maven-surefire-plugin:2.19.1:test (default-test) on project brooklyn-core: There are test failures.
[ERROR] 
[ERROR] Please refer to /usr/build/brooklyn-server/core/target/surefire-reports for the individual test results.
[ERROR] -> [Help 1]
[ERROR] 
[ERROR] To see the full stack trace of the errors, re-run Maven with the -e switch.
[ERROR] Re-run Maven using the -X switch to enable full debug logging.
[ERROR] 
[ERROR] For more information about the errors and possible solutions, please read the following articles:
[ERROR] [Help 1] http://cwiki.apache.org/confluence/display/MAVEN/MojoFailureException
[ERROR] 
[ERROR] After correcting the problems, you can resume the build with the command
[ERROR]   mvn <goals> -rf :brooklyn-core
Build step 'Execute shell' marked build as failure
Recording test results
TestNG Reports Processing: START
Looking for TestNG results report in workspace using pattern: **/testng-results.xml
Saving reports...
Processing '/x1/jenkins/jenkins-home/jobs/brooklyn-master-build-docker/builds/664/testng/testng-results-1.xml'
Processing '/x1/jenkins/jenkins-home/jobs/brooklyn-master-build-docker/builds/664/testng/testng-results-2.xml'
Processing '/x1/jenkins/jenkins-home/jobs/brooklyn-master-build-docker/builds/664/testng/testng-results-3.xml'
Processing '/x1/jenkins/jenkins-home/jobs/brooklyn-master-build-docker/builds/664/testng/testng-results-4.xml'
Processing '/x1/jenkins/jenkins-home/jobs/brooklyn-master-build-docker/builds/664/testng/testng-results-5.xml'
Processing '/x1/jenkins/jenkins-home/jobs/brooklyn-master-build-docker/builds/664/testng/testng-results.xml'
0.034072% of tests failed, which exceeded threshold of 0%. Marking build as UNSTABLE
TestNG Reports Processing: FINISH