[Date Prev][Date Next][Thread Prev][Thread Next][Date Index][Thread Index]

Build failed in Jenkins: brooklyn-server-master-docker #115


See <https://builds.apache.org/job/brooklyn-server-master-docker/115/display/redirect?page=changes>

Changes:

[aled.sage] Fix AutoScalerPolicyRebindTest: when highlights change, request

------------------------------------------
[...truncated 5.52 MB...]
2018-09-11 10:44:18,000 INFO  - TESTNG PASSED: "Surefire test" - org.apache.brooklyn.core.effector.http.HttpCommandEffectorHttpBinTest.testHttpEffectorWithPayload() finished in 8 ms
2018-09-11 10:44:18,000 INFO  - TESTNG INVOKING CONFIGURATION: "Surefire test" - @AfterMethod org.apache.brooklyn.core.effector.http.HttpCommandEffectorHttpBinTest.tearDown()
2018-09-11 10:44:18,004 INFO  - TESTNG PASSED CONFIGURATION: "Surefire test" - @AfterMethod org.apache.brooklyn.core.effector.http.HttpCommandEffectorHttpBinTest.tearDown() finished in 4 ms
2018-09-11 10:44:18,005 INFO  - TESTNG INVOKING CONFIGURATION: "Surefire test" - @BeforeMethod org.apache.brooklyn.core.test.BrooklynAppUnitTestSupport.setUp()
2018-09-11 10:44:18,005 INFO  - Added external config supplier named 'brooklyn-demo-sample': org.apache.brooklyn.core.config.external.InPlaceExternalConfigSupplier@42075a7c
2018-09-11 10:44:18,023 INFO  - TESTNG PASSED CONFIGURATION: "Surefire test" - @BeforeMethod org.apache.brooklyn.core.test.BrooklynAppUnitTestSupport.setUp() finished in 17 ms
2018-09-11 10:44:18,023 INFO  - TESTNG INVOKING CONFIGURATION: "Surefire test" - @BeforeMethod org.apache.brooklyn.core.effector.http.HttpCommandEffectorTest.start()
2018-09-11 10:44:18,023 INFO  - TESTNG PASSED CONFIGURATION: "Surefire test" - @BeforeMethod org.apache.brooklyn.core.effector.http.HttpCommandEffectorTest.start() finished in 0 ms
2018-09-11 10:44:18,023 INFO  - TESTNG INVOKING: "Surefire test" - org.apache.brooklyn.core.effector.http.HttpCommandEffectorTest.testHappyPath()
2018-09-11 10:44:18,041 INFO  - Received request: GET /get?login=myLogin HTTP/1.1 and responded: HTTP/1.1 200 OK
2018-09-11 10:44:18,042 INFO  - TESTNG PASSED: "Surefire test" - org.apache.brooklyn.core.effector.http.HttpCommandEffectorTest.testHappyPath() finished in 19 ms
2018-09-11 10:44:18,042 INFO  - TESTNG INVOKING CONFIGURATION: "Surefire test" - @AfterMethod org.apache.brooklyn.core.effector.http.HttpCommandEffectorTest.stop()
2018-09-11 10:44:18,043 INFO  - TESTNG PASSED CONFIGURATION: "Surefire test" - @AfterMethod org.apache.brooklyn.core.effector.http.HttpCommandEffectorTest.stop() finished in 1 ms
2018-09-11 10:44:18,043 INFO  - TESTNG INVOKING CONFIGURATION: "Surefire test" - @AfterMethod org.apache.brooklyn.core.test.BrooklynMgmtUnitTestSupport.tearDown()
2018-09-11 10:44:18,052 INFO  - TESTNG PASSED CONFIGURATION: "Surefire test" - @AfterMethod org.apache.brooklyn.core.test.BrooklynMgmtUnitTestSupport.tearDown() finished in 9 ms
2018-09-11 10:44:18,052 INFO  - TESTNG INVOKING CONFIGURATION: "Surefire test" - @BeforeMethod org.apache.brooklyn.core.test.BrooklynAppUnitTestSupport.setUp()
2018-09-11 10:44:18,053 INFO  - Added external config supplier named 'brooklyn-demo-sample': org.apache.brooklyn.core.config.external.InPlaceExternalConfigSupplier@187ab77c
2018-09-11 10:44:18,069 INFO  - TESTNG PASSED CONFIGURATION: "Surefire test" - @BeforeMethod org.apache.brooklyn.core.test.BrooklynAppUnitTestSupport.setUp() finished in 17 ms
2018-09-11 10:44:18,070 INFO  - TESTNG INVOKING CONFIGURATION: "Surefire test" - @BeforeMethod org.apache.brooklyn.core.effector.http.HttpCommandEffectorTest.start()
2018-09-11 10:44:18,070 INFO  - TESTNG PASSED CONFIGURATION: "Surefire test" - @BeforeMethod org.apache.brooklyn.core.effector.http.HttpCommandEffectorTest.start() finished in 1 ms
2018-09-11 10:44:18,070 INFO  - TESTNG INVOKING: "Surefire test" - org.apache.brooklyn.core.effector.http.HttpCommandEffectorTest.testInvalidURI()
2018-09-11 10:44:18,088 INFO  - TESTNG PASSED: "Surefire test" - org.apache.brooklyn.core.effector.http.HttpCommandEffectorTest.testInvalidURI() finished in 18 ms
2018-09-11 10:44:18,088 INFO  - TESTNG INVOKING CONFIGURATION: "Surefire test" - @AfterMethod org.apache.brooklyn.core.effector.http.HttpCommandEffectorTest.stop()
2018-09-11 10:44:18,088 INFO  - TESTNG PASSED CONFIGURATION: "Surefire test" - @AfterMethod org.apache.brooklyn.core.effector.http.HttpCommandEffectorTest.stop() finished in 0 ms
2018-09-11 10:44:18,088 INFO  - TESTNG INVOKING CONFIGURATION: "Surefire test" - @AfterMethod org.apache.brooklyn.core.test.BrooklynMgmtUnitTestSupport.tearDown()
2018-09-11 10:44:18,095 INFO  - TESTNG PASSED CONFIGURATION: "Surefire test" - @AfterMethod org.apache.brooklyn.core.test.BrooklynMgmtUnitTestSupport.tearDown() finished in 7 ms
2018-09-11 10:44:18,095 INFO  - TESTNG INVOKING CONFIGURATION: "Surefire test" - @BeforeMethod org.apache.brooklyn.core.test.BrooklynAppUnitTestSupport.setUp()
2018-09-11 10:44:18,095 INFO  - Added external config supplier named 'brooklyn-demo-sample': org.apache.brooklyn.core.config.external.InPlaceExternalConfigSupplier@3716d53c
2018-09-11 10:44:18,112 INFO  - TESTNG PASSED CONFIGURATION: "Surefire test" - @BeforeMethod org.apache.brooklyn.core.test.BrooklynAppUnitTestSupport.setUp() finished in 17 ms
2018-09-11 10:44:18,112 INFO  - TESTNG INVOKING CONFIGURATION: "Surefire test" - @BeforeMethod org.apache.brooklyn.core.effector.http.HttpCommandEffectorTest.start()
2018-09-11 10:44:18,112 INFO  - TESTNG PASSED CONFIGURATION: "Surefire test" - @BeforeMethod org.apache.brooklyn.core.effector.http.HttpCommandEffectorTest.start() finished in 0 ms
2018-09-11 10:44:18,112 INFO  - TESTNG INVOKING: "Surefire test" - org.apache.brooklyn.core.effector.http.HttpCommandEffectorTest.testInvalidVerb()
2018-09-11 10:44:18,125 INFO  - TESTNG PASSED: "Surefire test" - org.apache.brooklyn.core.effector.http.HttpCommandEffectorTest.testInvalidVerb() finished in 13 ms
2018-09-11 10:44:18,125 INFO  - TESTNG INVOKING CONFIGURATION: "Surefire test" - @AfterMethod org.apache.brooklyn.core.effector.http.HttpCommandEffectorTest.stop()
2018-09-11 10:44:18,125 INFO  - TESTNG PASSED CONFIGURATION: "Surefire test" - @AfterMethod org.apache.brooklyn.core.effector.http.HttpCommandEffectorTest.stop() finished in 0 ms
2018-09-11 10:44:18,126 INFO  - TESTNG INVOKING CONFIGURATION: "Surefire test" - @AfterMethod org.apache.brooklyn.core.test.BrooklynMgmtUnitTestSupport.tearDown()
2018-09-11 10:44:18,129 INFO  - TESTNG PASSED CONFIGURATION: "Surefire test" - @AfterMethod org.apache.brooklyn.core.test.BrooklynMgmtUnitTestSupport.tearDown() finished in 3 ms
2018-09-11 10:44:18,130 INFO  - TESTNG INVOKING CONFIGURATION: "Surefire test" - @BeforeMethod org.apache.brooklyn.core.test.BrooklynAppUnitTestSupport.setUp()
2018-09-11 10:44:18,130 INFO  - Added external config supplier named 'brooklyn-demo-sample': org.apache.brooklyn.core.config.external.InPlaceExternalConfigSupplier@548d2334
2018-09-11 10:44:18,141 INFO  - TESTNG PASSED CONFIGURATION: "Surefire test" - @BeforeMethod org.apache.brooklyn.core.test.BrooklynAppUnitTestSupport.setUp() finished in 11 ms
2018-09-11 10:44:18,142 INFO  - TESTNG INVOKING CONFIGURATION: "Surefire test" - @BeforeMethod org.apache.brooklyn.core.effector.http.HttpCommandEffectorTest.start()
2018-09-11 10:44:18,142 INFO  - TESTNG PASSED CONFIGURATION: "Surefire test" - @BeforeMethod org.apache.brooklyn.core.effector.http.HttpCommandEffectorTest.start() finished in 1 ms
2018-09-11 10:44:18,142 INFO  - TESTNG INVOKING: "Surefire test" - org.apache.brooklyn.core.effector.http.HttpCommandEffectorTest.testListPayloadWithoutContentTypeHeader()
2018-09-11 10:44:18,156 WARN  iii22WEs-[g8eczfhhzi,q9r627rxyp] Content-Type not specified. Using application/json, as default (continuing)
2018-09-11 10:44:18,161 INFO  - Received request: POST /post HTTP/1.1 and responded: HTTP/1.1 200 OK
2018-09-11 10:44:18,162 INFO  - TESTNG PASSED: "Surefire test" - org.apache.brooklyn.core.effector.http.HttpCommandEffectorTest.testListPayloadWithoutContentTypeHeader() finished in 20 ms
2018-09-11 10:44:18,162 INFO  - TESTNG INVOKING CONFIGURATION: "Surefire test" - @AfterMethod org.apache.brooklyn.core.effector.http.HttpCommandEffectorTest.stop()
2018-09-11 10:44:18,162 INFO  - TESTNG PASSED CONFIGURATION: "Surefire test" - @AfterMethod org.apache.brooklyn.core.effector.http.HttpCommandEffectorTest.stop() finished in 0 ms
2018-09-11 10:44:18,162 INFO  - TESTNG INVOKING CONFIGURATION: "Surefire test" - @AfterMethod org.apache.brooklyn.core.test.BrooklynMgmtUnitTestSupport.tearDown()
2018-09-11 10:44:18,167 INFO  - TESTNG PASSED CONFIGURATION: "Surefire test" - @AfterMethod org.apache.brooklyn.core.test.BrooklynMgmtUnitTestSupport.tearDown() finished in 5 ms
2018-09-11 10:44:18,167 INFO  - TESTNG INVOKING CONFIGURATION: "Surefire test" - @BeforeMethod org.apache.brooklyn.core.test.BrooklynAppUnitTestSupport.setUp()
2018-09-11 10:44:18,168 INFO  - Added external config supplier named 'brooklyn-demo-sample': org.apache.brooklyn.core.config.external.InPlaceExternalConfigSupplier@69d6c33d
2018-09-11 10:44:18,180 INFO  - TESTNG PASSED CONFIGURATION: "Surefire test" - @BeforeMethod org.apache.brooklyn.core.test.BrooklynAppUnitTestSupport.setUp() finished in 13 ms
2018-09-11 10:44:18,180 INFO  - TESTNG INVOKING CONFIGURATION: "Surefire test" - @BeforeMethod org.apache.brooklyn.core.effector.http.HttpCommandEffectorTest.start()
2018-09-11 10:44:18,181 INFO  - TESTNG PASSED CONFIGURATION: "Surefire test" - @BeforeMethod org.apache.brooklyn.core.effector.http.HttpCommandEffectorTest.start() finished in 1 ms
2018-09-11 10:44:18,181 INFO  - TESTNG INVOKING: "Surefire test" - org.apache.brooklyn.core.effector.http.HttpCommandEffectorTest.testMissingURI()
2018-09-11 10:44:18,181 INFO  - TESTNG PASSED: "Surefire test" - org.apache.brooklyn.core.effector.http.HttpCommandEffectorTest.testMissingURI() finished in 0 ms
2018-09-11 10:44:18,181 INFO  - TESTNG INVOKING CONFIGURATION: "Surefire test" - @AfterMethod org.apache.brooklyn.core.effector.http.HttpCommandEffectorTest.stop()
2018-09-11 10:44:18,181 INFO  - TESTNG PASSED CONFIGURATION: "Surefire test" - @AfterMethod org.apache.brooklyn.core.effector.http.HttpCommandEffectorTest.stop() finished in 0 ms
2018-09-11 10:44:18,181 INFO  - TESTNG INVOKING CONFIGURATION: "Surefire test" - @AfterMethod org.apache.brooklyn.core.test.BrooklynMgmtUnitTestSupport.tearDown()
2018-09-11 10:44:18,184 INFO  - TESTNG PASSED CONFIGURATION: "Surefire test" - @AfterMethod org.apache.brooklyn.core.test.BrooklynMgmtUnitTestSupport.tearDown() finished in 3 ms
2018-09-11 10:44:18,184 INFO  - TESTNG INVOKING CONFIGURATION: "Surefire test" - @BeforeMethod org.apache.brooklyn.core.test.BrooklynAppUnitTestSupport.setUp()
2018-09-11 10:44:18,184 INFO  - Added external config supplier named 'brooklyn-demo-sample': org.apache.brooklyn.core.config.external.InPlaceExternalConfigSupplier@432f1d0a
2018-09-11 10:44:18,200 INFO  - TESTNG PASSED CONFIGURATION: "Surefire test" - @BeforeMethod org.apache.brooklyn.core.test.BrooklynAppUnitTestSupport.setUp() finished in 16 ms
2018-09-11 10:44:18,200 INFO  - TESTNG INVOKING CONFIGURATION: "Surefire test" - @BeforeMethod org.apache.brooklyn.core.effector.http.HttpCommandEffectorTest.start()
2018-09-11 10:44:18,201 INFO  - TESTNG PASSED CONFIGURATION: "Surefire test" - @BeforeMethod org.apache.brooklyn.core.effector.http.HttpCommandEffectorTest.start() finished in 1 ms
2018-09-11 10:44:18,201 INFO  - TESTNG INVOKING: "Surefire test" - org.apache.brooklyn.core.effector.http.HttpCommandEffectorTest.testMissingVerb()
2018-09-11 10:44:18,201 INFO  - TESTNG PASSED: "Surefire test" - org.apache.brooklyn.core.effector.http.HttpCommandEffectorTest.testMissingVerb() finished in 0 ms
2018-09-11 10:44:18,201 INFO  - TESTNG INVOKING CONFIGURATION: "Surefire test" - @AfterMethod org.apache.brooklyn.core.effector.http.HttpCommandEffectorTest.stop()
2018-09-11 10:44:18,201 INFO  - TESTNG PASSED CONFIGURATION: "Surefire test" - @AfterMethod org.apache.brooklyn.core.effector.http.HttpCommandEffectorTest.stop() finished in 0 ms
2018-09-11 10:44:18,201 INFO  - TESTNG INVOKING CONFIGURATION: "Surefire test" - @AfterMethod org.apache.brooklyn.core.test.BrooklynMgmtUnitTestSupport.tearDown()
2018-09-11 10:44:18,204 INFO  - TESTNG PASSED CONFIGURATION: "Surefire test" - @AfterMethod org.apache.brooklyn.core.test.BrooklynMgmtUnitTestSupport.tearDown() finished in 3 ms
2018-09-11 10:44:18,205 INFO  - TESTNG INVOKING CONFIGURATION: "Surefire test" - @BeforeMethod org.apache.brooklyn.core.test.BrooklynAppUnitTestSupport.setUp()
2018-09-11 10:44:18,205 INFO  - Added external config supplier named 'brooklyn-demo-sample': org.apache.brooklyn.core.config.external.InPlaceExternalConfigSupplier@34295b43
2018-09-11 10:44:18,217 INFO  - TESTNG PASSED CONFIGURATION: "Surefire test" - @BeforeMethod org.apache.brooklyn.core.test.BrooklynAppUnitTestSupport.setUp() finished in 12 ms
2018-09-11 10:44:18,217 INFO  - TESTNG INVOKING CONFIGURATION: "Surefire test" - @BeforeMethod org.apache.brooklyn.core.effector.http.HttpCommandEffectorTest.start()
2018-09-11 10:44:18,218 INFO  - TESTNG PASSED CONFIGURATION: "Surefire test" - @BeforeMethod org.apache.brooklyn.core.effector.http.HttpCommandEffectorTest.start() finished in 1 ms
2018-09-11 10:44:18,218 INFO  - TESTNG INVOKING: "Surefire test" - org.apache.brooklyn.core.effector.http.HttpCommandEffectorTest.testPayloadWithContentTypeFormUrlEncoded()
2018-09-11 10:44:18,235 INFO  - Received request: POST /post HTTP/1.1 and responded: HTTP/1.1 200 OK
2018-09-11 10:44:18,236 INFO  - TESTNG PASSED: "Surefire test" - org.apache.brooklyn.core.effector.http.HttpCommandEffectorTest.testPayloadWithContentTypeFormUrlEncoded() finished in 18 ms
2018-09-11 10:44:18,236 INFO  - TESTNG INVOKING CONFIGURATION: "Surefire test" - @AfterMethod org.apache.brooklyn.core.effector.http.HttpCommandEffectorTest.stop()
2018-09-11 10:44:18,236 INFO  - TESTNG PASSED CONFIGURATION: "Surefire test" - @AfterMethod org.apache.brooklyn.core.effector.http.HttpCommandEffectorTest.stop() finished in 0 ms
2018-09-11 10:44:18,236 INFO  - TESTNG INVOKING CONFIGURATION: "Surefire test" - @AfterMethod org.apache.brooklyn.core.test.BrooklynMgmtUnitTestSupport.tearDown()
2018-09-11 10:44:18,241 INFO  - TESTNG PASSED CONFIGURATION: "Surefire test" - @AfterMethod org.apache.brooklyn.core.test.BrooklynMgmtUnitTestSupport.tearDown() finished in 5 ms
2018-09-11 10:44:18,242 INFO  - TESTNG INVOKING CONFIGURATION: "Surefire test" - @BeforeMethod org.apache.brooklyn.core.test.BrooklynAppUnitTestSupport.setUp()
2018-09-11 10:44:18,242 INFO  - Added external config supplier named 'brooklyn-demo-sample': org.apache.brooklyn.core.config.external.InPlaceExternalConfigSupplier@463148fa
2018-09-11 10:44:18,253 INFO  - TESTNG PASSED CONFIGURATION: "Surefire test" - @BeforeMethod org.apache.brooklyn.core.test.BrooklynAppUnitTestSupport.setUp() finished in 11 ms
2018-09-11 10:44:18,253 INFO  - TESTNG INVOKING CONFIGURATION: "Surefire test" - @BeforeMethod org.apache.brooklyn.core.effector.http.HttpCommandEffectorTest.start()
2018-09-11 10:44:18,254 INFO  - TESTNG PASSED CONFIGURATION: "Surefire test" - @BeforeMethod org.apache.brooklyn.core.effector.http.HttpCommandEffectorTest.start() finished in 1 ms
2018-09-11 10:44:18,254 INFO  - TESTNG INVOKING: "Surefire test" - org.apache.brooklyn.core.effector.http.HttpCommandEffectorTest.testPayloadWithContentTypeHeaderJson()
2018-09-11 10:44:18,266 WARN  tvGtkCrO-[h8lcqyrqvv,m220mb7dzw] Content-Type not specified. Using application/json, as default (continuing)
2018-09-11 10:44:18,271 INFO  - Received request: POST /post HTTP/1.1 and responded: HTTP/1.1 200 OK
2018-09-11 10:44:18,272 INFO  - TESTNG PASSED: "Surefire test" - org.apache.brooklyn.core.effector.http.HttpCommandEffectorTest.testPayloadWithContentTypeHeaderJson() finished in 18 ms
2018-09-11 10:44:18,272 INFO  - TESTNG INVOKING CONFIGURATION: "Surefire test" - @AfterMethod org.apache.brooklyn.core.effector.http.HttpCommandEffectorTest.stop()
2018-09-11 10:44:18,272 INFO  - TESTNG PASSED CONFIGURATION: "Surefire test" - @AfterMethod org.apache.brooklyn.core.effector.http.HttpCommandEffectorTest.stop() finished in 0 ms
2018-09-11 10:44:18,272 INFO  - TESTNG INVOKING CONFIGURATION: "Surefire test" - @AfterMethod org.apache.brooklyn.core.test.BrooklynMgmtUnitTestSupport.tearDown()
2018-09-11 10:44:18,277 INFO  - TESTNG PASSED CONFIGURATION: "Surefire test" - @AfterMethod org.apache.brooklyn.core.test.BrooklynMgmtUnitTestSupport.tearDown() finished in 5 ms
2018-09-11 10:44:18,277 INFO  - TESTNG INVOKING CONFIGURATION: "Surefire test" - @BeforeMethod org.apache.brooklyn.core.test.BrooklynAppUnitTestSupport.setUp()
2018-09-11 10:44:18,277 INFO  - Added external config supplier named 'brooklyn-demo-sample': org.apache.brooklyn.core.config.external.InPlaceExternalConfigSupplier@642f2ad4
2018-09-11 10:44:18,289 INFO  - TESTNG PASSED CONFIGURATION: "Surefire test" - @BeforeMethod org.apache.brooklyn.core.test.BrooklynAppUnitTestSupport.setUp() finished in 12 ms
2018-09-11 10:44:18,289 INFO  - TESTNG INVOKING CONFIGURATION: "Surefire test" - @BeforeMethod org.apache.brooklyn.core.effector.http.HttpCommandEffectorTest.start()
2018-09-11 10:44:18,290 INFO  - TESTNG PASSED CONFIGURATION: "Surefire test" - @BeforeMethod org.apache.brooklyn.core.effector.http.HttpCommandEffectorTest.start() finished in 1 ms
2018-09-11 10:44:18,290 INFO  - TESTNG INVOKING: "Surefire test" - org.apache.brooklyn.core.effector.http.HttpCommandEffectorTest.testPayloadWithContentTypeHeaderXml()
2018-09-11 10:44:18,302 WARN  Q1caNvRq-[tytfvqaxdu,dv07w8aamd] the http request may fail with payload 1 and 'Content-Type= application/xml, (continuing)
2018-09-11 10:44:18,306 INFO  - Received request: POST /post HTTP/1.1 and responded: HTTP/1.1 200 OK
2018-09-11 10:44:18,307 INFO  - TESTNG PASSED: "Surefire test" - org.apache.brooklyn.core.effector.http.HttpCommandEffectorTest.testPayloadWithContentTypeHeaderXml() finished in 17 ms
2018-09-11 10:44:18,307 INFO  - TESTNG INVOKING CONFIGURATION: "Surefire test" - @AfterMethod org.apache.brooklyn.core.effector.http.HttpCommandEffectorTest.stop()
2018-09-11 10:44:18,307 INFO  - TESTNG PASSED CONFIGURATION: "Surefire test" - @AfterMethod org.apache.brooklyn.core.effector.http.HttpCommandEffectorTest.stop() finished in 0 ms
2018-09-11 10:44:18,307 INFO  - TESTNG INVOKING CONFIGURATION: "Surefire test" - @AfterMethod org.apache.brooklyn.core.test.BrooklynMgmtUnitTestSupport.tearDown()
2018-09-11 10:44:18,311 INFO  - TESTNG PASSED CONFIGURATION: "Surefire test" - @AfterMethod org.apache.brooklyn.core.test.BrooklynMgmtUnitTestSupport.tearDown() finished in 4 ms
2018-09-11 10:44:18,314 INFO  - TESTNG INVOKING CONFIGURATION: "Surefire test" - @BeforeMethod org.apache.brooklyn.core.test.BrooklynAppUnitTestSupport.setUp()
2018-09-11 10:44:18,314 INFO  - Added external config supplier named 'brooklyn-demo-sample': org.apache.brooklyn.core.config.external.InPlaceExternalConfigSupplier@19178a40
2018-09-11 10:44:18,332 INFO  - TESTNG PASSED CONFIGURATION: "Surefire test" - @BeforeMethod org.apache.brooklyn.core.test.BrooklynAppUnitTestSupport.setUp() finished in 18 ms
2018-09-11 10:44:18,333 INFO  - TESTNG INVOKING CONFIGURATION: "Surefire test" - @BeforeMethod org.apache.brooklyn.core.effector.http.HttpCommandEffectorTest.start()
2018-09-11 10:44:18,333 INFO  - TESTNG PASSED CONFIGURATION: "Surefire test" - @BeforeMethod org.apache.brooklyn.core.effector.http.HttpCommandEffectorTest.start() finished in 1 ms
2018-09-11 10:44:18,333 INFO  - TESTNG INVOKING: "Surefire test" - org.apache.brooklyn.core.effector.http.HttpCommandEffectorTest.testPayloadWithContentTypeHeaderYaml()
2018-09-11 10:44:18,347 WARN  LFrxVfTq-[z8196crdgi,y1j3r7ocsq] the http request may fail with payload my yaml and 'Content-Type= application/yaml, (continuing)
2018-09-11 10:44:18,352 INFO  - Received request: POST /post HTTP/1.1 and responded: HTTP/1.1 200 OK
2018-09-11 10:44:18,353 INFO  - TESTNG PASSED: "Surefire test" - org.apache.brooklyn.core.effector.http.HttpCommandEffectorTest.testPayloadWithContentTypeHeaderYaml() finished in 19 ms
2018-09-11 10:44:18,353 INFO  - TESTNG INVOKING CONFIGURATION: "Surefire test" - @AfterMethod org.apache.brooklyn.core.effector.http.HttpCommandEffectorTest.stop()
2018-09-11 10:44:18,353 INFO  - TESTNG PASSED CONFIGURATION: "Surefire test" - @AfterMethod org.apache.brooklyn.core.effector.http.HttpCommandEffectorTest.stop() finished in 0 ms
2018-09-11 10:44:18,353 INFO  - TESTNG INVOKING CONFIGURATION: "Surefire test" - @AfterMethod org.apache.brooklyn.core.test.BrooklynMgmtUnitTestSupport.tearDown()
2018-09-11 10:44:18,358 INFO  - TESTNG PASSED CONFIGURATION: "Surefire test" - @AfterMethod org.apache.brooklyn.core.test.BrooklynMgmtUnitTestSupport.tearDown() finished in 5 ms
2018-09-11 10:44:18,358 INFO  - TESTNG INVOKING CONFIGURATION: "Surefire test" - @BeforeMethod org.apache.brooklyn.core.test.BrooklynAppUnitTestSupport.setUp()
2018-09-11 10:44:18,358 INFO  - Added external config supplier named 'brooklyn-demo-sample': org.apache.brooklyn.core.config.external.InPlaceExternalConfigSupplier@1ace9956
2018-09-11 10:44:18,370 INFO  - TESTNG PASSED CONFIGURATION: "Surefire test" - @BeforeMethod org.apache.brooklyn.core.test.BrooklynAppUnitTestSupport.setUp() finished in 12 ms
2018-09-11 10:44:18,370 INFO  - TESTNG INVOKING CONFIGURATION: "Surefire test" - @BeforeMethod org.apache.brooklyn.core.effector.http.HttpCommandEffectorTest.start()
2018-09-11 10:44:18,371 INFO  - TESTNG PASSED CONFIGURATION: "Surefire test" - @BeforeMethod org.apache.brooklyn.core.effector.http.HttpCommandEffectorTest.start() finished in 1 ms
2018-09-11 10:44:18,371 INFO  - TESTNG INVOKING: "Surefire test" - org.apache.brooklyn.core.effector.http.HttpCommandEffectorTest.testPayloadWithoutContentTypeHeader()
2018-09-11 10:44:18,384 WARN  oIiWI7aw-[or9wb5v2cw,snabo2v3k1] Content-Type not specified. Using application/json, as default (continuing)
2018-09-11 10:44:18,388 INFO  - Received request: POST /post HTTP/1.1 and responded: HTTP/1.1 200 OK
2018-09-11 10:44:18,389 INFO  - TESTNG PASSED: "Surefire test" - org.apache.brooklyn.core.effector.http.HttpCommandEffectorTest.testPayloadWithoutContentTypeHeader() finished in 18 ms
2018-09-11 10:44:18,389 INFO  - TESTNG INVOKING CONFIGURATION: "Surefire test" - @AfterMethod org.apache.brooklyn.core.effector.http.HttpCommandEffectorTest.stop()
2018-09-11 10:44:18,389 INFO  - TESTNG PASSED CONFIGURATION: "Surefire test" - @AfterMethod org.apache.brooklyn.core.effector.http.HttpCommandEffectorTest.stop() finished in 0 ms
2018-09-11 10:44:18,390 INFO  - TESTNG INVOKING CONFIGURATION: "Surefire test" - @AfterMethod org.apache.brooklyn.core.test.BrooklynMgmtUnitTestSupport.tearDown()
2018-09-11 10:44:18,394 INFO  - TESTNG PASSED CONFIGURATION: "Surefire test" - @AfterMethod org.apache.brooklyn.core.test.BrooklynMgmtUnitTestSupport.tearDown() finished in 5 ms
2018-09-11 10:44:18,394 INFO  - TESTNG INVOKING CONFIGURATION: "Surefire test" - @BeforeMethod org.apache.brooklyn.core.test.BrooklynAppUnitTestSupport.setUp()
2018-09-11 10:44:18,394 INFO  - Added external config supplier named 'brooklyn-demo-sample': org.apache.brooklyn.core.config.external.InPlaceExternalConfigSupplier@3fbc2761
2018-09-11 10:44:18,406 INFO  - TESTNG PASSED CONFIGURATION: "Surefire test" - @BeforeMethod org.apache.brooklyn.core.test.BrooklynAppUnitTestSupport.setUp() finished in 12 ms
2018-09-11 10:44:18,407 INFO  - TESTNG INVOKING CONFIGURATION: "Surefire test" - @BeforeMethod org.apache.brooklyn.core.effector.http.HttpCommandEffectorTest.start()
2018-09-11 10:44:18,407 INFO  - TESTNG PASSED CONFIGURATION: "Surefire test" - @BeforeMethod org.apache.brooklyn.core.effector.http.HttpCommandEffectorTest.start() finished in 1 ms
2018-09-11 10:44:18,407 INFO  - TESTNG INVOKING: "Surefire test" - org.apache.brooklyn.core.effector.http.HttpCommandEffectorTest.testWhen404()
2018-09-11 10:44:18,429 INFO  - Received request: GET /get?login=myLogin HTTP/1.1 and responded: HTTP/1.1 404 Not Found
2018-09-11 10:44:18,432 INFO  - TESTNG PASSED: "Surefire test" - org.apache.brooklyn.core.effector.http.HttpCommandEffectorTest.testWhen404() finished in 25 ms
2018-09-11 10:44:18,432 INFO  - TESTNG INVOKING CONFIGURATION: "Surefire test" - @AfterMethod org.apache.brooklyn.core.effector.http.HttpCommandEffectorTest.stop()
2018-09-11 10:44:18,432 INFO  - TESTNG PASSED CONFIGURATION: "Surefire test" - @AfterMethod org.apache.brooklyn.core.effector.http.HttpCommandEffectorTest.stop() finished in 0 ms
2018-09-11 10:44:18,433 INFO  - TESTNG INVOKING CONFIGURATION: "Surefire test" - @AfterMethod org.apache.brooklyn.core.test.BrooklynMgmtUnitTestSupport.tearDown()
2018-09-11 10:44:18,438 INFO  - TESTNG PASSED CONFIGURATION: "Surefire test" - @AfterMethod org.apache.brooklyn.core.test.BrooklynMgmtUnitTestSupport.tearDown() finished in 6 ms
2018-09-11 10:44:18,677 INFO  - TESTNG 
===============================================
    Surefire test
    Tests run: 2329, Failures: 1, Skips: 0
===============================================
[GC (Allocation Failure)  524909K->327668K(753664K), 0.0231535 secs]
[GC (Allocation Failure)  525812K->324928K(756224K), 0.0117814 secs]
[GC (Allocation Failure)  526656K->324616K(756224K), 0.0110884 secs]
[GC (Allocation Failure)  526344K->324808K(756736K), 0.0092629 secs]
[GC (Allocation Failure)  527048K->324799K(756224K), 0.0177148 secs]
[GC (Allocation Failure)  527039K->325146K(758784K), 0.0073087 secs]
[GC (Allocation Failure)  530970K->326541K(757760K), 0.0071279 secs]
Tests run: 2329, Failures: 1, Errors: 0, Skipped: 0, Time elapsed: 146.188 sec <<< FAILURE! - in TestSuite
testRebindWithDefaultZoneFailureDetector(org.apache.brooklyn.entity.group.DynamicClusterWithAvailabilityZonesRebindTest)  Time elapsed: 0.468 sec  <<< FAILURE!
org.apache.brooklyn.util.exceptions.CompoundRuntimeException: Failure rebinding; 2 errors including: Too many dangling references: 1 of 21
	at org.apache.brooklyn.entity.group.DynamicClusterWithAvailabilityZonesRebindTest.testRebindWithDefaultZoneFailureDetector(DynamicClusterWithAvailabilityZonesRebindTest.java:92)
Caused by: java.lang.IllegalStateException: Too many dangling references: 1 of 21
	at org.apache.brooklyn.entity.group.DynamicClusterWithAvailabilityZonesRebindTest.testRebindWithDefaultZoneFailureDetector(DynamicClusterWithAvailabilityZonesRebindTest.java:92)

2018-09-11 10:44:21,676 INFO  - Brooklyn shutdown: stopping entities [TestEntityImpl{id=zztjcs4cvf}, TestEntityImpl{id=qsju4y4l1g}, BlockingEntityImpl{id=j0kksm1y74}]

Results :

Failed tests: 
  DynamicClusterWithAvailabilityZonesRebindTest.testRebindWithDefaultZoneFailureDetector:92->RebindTestFixture.rebind:243->RebindTestFixtureWithApp.rebind:33->RebindTestFixtureWithApp.rebind:61->RebindTestFixture.rebind:262 » CompoundRuntime

Tests run: 2329, Failures: 1, Errors: 0, Skipped: 0

[INFO] ------------------------------------------------------------------------
[INFO] Reactor Summary:
[INFO] 
[INFO] Brooklyn Server Root ............................... SUCCESS [  3.863 s]
[INFO] Brooklyn Parent Project ............................ SUCCESS [  4.983 s]
[INFO] Brooklyn Test Support Utilities .................... SUCCESS [  7.480 s]
[INFO] Brooklyn Logback Includable Configuration .......... SUCCESS [  0.531 s]
[INFO] Brooklyn Common Utilities .......................... SUCCESS [ 30.539 s]
[INFO] Brooklyn API ....................................... SUCCESS [  1.879 s]
[INFO] CAMP Server Parent Project ......................... SUCCESS [  0.130 s]
[INFO] CAMP Base .......................................... SUCCESS [  3.235 s]
[INFO] Brooklyn Test Support .............................. SUCCESS [  1.158 s]
[INFO] Brooklyn REST Swagger Apidoc Utilities ............. SUCCESS [ 10.242 s]
[INFO] Brooklyn Logback Configuration ..................... SUCCESS [  0.192 s]
[INFO] CAMP Server ........................................ SUCCESS [  9.828 s]
[INFO] Brooklyn Felix Runtime ............................. SUCCESS [  2.964 s]
[INFO] Brooklyn Groovy Utilities .......................... SUCCESS [  2.045 s]
[INFO] Brooklyn Core ...................................... FAILURE [03:22 min]
[INFO] Brooklyn Policies .................................. SKIPPED
[INFO] Brooklyn WinRM Software Entities ................... SKIPPED
[INFO] Brooklyn Secure JMXMP Agent ........................ SKIPPED
[INFO] Brooklyn JMX RMI Agent ............................. SKIPPED
[INFO] Brooklyn Jclouds Location Targets .................. SKIPPED
[INFO] Brooklyn Software Base ............................. SKIPPED
[INFO] Brooklyn CAMP ...................................... SKIPPED
[INFO] Brooklyn Launcher Common ........................... SKIPPED
[INFO] Brooklyn REST API .................................. SKIPPED
[INFO] Brooklyn REST Resources ............................ SKIPPED
[INFO] Brooklyn REST Server ............................... SKIPPED
[INFO] Brooklyn Launcher .................................. SKIPPED
[INFO] Brooklyn Container Location Targets ................ SKIPPED
[INFO] Brooklyn Command Line Interface .................... SKIPPED
[INFO] Brooklyn Test Framework ............................ SKIPPED
[INFO] Brooklyn OSGi init ................................. SKIPPED
[INFO] Brooklyn OSGi start ................................ SKIPPED
[INFO] Brooklyn Karaf ..................................... SKIPPED
[INFO] Jetty config fragment .............................. SKIPPED
[INFO] Apache Http Component extension .................... SKIPPED
[INFO] Brooklyn Karaf Features ............................ SKIPPED
[INFO] Brooklyn Karaf Shell Commands ...................... SKIPPED
[INFO] ------------------------------------------------------------------------
[INFO] BUILD FAILURE
[INFO] ------------------------------------------------------------------------
[INFO] Total time: 04:52 min
[INFO] Finished at: 2018-09-11T10:44:22Z
[INFO] Final Memory: 74M/832M
[INFO] ------------------------------------------------------------------------
[ERROR] Failed to execute goal org.apache.maven.plugins:maven-surefire-plugin:2.19.1:test (default-test) on project brooklyn-core: There are test failures.
[ERROR] 
[ERROR] Please refer to /usr/build/core/target/surefire-reports for the individual test results.
[ERROR] -> [Help 1]
[ERROR] 
[ERROR] To see the full stack trace of the errors, re-run Maven with the -e switch.
[ERROR] Re-run Maven using the -X switch to enable full debug logging.
[ERROR] 
[ERROR] For more information about the errors and possible solutions, please read the following articles:
[ERROR] [Help 1] http://cwiki.apache.org/confluence/display/MAVEN/MojoFailureException
[ERROR] 
[ERROR] After correcting the problems, you can resume the build with the command
[ERROR]   mvn <goals> -rf :brooklyn-core
Build step 'Execute shell' marked build as failure
Recording test results
TestNG Reports Processing: START
Looking for TestNG results report in workspace using pattern: **/testng-results.xml
Saving reports...
Processing '/x1/jenkins/jenkins-home/jobs/brooklyn-server-master-docker/builds/115/testng/testng-results-1.xml'
Processing '/x1/jenkins/jenkins-home/jobs/brooklyn-server-master-docker/builds/115/testng/testng-results-2.xml'
Processing '/x1/jenkins/jenkins-home/jobs/brooklyn-server-master-docker/builds/115/testng/testng-results-3.xml'
Processing '/x1/jenkins/jenkins-home/jobs/brooklyn-server-master-docker/builds/115/testng/testng-results-4.xml'
Processing '/x1/jenkins/jenkins-home/jobs/brooklyn-server-master-docker/builds/115/testng/testng-results-5.xml'
Processing '/x1/jenkins/jenkins-home/jobs/brooklyn-server-master-docker/builds/115/testng/testng-results.xml'
0.034072% of tests failed, which exceeded threshold of 0%. Marking build as UNSTABLE
TestNG Reports Processing: FINISH