OSDir


[Date Prev][Date Next][Thread Prev][Thread Next][Date Index][Thread Index]

Build failed in Jenkins: brooklyn-master-build-docker #515


See <https://builds.apache.org/job/brooklyn-master-build-docker/515/display/redirect>

------------------------------------------
[...truncated 7.22 KB...]
	at hudson.Util.tryOnceDeleteContentsRecursive(Util.java:407)
	at hudson.Util.tryOnceDeleteRecursive(Util.java:387)
	at hudson.Util.tryOnceDeleteContentsRecursive(Util.java:407)
	at hudson.Util.tryOnceDeleteRecursive(Util.java:387)
	at hudson.Util.tryOnceDeleteContentsRecursive(Util.java:407)
	at hudson.Util.tryOnceDeleteRecursive(Util.java:387)
	at hudson.Util.tryOnceDeleteContentsRecursive(Util.java:407)
	at hudson.Util.deleteContentsRecursive(Util.java:252)
	... 11 more
ERROR: Error cloning remote repo 'origin'
Retrying after 10 seconds
Cloning the remote Git repository
Cloning repository https://git-wip-us.apache.org/repos/asf/brooklyn.git
ERROR: Failed to clean the workspace
java.io.IOException: Unable to delete '<https://builds.apache.org/job/brooklyn-master-build-docker/ws/'.> Tried 3 times (of a maximum of 3) waiting 0.1 sec between attempts.
	at hudson.Util.deleteContentsRecursive(Util.java:257)
	at org.jenkinsci.plugins.gitclient.CliGitAPIImpl$2.execute(CliGitAPIImpl.java:555)
	at org.jenkinsci.plugins.gitclient.RemoteGitImpl$CommandInvocationHandler$1.call(RemoteGitImpl.java:153)
	at org.jenkinsci.plugins.gitclient.RemoteGitImpl$CommandInvocationHandler$1.call(RemoteGitImpl.java:146)
	at hudson.remoting.UserRequest.perform(UserRequest.java:212)
	at hudson.remoting.UserRequest.perform(UserRequest.java:54)
	at hudson.remoting.Request$2.run(Request.java:369)
	at hudson.remoting.InterceptingExecutorService$1.call(InterceptingExecutorService.java:72)
	at java.util.concurrent.FutureTask.run(FutureTask.java:266)
	at java.util.concurrent.ThreadPoolExecutor.runWorker(ThreadPoolExecutor.java:1142)
	at java.util.concurrent.ThreadPoolExecutor$Worker.run(ThreadPoolExecutor.java:617)
	at java.lang.Thread.run(Thread.java:748)
Caused by: java.nio.file.FileSystemException: <https://builds.apache.org/job/brooklyn-master-build-docker/ws/brooklyn-ui/target/war/work/webapp-cache.xml>: Operation not permitted
	at sun.nio.fs.UnixException.translateToIOException(UnixException.java:91)
	at sun.nio.fs.UnixException.rethrowAsIOException(UnixException.java:102)
	at sun.nio.fs.UnixException.rethrowAsIOException(UnixException.java:107)
	at sun.nio.fs.UnixFileAttributeViews$Posix.setMode(UnixFileAttributeViews.java:238)
	at sun.nio.fs.UnixFileAttributeViews$Posix.setPermissions(UnixFileAttributeViews.java:260)
	at java.nio.file.Files.setPosixFilePermissions(Files.java:2045)
	at hudson.Util.makeWritable(Util.java:337)
	at hudson.Util.tryOnceDeleteFile(Util.java:297)
	at hudson.Util.tryOnceDeleteRecursive(Util.java:388)
	at hudson.Util.tryOnceDeleteContentsRecursive(Util.java:407)
	at hudson.Util.tryOnceDeleteRecursive(Util.java:387)
	at hudson.Util.tryOnceDeleteContentsRecursive(Util.java:407)
	at hudson.Util.tryOnceDeleteRecursive(Util.java:387)
	at hudson.Util.tryOnceDeleteContentsRecursive(Util.java:407)
	at hudson.Util.tryOnceDeleteRecursive(Util.java:387)
	at hudson.Util.tryOnceDeleteContentsRecursive(Util.java:407)
	at hudson.Util.tryOnceDeleteRecursive(Util.java:387)
	at hudson.Util.tryOnceDeleteContentsRecursive(Util.java:407)
	at hudson.Util.deleteContentsRecursive(Util.java:252)
	... 11 more
ERROR: Error cloning remote repo 'origin'
hudson.plugins.git.GitException: Failed to delete workspace
	at org.jenkinsci.plugins.gitclient.CliGitAPIImpl$2.execute(CliGitAPIImpl.java:558)
	at org.jenkinsci.plugins.gitclient.RemoteGitImpl$CommandInvocationHandler$1.call(RemoteGitImpl.java:153)
	at org.jenkinsci.plugins.gitclient.RemoteGitImpl$CommandInvocationHandler$1.call(RemoteGitImpl.java:146)
	at hudson.remoting.UserRequest.perform(UserRequest.java:212)
	at hudson.remoting.UserRequest.perform(UserRequest.java:54)
	at hudson.remoting.Request$2.run(Request.java:369)
	at hudson.remoting.InterceptingExecutorService$1.call(InterceptingExecutorService.java:72)
	at java.util.concurrent.FutureTask.run(FutureTask.java:266)
	at java.util.concurrent.ThreadPoolExecutor.runWorker(ThreadPoolExecutor.java:1142)
	at java.util.concurrent.ThreadPoolExecutor$Worker.run(ThreadPoolExecutor.java:617)
	at java.lang.Thread.run(Thread.java:748)
	Suppressed: hudson.remoting.Channel$CallSiteStackTrace: Remote call to ubuntu-eu2
		at hudson.remoting.Channel.attachCallSiteStackTrace(Channel.java:1741)
		at hudson.remoting.UserRequest$ExceptionResponse.retrieve(UserRequest.java:357)
		at hudson.remoting.Channel.call(Channel.java:955)
		at org.jenkinsci.plugins.gitclient.RemoteGitImpl$CommandInvocationHandler.execute(RemoteGitImpl.java:146)
		at sun.reflect.GeneratedMethodAccessor815.invoke(Unknown Source)
		at sun.reflect.DelegatingMethodAccessorImpl.invoke(DelegatingMethodAccessorImpl.java:43)
		at java.lang.reflect.Method.invoke(Method.java:498)
		at org.jenkinsci.plugins.gitclient.RemoteGitImpl$CommandInvocationHandler.invoke(RemoteGitImpl.java:132)
		at com.sun.proxy.$Proxy133.execute(Unknown Source)
		at hudson.plugins.git.GitSCM.retrieveChanges(GitSCM.java:1146)
		at hudson.plugins.git.GitSCM.checkout(GitSCM.java:1186)
		at hudson.scm.SCM.checkout(SCM.java:504)
		at hudson.model.AbstractProject.checkout(AbstractProject.java:1208)
		at hudson.model.AbstractBuild$AbstractBuildExecution.defaultCheckout(AbstractBuild.java:574)
		at jenkins.scm.SCMCheckoutStrategy.checkout(SCMCheckoutStrategy.java:86)
		at hudson.model.AbstractBuild$AbstractBuildExecution.run(AbstractBuild.java:499)
		at hudson.model.Run.execute(Run.java:1794)
		at hudson.model.FreeStyleBuild.run(FreeStyleBuild.java:43)
		at hudson.model.ResourceController.execute(ResourceController.java:97)
		at hudson.model.Executor.run(Executor.java:429)
Caused by: java.io.IOException: Unable to delete '<https://builds.apache.org/job/brooklyn-master-build-docker/ws/'.> Tried 3 times (of a maximum of 3) waiting 0.1 sec between attempts.
	at hudson.Util.deleteContentsRecursive(Util.java:257)
	at org.jenkinsci.plugins.gitclient.CliGitAPIImpl$2.execute(CliGitAPIImpl.java:555)
	... 10 more
Caused by: java.nio.file.FileSystemException: <https://builds.apache.org/job/brooklyn-master-build-docker/ws/brooklyn-ui/target/war/work/webapp-cache.xml>: Operation not permitted
	at sun.nio.fs.UnixException.translateToIOException(UnixException.java:91)
	at sun.nio.fs.UnixException.rethrowAsIOException(UnixException.java:102)
	at sun.nio.fs.UnixException.rethrowAsIOException(UnixException.java:107)
	at sun.nio.fs.UnixFileAttributeViews$Posix.setMode(UnixFileAttributeViews.java:238)
	at sun.nio.fs.UnixFileAttributeViews$Posix.setPermissions(UnixFileAttributeViews.java:260)
	at java.nio.file.Files.setPosixFilePermissions(Files.java:2045)
	at hudson.Util.makeWritable(Util.java:337)
	at hudson.Util.tryOnceDeleteFile(Util.java:297)
	at hudson.Util.tryOnceDeleteRecursive(Util.java:388)
	at hudson.Util.tryOnceDeleteContentsRecursive(Util.java:407)
	at hudson.Util.tryOnceDeleteRecursive(Util.java:387)
	at hudson.Util.tryOnceDeleteContentsRecursive(Util.java:407)
	at hudson.Util.tryOnceDeleteRecursive(Util.java:387)
	at hudson.Util.tryOnceDeleteContentsRecursive(Util.java:407)
	at hudson.Util.tryOnceDeleteRecursive(Util.java:387)
	at hudson.Util.tryOnceDeleteContentsRecursive(Util.java:407)
	at hudson.Util.tryOnceDeleteRecursive(Util.java:387)
	at hudson.Util.tryOnceDeleteContentsRecursive(Util.java:407)
	at hudson.Util.deleteContentsRecursive(Util.java:252)
	... 11 more
ERROR: Error cloning remote repo 'origin'
Retrying after 10 seconds
Cloning the remote Git repository
Cloning repository https://git-wip-us.apache.org/repos/asf/brooklyn.git
ERROR: Failed to clean the workspace
java.io.IOException: Unable to delete '<https://builds.apache.org/job/brooklyn-master-build-docker/ws/'.> Tried 3 times (of a maximum of 3) waiting 0.1 sec between attempts.
	at hudson.Util.deleteContentsRecursive(Util.java:257)
	at org.jenkinsci.plugins.gitclient.CliGitAPIImpl$2.execute(CliGitAPIImpl.java:555)
	at org.jenkinsci.plugins.gitclient.RemoteGitImpl$CommandInvocationHandler$1.call(RemoteGitImpl.java:153)
	at org.jenkinsci.plugins.gitclient.RemoteGitImpl$CommandInvocationHandler$1.call(RemoteGitImpl.java:146)
	at hudson.remoting.UserRequest.perform(UserRequest.java:212)
	at hudson.remoting.UserRequest.perform(UserRequest.java:54)
	at hudson.remoting.Request$2.run(Request.java:369)
	at hudson.remoting.InterceptingExecutorService$1.call(InterceptingExecutorService.java:72)
	at java.util.concurrent.FutureTask.run(FutureTask.java:266)
	at java.util.concurrent.ThreadPoolExecutor.runWorker(ThreadPoolExecutor.java:1142)
	at java.util.concurrent.ThreadPoolExecutor$Worker.run(ThreadPoolExecutor.java:617)
	at java.lang.Thread.run(Thread.java:748)
Caused by: java.nio.file.FileSystemException: <https://builds.apache.org/job/brooklyn-master-build-docker/ws/brooklyn-ui/target/war/work/webapp-cache.xml>: Operation not permitted
	at sun.nio.fs.UnixException.translateToIOException(UnixException.java:91)
	at sun.nio.fs.UnixException.rethrowAsIOException(UnixException.java:102)
	at sun.nio.fs.UnixException.rethrowAsIOException(UnixException.java:107)
	at sun.nio.fs.UnixFileAttributeViews$Posix.setMode(UnixFileAttributeViews.java:238)
	at sun.nio.fs.UnixFileAttributeViews$Posix.setPermissions(UnixFileAttributeViews.java:260)
	at java.nio.file.Files.setPosixFilePermissions(Files.java:2045)
	at hudson.Util.makeWritable(Util.java:337)
	at hudson.Util.tryOnceDeleteFile(Util.java:297)
	at hudson.Util.tryOnceDeleteRecursive(Util.java:388)
	at hudson.Util.tryOnceDeleteContentsRecursive(Util.java:407)
	at hudson.Util.tryOnceDeleteRecursive(Util.java:387)
	at hudson.Util.tryOnceDeleteContentsRecursive(Util.java:407)
	at hudson.Util.tryOnceDeleteRecursive(Util.java:387)
	at hudson.Util.tryOnceDeleteContentsRecursive(Util.java:407)
	at hudson.Util.tryOnceDeleteRecursive(Util.java:387)
	at hudson.Util.tryOnceDeleteContentsRecursive(Util.java:407)
	at hudson.Util.tryOnceDeleteRecursive(Util.java:387)
	at hudson.Util.tryOnceDeleteContentsRecursive(Util.java:407)
	at hudson.Util.deleteContentsRecursive(Util.java:252)
	... 11 more
ERROR: Error cloning remote repo 'origin'
hudson.plugins.git.GitException: Failed to delete workspace
	at org.jenkinsci.plugins.gitclient.CliGitAPIImpl$2.execute(CliGitAPIImpl.java:558)
	at org.jenkinsci.plugins.gitclient.RemoteGitImpl$CommandInvocationHandler$1.call(RemoteGitImpl.java:153)
	at org.jenkinsci.plugins.gitclient.RemoteGitImpl$CommandInvocationHandler$1.call(RemoteGitImpl.java:146)
	at hudson.remoting.UserRequest.perform(UserRequest.java:212)
	at hudson.remoting.UserRequest.perform(UserRequest.java:54)
	at hudson.remoting.Request$2.run(Request.java:369)
	at hudson.remoting.InterceptingExecutorService$1.call(InterceptingExecutorService.java:72)
	at java.util.concurrent.FutureTask.run(FutureTask.java:266)
	at java.util.concurrent.ThreadPoolExecutor.runWorker(ThreadPoolExecutor.java:1142)
	at java.util.concurrent.ThreadPoolExecutor$Worker.run(ThreadPoolExecutor.java:617)
	at java.lang.Thread.run(Thread.java:748)
	Suppressed: hudson.remoting.Channel$CallSiteStackTrace: Remote call to ubuntu-eu2
		at hudson.remoting.Channel.attachCallSiteStackTrace(Channel.java:1741)
		at hudson.remoting.UserRequest$ExceptionResponse.retrieve(UserRequest.java:357)
		at hudson.remoting.Channel.call(Channel.java:955)
		at org.jenkinsci.plugins.gitclient.RemoteGitImpl$CommandInvocationHandler.execute(RemoteGitImpl.java:146)
		at sun.reflect.GeneratedMethodAccessor815.invoke(Unknown Source)
		at sun.reflect.DelegatingMethodAccessorImpl.invoke(DelegatingMethodAccessorImpl.java:43)
		at java.lang.reflect.Method.invoke(Method.java:498)
		at org.jenkinsci.plugins.gitclient.RemoteGitImpl$CommandInvocationHandler.invoke(RemoteGitImpl.java:132)
		at com.sun.proxy.$Proxy133.execute(Unknown Source)
		at hudson.plugins.git.GitSCM.retrieveChanges(GitSCM.java:1146)
		at hudson.plugins.git.GitSCM.checkout(GitSCM.java:1186)
		at hudson.scm.SCM.checkout(SCM.java:504)
		at hudson.model.AbstractProject.checkout(AbstractProject.java:1208)
		at hudson.model.AbstractBuild$AbstractBuildExecution.defaultCheckout(AbstractBuild.java:574)
		at jenkins.scm.SCMCheckoutStrategy.checkout(SCMCheckoutStrategy.java:86)
		at hudson.model.AbstractBuild$AbstractBuildExecution.run(AbstractBuild.java:499)
		at hudson.model.Run.execute(Run.java:1794)
		at hudson.model.FreeStyleBuild.run(FreeStyleBuild.java:43)
		at hudson.model.ResourceController.execute(ResourceController.java:97)
		at hudson.model.Executor.run(Executor.java:429)
Caused by: java.io.IOException: Unable to delete '<https://builds.apache.org/job/brooklyn-master-build-docker/ws/'.> Tried 3 times (of a maximum of 3) waiting 0.1 sec between attempts.
	at hudson.Util.deleteContentsRecursive(Util.java:257)
	at org.jenkinsci.plugins.gitclient.CliGitAPIImpl$2.execute(CliGitAPIImpl.java:555)
	... 10 more
Caused by: java.nio.file.FileSystemException: <https://builds.apache.org/job/brooklyn-master-build-docker/ws/brooklyn-ui/target/war/work/webapp-cache.xml>: Operation not permitted
	at sun.nio.fs.UnixException.translateToIOException(UnixException.java:91)
	at sun.nio.fs.UnixException.rethrowAsIOException(UnixException.java:102)
	at sun.nio.fs.UnixException.rethrowAsIOException(UnixException.java:107)
	at sun.nio.fs.UnixFileAttributeViews$Posix.setMode(UnixFileAttributeViews.java:238)
	at sun.nio.fs.UnixFileAttributeViews$Posix.setPermissions(UnixFileAttributeViews.java:260)
	at java.nio.file.Files.setPosixFilePermissions(Files.java:2045)
	at hudson.Util.makeWritable(Util.java:337)
	at hudson.Util.tryOnceDeleteFile(Util.java:297)
	at hudson.Util.tryOnceDeleteRecursive(Util.java:388)
	at hudson.Util.tryOnceDeleteContentsRecursive(Util.java:407)
	at hudson.Util.tryOnceDeleteRecursive(Util.java:387)
	at hudson.Util.tryOnceDeleteContentsRecursive(Util.java:407)
	at hudson.Util.tryOnceDeleteRecursive(Util.java:387)
	at hudson.Util.tryOnceDeleteContentsRecursive(Util.java:407)
	at hudson.Util.tryOnceDeleteRecursive(Util.java:387)
	at hudson.Util.tryOnceDeleteContentsRecursive(Util.java:407)
	at hudson.Util.tryOnceDeleteRecursive(Util.java:387)
	at hudson.Util.tryOnceDeleteContentsRecursive(Util.java:407)
	at hudson.Util.deleteContentsRecursive(Util.java:252)
	... 11 more
ERROR: Error cloning remote repo 'origin'
Recording test results
ERROR: Step ‘Publish JUnit test result report’ failed: Test reports were found but none of them are new. Did leafNodes run? 
For example, <https://builds.apache.org/job/brooklyn-master-build-docker/ws/brooklyn-client/java/target/surefire-reports/junitreports/TEST-org.apache.brooklyn.rest.client.BrooklynApiGetEntityTest.xml> is 3 mo 22 days old

TestNG Reports Processing: START
Looking for TestNG results report in workspace using pattern: **/testng-results.xml
testng-results.xml was last modified before this build started. Ignoring it.
testng-results.xml was last modified before this build started. Ignoring it.
testng-results.xml was last modified before this build started. Ignoring it.
testng-results.xml was last modified before this build started. Ignoring it.
testng-results.xml was last modified before this build started. Ignoring it.
testng-results.xml was last modified before this build started. Ignoring it.
testng-results.xml was last modified before this build started. Ignoring it.
testng-results.xml was last modified before this build started. Ignoring it.
testng-results.xml was last modified before this build started. Ignoring it.
testng-results.xml was last modified before this build started. Ignoring it.
testng-results.xml was last modified before this build started. Ignoring it.
testng-results.xml was last modified before this build started. Ignoring it.
testng-results.xml was last modified before this build started. Ignoring it.
testng-results.xml was last modified before this build started. Ignoring it.
testng-results.xml was last modified before this build started. Ignoring it.
testng-results.xml was last modified before this build started. Ignoring it.
testng-results.xml was last modified before this build started. Ignoring it.
testng-results.xml was last modified before this build started. Ignoring it.
testng-results.xml was last modified before this build started. Ignoring it.
testng-results.xml was last modified before this build started. Ignoring it.
testng-results.xml was last modified before this build started. Ignoring it.
testng-results.xml was last modified before this build started. Ignoring it.
testng-results.xml was last modified before this build started. Ignoring it.
testng-results.xml was last modified before this build started. Ignoring it.
testng-results.xml was last modified before this build started. Ignoring it.
testng-results.xml was last modified before this build started. Ignoring it.
testng-results.xml was last modified before this build started. Ignoring it.
testng-results.xml was last modified before this build started. Ignoring it.
testng-results.xml was last modified before this build started. Ignoring it.
testng-results.xml was last modified before this build started. Ignoring it.
testng-results.xml was last modified before this build started. Ignoring it.
testng-results.xml was last modified before this build started. Ignoring it.
testng-results.xml was last modified before this build started. Ignoring it.
testng-results.xml was last modified before this build started. Ignoring it.
testng-results.xml was last modified before this build started. Ignoring it.
Saving reports...
Found matching files but did not find any TestNG results.