osdir.com

[Date Prev][Date Next][Thread Prev][Thread Next][Date Index][Thread Index]

Build failed in Jenkins: brooklyn-server-master-docker #91


See <https://builds.apache.org/job/brooklyn-server-master-docker/91/display/redirect?page=changes>

Changes:

[duncan.grant] does a yaml parse and compares the hash of the result when checking plan

[duncan.grant] Add tests to RegisteredTypes.arePlansEquivilant

[duncan.grant] Refactor tests to be more readable

------------------------------------------
[...truncated 9.07 MB...]
2018-06-15 09:00:19,406 WARN  qk5eZbNe-[ts4qf3it17] Setting Application[4qf3it17] on-fire due to problems when expected running, up=false, not-up-indicators: {service.state=Application starting, service-lifecycle-indicators-from-children-and-members=InfrastructureDeploymentTestCaseImpl{id=v34set2cdj} is not up}
2018-06-15 09:00:19,407 WARN  qk5eZbNe-[ts4qf3it17] Error invoking start at Application[4qf3it17]: ProblemStartingChildrenException: org.apache.brooklyn.util.exceptions.PropagatedRuntimeException: Error invoking start at InfrastructureDeploymentTestCaseImpl{id=v34set2cdj}: infrastructure.deployment.spec[ConfigKey:org.apache.brooklyn.api.entity.EntitySpec] not configured
2018-06-15 09:00:19,413 INFO  - TESTNG PASSED: "Surefire test" - org.apache.brooklyn.test.framework.InfrastructureDeploymentTestCaseTest.testNoInfrastructureSpec() finished in 35 ms
2018-06-15 09:00:19,414 INFO  - TESTNG INVOKING CONFIGURATION: "Surefire test" - @AfterMethod org.apache.brooklyn.test.framework.InfrastructureDeploymentTestCaseTest.tearDown()
2018-06-15 09:00:19,418 INFO  - TESTNG PASSED CONFIGURATION: "Surefire test" - @AfterMethod org.apache.brooklyn.test.framework.InfrastructureDeploymentTestCaseTest.tearDown() finished in 5 ms
2018-06-15 09:00:19,418 INFO  - TESTNG INVOKING CONFIGURATION: "Surefire test" - @BeforeMethod org.apache.brooklyn.test.framework.InfrastructureDeploymentTestCaseTest.setup()
2018-06-15 09:00:19,418 INFO  - Added external config supplier named 'brooklyn-demo-sample': org.apache.brooklyn.core.config.external.InPlaceExternalConfigSupplier@ab4aa5e
2018-06-15 09:00:19,428 INFO  - TESTNG PASSED CONFIGURATION: "Surefire test" - @BeforeMethod org.apache.brooklyn.test.framework.InfrastructureDeploymentTestCaseTest.setup() finished in 10 ms
2018-06-15 09:00:19,428 INFO  - TESTNG INVOKING: "Surefire test" - org.apache.brooklyn.test.framework.InfrastructureDeploymentTestCaseTest.testVanilla()
2018-06-15 09:00:19,438 WARN  yyWSUJZo-[jh88sfvftq,uaxahkqmda] Discouraged use of non-static config key private final org.apache.brooklyn.core.sensor.AttributeSensorAndConfigKey org.apache.brooklyn.test.framework.entity.TestInfrastructureImpl.DEPLOYMENT_LOCATION defined in class org.apache.brooklyn.test.framework.entity.TestInfrastructureImpl
2018-06-15 09:00:19,463 INFO  Az7fl5Yl-[jh88sfvftq,uaxahkqmda,t77dkybt7i] Started application TestInfrastructureImpl{id=t77dkybt7i}
2018-06-15 09:00:19,484 INFO  TL1o9MM6-[jh88sfvftq,uaxahkqmda,p2cq9c5wc6] Started application BasicApplicationImpl{id=p2cq9c5wc6}
2018-06-15 09:00:19,497 INFO  - TESTNG PASSED: "Surefire test" - org.apache.brooklyn.test.framework.InfrastructureDeploymentTestCaseTest.testVanilla() finished in 69 ms
2018-06-15 09:00:19,497 INFO  - TESTNG INVOKING CONFIGURATION: "Surefire test" - @AfterMethod org.apache.brooklyn.test.framework.InfrastructureDeploymentTestCaseTest.tearDown()
2018-06-15 09:00:19,499 INFO  naT0O3IQ-[jh88sfvftq,uaxahkqmda,t77dkybt7i] Stopping application TestInfrastructureImpl{id=t77dkybt7i}
2018-06-15 09:00:19,500 INFO  naT0O3IQ-[jh88sfvftq,uaxahkqmda,t77dkybt7i] Stopped application TestInfrastructureImpl{id=t77dkybt7i}
2018-06-15 09:00:19,501 INFO  qDORPUm0-[jh88sfvftq,uaxahkqmda,p2cq9c5wc6] Stopping application BasicApplicationImpl{id=p2cq9c5wc6}
2018-06-15 09:00:19,501 INFO  qDORPUm0-[jh88sfvftq,uaxahkqmda,p2cq9c5wc6] Stopped application BasicApplicationImpl{id=p2cq9c5wc6}
2018-06-15 09:00:19,509 INFO  - TESTNG PASSED CONFIGURATION: "Surefire test" - @AfterMethod org.apache.brooklyn.test.framework.InfrastructureDeploymentTestCaseTest.tearDown() finished in 12 ms
2018-06-15 09:00:19,510 INFO  - TESTNG INVOKING CONFIGURATION: "Surefire test" - @BeforeMethod org.apache.brooklyn.test.framework.TestEffectorTest.setUp()
2018-06-15 09:00:19,510 INFO  - Added external config supplier named 'brooklyn-demo-sample': org.apache.brooklyn.core.config.external.InPlaceExternalConfigSupplier@7ce29a2d
2018-06-15 09:00:19,533 INFO  - TESTNG PASSED CONFIGURATION: "Surefire test" - @BeforeMethod org.apache.brooklyn.test.framework.TestEffectorTest.setUp() finished in 23 ms
2018-06-15 09:00:19,533 INFO  - TESTNG INVOKING: "Surefire test" - org.apache.brooklyn.test.framework.TestEffectorTest.testComplexffector()
2018-06-15 09:00:19,562 INFO  - TESTNG PASSED: "Surefire test" - org.apache.brooklyn.test.framework.TestEffectorTest.testComplexffector() finished in 29 ms
2018-06-15 09:00:19,562 INFO  - TESTNG INVOKING CONFIGURATION: "Surefire test" - @AfterMethod org.apache.brooklyn.core.test.BrooklynMgmtUnitTestSupport.tearDown()
2018-06-15 09:00:19,568 INFO  - TESTNG PASSED CONFIGURATION: "Surefire test" - @AfterMethod org.apache.brooklyn.core.test.BrooklynMgmtUnitTestSupport.tearDown() finished in 5 ms
2018-06-15 09:00:19,568 INFO  - TESTNG INVOKING CONFIGURATION: "Surefire test" - @BeforeMethod org.apache.brooklyn.test.framework.TestEffectorTest.setUp()
2018-06-15 09:00:19,568 INFO  - Added external config supplier named 'brooklyn-demo-sample': org.apache.brooklyn.core.config.external.InPlaceExternalConfigSupplier@445bce9a
2018-06-15 09:00:19,590 INFO  - TESTNG PASSED CONFIGURATION: "Surefire test" - @BeforeMethod org.apache.brooklyn.test.framework.TestEffectorTest.setUp() finished in 22 ms
2018-06-15 09:00:19,590 INFO  - TESTNG INVOKING: "Surefire test" - org.apache.brooklyn.test.framework.TestEffectorTest.testEffectorFailureNotRetried()
2018-06-15 09:00:19,605 WARN  x33rEftQ-[eiwyfne56b,hx6dwkroa8,bu2hg5t5ey] Error invoking effectorFails at TestEntityImpl{id=bu2hg5t5ey}: EffectorFailureException: Simulating effector failure
2018-06-15 09:00:19,610 WARN  S7UqduNE-[eiwyfne56b,hx6dwkroa8,kpfwgzj5h2] Error invoking start at TestEffectorImpl{id=kpfwgzj5h2}: Error invoking effectorFails at TestEntityImpl{id=bu2hg5t5ey}: EffectorFailureException: Simulating effector failure
2018-06-15 09:00:19,613 WARN  vzh3WfJH-[eiwyfne56b,hx6dwkroa8] Error invoking start at TestCaseImpl{id=hx6dwkroa8}: Error invoking start at TestEffectorImpl{id=kpfwgzj5h2}: Error invoking effectorFails at TestEntityImpl{id=bu2hg5t5ey}: EffectorFailureException: Simulating effector failure
2018-06-15 09:00:19,618 WARN  ZNkFjNpH-[eiwyfne56b] Setting Application[wyfne56b] on-fire due to problems when expected running, up=false, problems: {service-lifecycle-indicators-from-children-and-members=Required entity not healthy: TestCase:hx6d (hx6dwkroa8)}
2018-06-15 09:00:19,618 WARN  - Setting Application[wyfne56b] on-fire due to problems when expected running, up=false, problems: {service-lifecycle-indicators-from-children-and-members=Required entity not healthy: TestCase:hx6d (hx6dwkroa8)}
2018-06-15 09:00:19,619 WARN  ZNkFjNpH-[eiwyfne56b] Error invoking start at Application[wyfne56b]: ProblemStartingChildrenException: org.apache.brooklyn.util.exceptions.PropagatedRuntimeException: Error invoking start at TestCaseImpl{id=hx6dwkroa8}: Error invoking start at TestEffectorImpl{id=kpfwgzj5h2}: Error invoking effectorFails at TestEntityImpl{id=bu2hg5t5ey}: EffectorFailureException: Simulating effector failure
2018-06-15 09:00:19,625 INFO  - TESTNG PASSED: "Surefire test" - org.apache.brooklyn.test.framework.TestEffectorTest.testEffectorFailureNotRetried() finished in 34 ms
2018-06-15 09:00:19,625 INFO  - TESTNG INVOKING CONFIGURATION: "Surefire test" - @AfterMethod org.apache.brooklyn.core.test.BrooklynMgmtUnitTestSupport.tearDown()
2018-06-15 09:00:19,631 INFO  - TESTNG PASSED CONFIGURATION: "Surefire test" - @AfterMethod org.apache.brooklyn.core.test.BrooklynMgmtUnitTestSupport.tearDown() finished in 6 ms
2018-06-15 09:00:19,631 INFO  - TESTNG INVOKING CONFIGURATION: "Surefire test" - @BeforeMethod org.apache.brooklyn.test.framework.TestEffectorTest.setUp()
2018-06-15 09:00:19,631 INFO  - Added external config supplier named 'brooklyn-demo-sample': org.apache.brooklyn.core.config.external.InPlaceExternalConfigSupplier@37af24cb
2018-06-15 09:00:19,652 INFO  - TESTNG PASSED CONFIGURATION: "Surefire test" - @BeforeMethod org.apache.brooklyn.test.framework.TestEffectorTest.setUp() finished in 21 ms
2018-06-15 09:00:19,652 INFO  - TESTNG INVOKING: "Surefire test" - org.apache.brooklyn.test.framework.TestEffectorTest.testEffectorFailureRetriedUpToMaxAttempts()
2018-06-15 09:00:19,669 WARN  jQBzokaj-[d3rtsna0pl,jtefj98tva,fefk16xow9] Error invoking effectorFails at TestEntityImpl{id=fefk16xow9}: EffectorFailureException: Simulating effector failure
2018-06-15 09:00:19,684 WARN  NsqeFOaA-[d3rtsna0pl,jtefj98tva,ixwttt6rkj] Error queueing Task[Cross-context execution: Invoking effector effectorFails on TestEntity:fefk with parameters {}]@rztj2YtT (rethrowing): org.apache.brooklyn.util.core.task.DynamicSequentialTask$QueueAbortedException: Cannot add a task to Task[start]@NsqeFOaA whose queue has been aborted (trying to add Task[Cross-context execution: Invoking effector effectorFails on TestEntity:fefk with parameters {}]@rztj2YtT)
2018-06-15 09:00:19,685 WARN  NsqeFOaA-[d3rtsna0pl,jtefj98tva,ixwttt6rkj] Error invoking start at TestEffectorImpl{id=ixwttt6rkj}: QueueAbortedException: Cannot add a task to Task[start]@NsqeFOaA whose queue has been aborted (trying to add Task[Cross-context execution: Invoking effector effectorFails on TestEntity:fefk with parameters {}]@rztj2YtT)
2018-06-15 09:00:19,685 WARN  O1h46JVq-[d3rtsna0pl,jtefj98tva,fefk16xow9] Error invoking effectorFails at TestEntityImpl{id=fefk16xow9}: EffectorFailureException: Simulating effector failure
2018-06-15 09:00:19,687 WARN  NsqeFOaA-[d3rtsna0pl,jtefj98tva,ixwttt6rkj] Error invoking start at TestEffectorImpl{id=ixwttt6rkj}: Error invoking effectorFails at TestEntityImpl{id=fefk16xow9}: EffectorFailureException: Simulating effector failure
2018-06-15 09:00:19,689 WARN  W5RBusRQ-[d3rtsna0pl,jtefj98tva] Error invoking start at TestCaseImpl{id=jtefj98tva}: Error invoking start at TestEffectorImpl{id=ixwttt6rkj}: Error invoking effectorFails at TestEntityImpl{id=fefk16xow9}: EffectorFailureException: Simulating effector failure
2018-06-15 09:00:19,694 WARN  KjrNiNZs-[d3rtsna0pl] Setting Application[rtsna0pl] on-fire due to problems when expected running, up=false, problems: {service-lifecycle-indicators-from-children-and-members=Required entity not healthy: TestCase:jtef (jtefj98tva)}
2018-06-15 09:00:19,694 WARN  - Setting Application[rtsna0pl] on-fire due to problems when expected running, up=false, problems: {service-lifecycle-indicators-from-children-and-members=Required entity not healthy: TestCase:jtef (jtefj98tva)}
2018-06-15 09:00:19,695 WARN  KjrNiNZs-[d3rtsna0pl] Error invoking start at Application[rtsna0pl]: ProblemStartingChildrenException: org.apache.brooklyn.util.exceptions.PropagatedRuntimeException: Error invoking start at TestCaseImpl{id=jtefj98tva}: Error invoking start at TestEffectorImpl{id=ixwttt6rkj}: Error invoking effectorFails at TestEntityImpl{id=fefk16xow9}: EffectorFailureException: Simulating effector failure
2018-06-15 09:00:19,706 INFO  - TESTNG PASSED: "Surefire test" - org.apache.brooklyn.test.framework.TestEffectorTest.testEffectorFailureRetriedUpToMaxAttempts() finished in 53 ms
2018-06-15 09:00:19,706 INFO  - TESTNG INVOKING CONFIGURATION: "Surefire test" - @AfterMethod org.apache.brooklyn.core.test.BrooklynMgmtUnitTestSupport.tearDown()
2018-06-15 09:00:19,716 INFO  - TESTNG PASSED CONFIGURATION: "Surefire test" - @AfterMethod org.apache.brooklyn.core.test.BrooklynMgmtUnitTestSupport.tearDown() finished in 10 ms
2018-06-15 09:00:19,717 INFO  - TESTNG INVOKING CONFIGURATION: "Surefire test" - @BeforeMethod org.apache.brooklyn.test.framework.TestEffectorTest.setUp()
2018-06-15 09:00:19,718 INFO  - Added external config supplier named 'brooklyn-demo-sample': org.apache.brooklyn.core.config.external.InPlaceExternalConfigSupplier@6403a4a5
2018-06-15 09:00:19,757 INFO  - TESTNG PASSED CONFIGURATION: "Surefire test" - @BeforeMethod org.apache.brooklyn.test.framework.TestEffectorTest.setUp() finished in 40 ms
2018-06-15 09:00:19,757 INFO  - TESTNG INVOKING: "Surefire test" - org.apache.brooklyn.test.framework.TestEffectorTest.testEffectorNegativeAssertions()
2018-06-15 09:00:19,789 WARN  TTS7tQt2-[us7x6k8he7,fjt4pgaqn4,xbk3bvunaq] Error invoking start at TestEffectorImpl{id=xbk3bvunaq}: AssertionError: effectorReturnsString expected equalTo Not the string I expected but found Goodbye World!
2018-06-15 09:00:19,791 WARN  ghq9Nqeg-[us7x6k8he7,fjt4pgaqn4] Error invoking start at TestCaseImpl{id=fjt4pgaqn4}: Error invoking start at TestEffectorImpl{id=xbk3bvunaq}: AssertionError: effectorReturnsString expected equalTo Not the string I expected but found Goodbye World!
2018-06-15 09:00:19,795 WARN  NvT8NLho-[us7x6k8he7] Setting Application[7x6k8he7] on-fire due to problems when expected running, up=false, problems: {service-lifecycle-indicators-from-children-and-members=Required entity not healthy: TestCase:fjt4 (fjt4pgaqn4)}
2018-06-15 09:00:19,796 WARN  - Setting Application[7x6k8he7] on-fire due to problems when expected running, up=false, problems: {service-lifecycle-indicators-from-children-and-members=Required entity not healthy: TestCase:fjt4 (fjt4pgaqn4)}
2018-06-15 09:00:19,796 WARN  NvT8NLho-[us7x6k8he7] Error invoking start at Application[7x6k8he7]: ProblemStartingChildrenException: org.apache.brooklyn.util.exceptions.PropagatedRuntimeException: Error invoking start at TestCaseImpl{id=fjt4pgaqn4}: Error invoking start at TestEffectorImpl{id=xbk3bvunaq}: AssertionError: effectorReturnsString expected equalTo Not the string I expected but found Goodbye World!
2018-06-15 09:00:19,805 INFO  - TESTNG PASSED: "Surefire test" - org.apache.brooklyn.test.framework.TestEffectorTest.testEffectorNegativeAssertions() finished in 47 ms
2018-06-15 09:00:19,805 INFO  - TESTNG INVOKING CONFIGURATION: "Surefire test" - @AfterMethod org.apache.brooklyn.core.test.BrooklynMgmtUnitTestSupport.tearDown()
2018-06-15 09:00:19,814 INFO  - TESTNG PASSED CONFIGURATION: "Surefire test" - @AfterMethod org.apache.brooklyn.core.test.BrooklynMgmtUnitTestSupport.tearDown() finished in 9 ms
2018-06-15 09:00:19,814 INFO  - TESTNG INVOKING CONFIGURATION: "Surefire test" - @BeforeMethod org.apache.brooklyn.test.framework.TestEffectorTest.setUp()
2018-06-15 09:00:19,815 INFO  - Added external config supplier named 'brooklyn-demo-sample': org.apache.brooklyn.core.config.external.InPlaceExternalConfigSupplier@296edc75
2018-06-15 09:00:19,836 INFO  - TESTNG PASSED CONFIGURATION: "Surefire test" - @BeforeMethod org.apache.brooklyn.test.framework.TestEffectorTest.setUp() finished in 22 ms
2018-06-15 09:00:19,836 INFO  - TESTNG INVOKING: "Surefire test" - org.apache.brooklyn.test.framework.TestEffectorTest.testEffectorPositiveAssertions()
2018-06-15 09:00:19,867 INFO  - TESTNG PASSED: "Surefire test" - org.apache.brooklyn.test.framework.TestEffectorTest.testEffectorPositiveAssertions() finished in 31 ms
2018-06-15 09:00:19,867 INFO  - TESTNG INVOKING CONFIGURATION: "Surefire test" - @AfterMethod org.apache.brooklyn.core.test.BrooklynMgmtUnitTestSupport.tearDown()
2018-06-15 09:00:19,875 INFO  - TESTNG PASSED CONFIGURATION: "Surefire test" - @AfterMethod org.apache.brooklyn.core.test.BrooklynMgmtUnitTestSupport.tearDown() finished in 8 ms
2018-06-15 09:00:19,875 INFO  - TESTNG INVOKING CONFIGURATION: "Surefire test" - @BeforeMethod org.apache.brooklyn.test.framework.TestEffectorTest.setUp()
2018-06-15 09:00:19,876 INFO  - Added external config supplier named 'brooklyn-demo-sample': org.apache.brooklyn.core.config.external.InPlaceExternalConfigSupplier@626b639e
2018-06-15 09:00:19,897 INFO  - TESTNG PASSED CONFIGURATION: "Surefire test" - @BeforeMethod org.apache.brooklyn.test.framework.TestEffectorTest.setUp() finished in 21 ms
2018-06-15 09:00:19,897 INFO  - TESTNG INVOKING: "Surefire test" - org.apache.brooklyn.test.framework.TestEffectorTest.testEffectorReturnsInt()
2018-06-15 09:00:19,927 INFO  - TESTNG PASSED: "Surefire test" - org.apache.brooklyn.test.framework.TestEffectorTest.testEffectorReturnsInt() finished in 30 ms
2018-06-15 09:00:19,927 INFO  - TESTNG INVOKING CONFIGURATION: "Surefire test" - @AfterMethod org.apache.brooklyn.core.test.BrooklynMgmtUnitTestSupport.tearDown()
2018-06-15 09:00:19,937 INFO  - TESTNG PASSED CONFIGURATION: "Surefire test" - @AfterMethod org.apache.brooklyn.core.test.BrooklynMgmtUnitTestSupport.tearDown() finished in 10 ms
2018-06-15 09:00:19,938 INFO  - TESTNG INVOKING CONFIGURATION: "Surefire test" - @BeforeMethod org.apache.brooklyn.test.framework.TestEffectorTest.setUp()
2018-06-15 09:00:19,939 INFO  - Added external config supplier named 'brooklyn-demo-sample': org.apache.brooklyn.core.config.external.InPlaceExternalConfigSupplier@26e0d39c
2018-06-15 09:00:19,964 INFO  - TESTNG PASSED CONFIGURATION: "Surefire test" - @BeforeMethod org.apache.brooklyn.test.framework.TestEffectorTest.setUp() finished in 26 ms
2018-06-15 09:00:19,964 INFO  - TESTNG INVOKING: "Surefire test" - org.apache.brooklyn.test.framework.TestEffectorTest.testEffectorTimeout()
2018-06-15 09:00:19,994 WARN  FMqcxaxT-[wyjd8or5h3,eyu3yahzm7,l3hljdjgdi] Error invoking start at TestEffectorImpl{id=l3hljdjgdi}: AssertionError: Effector effectorHangs timed out after 10ms
2018-06-15 09:00:19,996 WARN  hwf3V7L9-[wyjd8or5h3,eyu3yahzm7] Error invoking start at TestCaseImpl{id=eyu3yahzm7}: Error invoking start at TestEffectorImpl{id=l3hljdjgdi}: AssertionError: Effector effectorHangs timed out after 10ms
2018-06-15 09:00:20,000 WARN  mmWdUnir-[wyjd8or5h3] Setting Application[jd8or5h3] on-fire due to problems when expected running, up=false, problems: {service-lifecycle-indicators-from-children-and-members=Required entity not healthy: TestCase:eyu3 (eyu3yahzm7)}
2018-06-15 09:00:20,000 WARN  FMqcxaxT-[wyjd8or5h3,eyu3yahzm7,l3hljdjgdi] Setting Application[jd8or5h3] on-fire due to problems when expected running, up=false, problems: {service-lifecycle-indicators-from-children-and-members=Required entity not healthy: TestCase:eyu3 (eyu3yahzm7)}
2018-06-15 09:00:20,000 WARN  mmWdUnir-[wyjd8or5h3] Error invoking start at Application[jd8or5h3]: ProblemStartingChildrenException: org.apache.brooklyn.util.exceptions.PropagatedRuntimeException: Error invoking start at TestCaseImpl{id=eyu3yahzm7}: Error invoking start at TestEffectorImpl{id=l3hljdjgdi}: AssertionError: Effector effectorHangs timed out after 10ms
2018-06-15 09:00:20,004 INFO  - TESTNG PASSED: "Surefire test" - org.apache.brooklyn.test.framework.TestEffectorTest.testEffectorTimeout() finished in 40 ms
2018-06-15 09:00:20,005 INFO  - TESTNG INVOKING CONFIGURATION: "Surefire test" - @AfterMethod org.apache.brooklyn.core.test.BrooklynMgmtUnitTestSupport.tearDown()
2018-06-15 09:00:20,011 WARN  fpMAbVKz-[wyjd8or5h3,eyu3yahzm7,bqtdel5tce] Error invoking effectorHangs at TestEntityImpl{id=bqtdel5tce}: RuntimeInterruptedException: java.lang.InterruptedException: sleep interrupted
2018-06-15 09:00:20,020 INFO  - TESTNG PASSED CONFIGURATION: "Surefire test" - @AfterMethod org.apache.brooklyn.core.test.BrooklynMgmtUnitTestSupport.tearDown() finished in 16 ms
2018-06-15 09:00:20,021 INFO  - TESTNG INVOKING CONFIGURATION: "Surefire test" - @BeforeMethod org.apache.brooklyn.test.framework.TestEffectorTest.setUp()
2018-06-15 09:00:20,021 INFO  - Added external config supplier named 'brooklyn-demo-sample': org.apache.brooklyn.core.config.external.InPlaceExternalConfigSupplier@34045582
2018-06-15 09:00:20,044 INFO  - TESTNG PASSED CONFIGURATION: "Surefire test" - @BeforeMethod org.apache.brooklyn.test.framework.TestEffectorTest.setUp() finished in 23 ms
2018-06-15 09:00:20,044 INFO  - TESTNG INVOKING: "Surefire test" - org.apache.brooklyn.test.framework.TestEffectorTest.testEffectorTimeoutAppliesOnlyToCallAndNotToAssertionCheck()
2018-06-15 09:00:20,065 WARN  g3wNdz41-[aushh70810,lurig38udx,obu98d052c] Error invoking start at TestEffectorImpl{id=obu98d052c}: AssertionError: effectorReturnsString expected equalTo Not the string I expected but found Goodbye World!
2018-06-15 09:00:20,067 WARN  DJrDYvpT-[aushh70810,lurig38udx] Error invoking start at TestCaseImpl{id=lurig38udx}: Error invoking start at TestEffectorImpl{id=obu98d052c}: AssertionError: effectorReturnsString expected equalTo Not the string I expected but found Goodbye World!
2018-06-15 09:00:20,078 WARN  EtpMgHE6-[aushh70810] Setting Application[shh70810] on-fire due to problems when expected running, up=false, problems: {service-lifecycle-indicators-from-children-and-members=Required entity not healthy: TestCase:luri (lurig38udx)}
2018-06-15 09:00:20,079 WARN  EtpMgHE6-[aushh70810] Error invoking start at Application[shh70810]: ProblemStartingChildrenException: org.apache.brooklyn.util.exceptions.PropagatedRuntimeException: Error invoking start at TestCaseImpl{id=lurig38udx}: Error invoking start at TestEffectorImpl{id=obu98d052c}: AssertionError: effectorReturnsString expected equalTo Not the string I expected but found Goodbye World!
2018-06-15 09:00:20,088 INFO  - TESTNG PASSED: "Surefire test" - org.apache.brooklyn.test.framework.TestEffectorTest.testEffectorTimeoutAppliesOnlyToCallAndNotToAssertionCheck() finished in 44 ms
2018-06-15 09:00:20,088 INFO  - TESTNG INVOKING CONFIGURATION: "Surefire test" - @AfterMethod org.apache.brooklyn.core.test.BrooklynMgmtUnitTestSupport.tearDown()
2018-06-15 09:00:20,112 INFO  - TESTNG PASSED CONFIGURATION: "Surefire test" - @AfterMethod org.apache.brooklyn.core.test.BrooklynMgmtUnitTestSupport.tearDown() finished in 24 ms
2018-06-15 09:00:20,113 INFO  - TESTNG INVOKING CONFIGURATION: "Surefire test" - @BeforeMethod org.apache.brooklyn.test.framework.TestEffectorTest.setUp()
2018-06-15 09:00:20,113 INFO  - Added external config supplier named 'brooklyn-demo-sample': org.apache.brooklyn.core.config.external.InPlaceExternalConfigSupplier@2fd39436
2018-06-15 09:00:20,140 INFO  - TESTNG PASSED CONFIGURATION: "Surefire test" - @BeforeMethod org.apache.brooklyn.test.framework.TestEffectorTest.setUp() finished in 27 ms
2018-06-15 09:00:20,140 INFO  - TESTNG INVOKING: "Surefire test" - org.apache.brooklyn.test.framework.TestEffectorTest.testFailFastIfNoEffector()
2018-06-15 09:00:20,155 WARN  ABGN1FSz-[qxjc8uo1cf,vqza803mst,k9bp0s5h6i] Error invoking start at TestEffectorImpl{id=k9bp0s5h6i}: NullPointerException: config effector[ConfigKey:java.lang.String] must not be null
2018-06-15 09:00:20,157 WARN  oHObkyOu-[qxjc8uo1cf,vqza803mst] Error invoking start at TestCaseImpl{id=vqza803mst}: Error invoking start at TestEffectorImpl{id=k9bp0s5h6i}: NullPointerException: config effector[ConfigKey:java.lang.String] must not be null
2018-06-15 09:00:20,162 WARN  - Setting Application[jc8uo1cf] on-fire due to problems when expected running, up=false, problems: {service-lifecycle-indicators-from-children-and-members=Required entity not healthy: TestCase:vqza (vqza803mst)}
2018-06-15 09:00:20,163 WARN  zBuBPgUj-[qxjc8uo1cf] Error invoking start at Application[jc8uo1cf]: ProblemStartingChildrenException: org.apache.brooklyn.util.exceptions.PropagatedRuntimeException: Error invoking start at TestCaseImpl{id=vqza803mst}: Error invoking start at TestEffectorImpl{id=k9bp0s5h6i}: NullPointerException: config effector[ConfigKey:java.lang.String] must not be null
2018-06-15 09:00:20,170 INFO  - TESTNG PASSED: "Surefire test" - org.apache.brooklyn.test.framework.TestEffectorTest.testFailFastIfNoEffector() finished in 29 ms
2018-06-15 09:00:20,170 INFO  - TESTNG INVOKING CONFIGURATION: "Surefire test" - @AfterMethod org.apache.brooklyn.core.test.BrooklynMgmtUnitTestSupport.tearDown()
2018-06-15 09:00:20,183 INFO  - TESTNG PASSED CONFIGURATION: "Surefire test" - @AfterMethod org.apache.brooklyn.core.test.BrooklynMgmtUnitTestSupport.tearDown() finished in 13 ms
2018-06-15 09:00:20,184 INFO  - TESTNG INVOKING CONFIGURATION: "Surefire test" - @BeforeMethod org.apache.brooklyn.test.framework.TestEffectorTest.setUp()
2018-06-15 09:00:20,185 INFO  - Added external config supplier named 'brooklyn-demo-sample': org.apache.brooklyn.core.config.external.InPlaceExternalConfigSupplier@482c351d
2018-06-15 09:00:20,216 INFO  - TESTNG PASSED CONFIGURATION: "Surefire test" - @BeforeMethod org.apache.brooklyn.test.framework.TestEffectorTest.setUp() finished in 32 ms
2018-06-15 09:00:20,216 INFO  - TESTNG INVOKING: "Surefire test" - org.apache.brooklyn.test.framework.TestEffectorTest.testFailFastIfNoTargetEntity()
2018-06-15 09:00:20,235 WARN  E2mPtsRq-[emmnsfc9j5,ypinsc4ngh,wh55l7cg15] Error invoking start at TestEffectorImpl{id=wh55l7cg15}: Cannot resolve target entity
2018-06-15 09:00:20,238 WARN  WZmbb8gj-[emmnsfc9j5,ypinsc4ngh] Error invoking start at TestCaseImpl{id=ypinsc4ngh}: Error invoking start at TestEffectorImpl{id=wh55l7cg15}: Cannot resolve target entity
2018-06-15 09:00:20,241 WARN  DKQQYSko-[emmnsfc9j5] Setting Application[mnsfc9j5] on-fire due to problems when expected running, up=false, problems: {service-lifecycle-indicators-from-children-and-members=Required entity not healthy: TestCase:ypin (ypinsc4ngh)}
2018-06-15 09:00:20,241 WARN  - Setting Application[mnsfc9j5] on-fire due to problems when expected running, up=false, problems: {service-lifecycle-indicators-from-children-and-members=Required entity not healthy: TestCase:ypin (ypinsc4ngh)}
2018-06-15 09:00:20,241 WARN  DKQQYSko-[emmnsfc9j5] Error invoking start at Application[mnsfc9j5]: ProblemStartingChildrenException: org.apache.brooklyn.util.exceptions.PropagatedRuntimeException: Error invoking start at TestCaseImpl{id=ypinsc4ngh}: Error invoking start at TestEffectorImpl{id=wh55l7cg15}: Cannot resolve target entity
2018-06-15 09:00:20,246 INFO  - TESTNG PASSED: "Surefire test" - org.apache.brooklyn.test.framework.TestEffectorTest.testFailFastIfNoTargetEntity() finished in 29 ms
2018-06-15 09:00:20,246 INFO  - TESTNG INVOKING CONFIGURATION: "Surefire test" - @AfterMethod org.apache.brooklyn.core.test.BrooklynMgmtUnitTestSupport.tearDown()
2018-06-15 09:00:20,257 INFO  - TESTNG PASSED CONFIGURATION: "Surefire test" - @AfterMethod org.apache.brooklyn.core.test.BrooklynMgmtUnitTestSupport.tearDown() finished in 11 ms
2018-06-15 09:00:20,257 INFO  - TESTNG INVOKING CONFIGURATION: "Surefire test" - @BeforeMethod org.apache.brooklyn.test.framework.TestEffectorTest.setUp()
2018-06-15 09:00:20,258 INFO  - Added external config supplier named 'brooklyn-demo-sample': org.apache.brooklyn.core.config.external.InPlaceExternalConfigSupplier@3af10d0b
2018-06-15 09:00:20,279 INFO  - TESTNG PASSED CONFIGURATION: "Surefire test" - @BeforeMethod org.apache.brooklyn.test.framework.TestEffectorTest.setUp() finished in 22 ms
2018-06-15 09:00:20,279 INFO  - TESTNG INVOKING: "Surefire test" - org.apache.brooklyn.test.framework.TestEffectorTest.testSimpleEffector()
2018-06-15 09:00:20,305 INFO  - TESTNG PASSED: "Surefire test" - org.apache.brooklyn.test.framework.TestEffectorTest.testSimpleEffector() finished in 26 ms
2018-06-15 09:00:20,305 INFO  - TESTNG INVOKING CONFIGURATION: "Surefire test" - @AfterMethod org.apache.brooklyn.core.test.BrooklynMgmtUnitTestSupport.tearDown()
2018-06-15 09:00:20,311 INFO  - TESTNG PASSED CONFIGURATION: "Surefire test" - @AfterMethod org.apache.brooklyn.core.test.BrooklynMgmtUnitTestSupport.tearDown() finished in 6 ms
[GC (Allocation Failure)  252777K->26962K(769024K), 0.0235078 secs]
2018-06-15 09:00:20,375 INFO  - TESTNG 
===============================================
    Surefire test
    Tests run: 235, Failures: 1, Skips: 0
===============================================
Tests run: 235, Failures: 1, Errors: 0, Skipped: 0, Time elapsed: 14.718 sec <<< FAILURE! - in TestSuite
testCombinationWithLoopOverGroupMembersTest(org.apache.brooklyn.test.framework.RelativeEntityTestCaseTest)  Time elapsed: 0.477 sec  <<< FAILURE!
org.apache.brooklyn.core.mgmt.internal.EffectorUtils$EffectorCallPropagatedRuntimeException: Error invoking start at LoopOverGroupMembersTestCaseImpl{id=fn8eduyvu4}
	at org.apache.brooklyn.test.framework.RelativeEntityTestCaseTest.testCombinationWithLoopOverGroupMembersTest(RelativeEntityTestCaseTest.java:112)
Caused by: java.util.concurrent.ExecutionException: org.apache.brooklyn.util.exceptions.PropagatedRuntimeException: Test failed on group member(s)
	at org.apache.brooklyn.test.framework.RelativeEntityTestCaseTest.testCombinationWithLoopOverGroupMembersTest(RelativeEntityTestCaseTest.java:112)
Caused by: org.apache.brooklyn.util.exceptions.PropagatedRuntimeException: 
	at org.apache.brooklyn.test.framework.RelativeEntityTestCaseTest.testCombinationWithLoopOverGroupMembersTest(RelativeEntityTestCaseTest.java:112)
Caused by: java.lang.reflect.InvocationTargetException
	at org.apache.brooklyn.test.framework.RelativeEntityTestCaseTest.testCombinationWithLoopOverGroupMembersTest(RelativeEntityTestCaseTest.java:112)
Caused by: org.apache.brooklyn.util.exceptions.CompoundRuntimeException: Test failed on group member(s)
	at org.apache.brooklyn.test.framework.RelativeEntityTestCaseTest.testCombinationWithLoopOverGroupMembersTest(RelativeEntityTestCaseTest.java:112)


Results :

Failed tests: 
  RelativeEntityTestCaseTest.testCombinationWithLoopOverGroupMembersTest:112 » EffectorCallPropagatedRuntime

Tests run: 235, Failures: 1, Errors: 0, Skipped: 0

[INFO] ------------------------------------------------------------------------
[INFO] Reactor Summary:
[INFO] 
[INFO] Brooklyn Server Root ............................... SUCCESS [  0.647 s]
[INFO] Brooklyn Parent Project ............................ SUCCESS [  2.238 s]
[INFO] Brooklyn Test Support Utilities .................... SUCCESS [  3.471 s]
[INFO] Brooklyn Logback Includable Configuration .......... SUCCESS [  0.260 s]
[INFO] Brooklyn Common Utilities .......................... SUCCESS [ 18.522 s]
[INFO] Brooklyn API ....................................... SUCCESS [  1.126 s]
[INFO] CAMP Server Parent Project ......................... SUCCESS [  0.114 s]
[INFO] CAMP Base .......................................... SUCCESS [  2.071 s]
[INFO] Brooklyn Test Support .............................. SUCCESS [  0.697 s]
[INFO] Brooklyn REST Swagger Apidoc Utilities ............. SUCCESS [  0.559 s]
[INFO] Brooklyn Logback Configuration ..................... SUCCESS [  0.126 s]
[INFO] CAMP Server ........................................ SUCCESS [  3.798 s]
[INFO] Brooklyn Felix Runtime ............................. SUCCESS [  2.213 s]
[INFO] Brooklyn Groovy Utilities .......................... SUCCESS [  1.809 s]
[INFO] Brooklyn Core ...................................... SUCCESS [02:59 min]
[INFO] Brooklyn Policies .................................. SUCCESS [ 29.557 s]
[INFO] Brooklyn WinRM Software Entities ................... SUCCESS [  8.857 s]
[INFO] Brooklyn Secure JMXMP Agent ........................ SUCCESS [  7.851 s]
[INFO] Brooklyn JMX RMI Agent ............................. SUCCESS [  0.270 s]
[INFO] Brooklyn Jclouds Location Targets .................. SUCCESS [ 32.980 s]
[INFO] Brooklyn Software Base ............................. SUCCESS [01:10 min]
[INFO] Brooklyn CAMP ...................................... SUCCESS [02:07 min]
[INFO] Brooklyn Launcher Common ........................... SUCCESS [  3.821 s]
[INFO] Brooklyn REST API .................................. SUCCESS [ 10.526 s]
[INFO] Brooklyn REST Resources ............................ SUCCESS [ 43.237 s]
[INFO] Brooklyn REST Server ............................... SUCCESS [ 19.169 s]
[INFO] Brooklyn Launcher .................................. SUCCESS [01:03 min]
[INFO] Brooklyn Container Location Targets ................ SUCCESS [ 12.222 s]
[INFO] Brooklyn Command Line Interface .................... SUCCESS [  7.783 s]
[INFO] Brooklyn Test Framework ............................ FAILURE [ 18.970 s]
[INFO] Brooklyn OSGi init ................................. SKIPPED
[INFO] Brooklyn OSGi start ................................ SKIPPED
[INFO] Brooklyn Karaf ..................................... SKIPPED
[INFO] Jetty config fragment .............................. SKIPPED
[INFO] Apache Http Component extension .................... SKIPPED
[INFO] Brooklyn Karaf Features ............................ SKIPPED
[INFO] Brooklyn Karaf Shell Commands ...................... SKIPPED
[INFO] ------------------------------------------------------------------------
[INFO] BUILD FAILURE
[INFO] ------------------------------------------------------------------------
[INFO] Total time: 11:15 min
[INFO] Finished at: 2018-06-15T09:00:20Z
[INFO] Final Memory: 140M/679M
[INFO] ------------------------------------------------------------------------
[ERROR] Failed to execute goal org.apache.maven.plugins:maven-surefire-plugin:2.19.1:test (default-test) on project brooklyn-test-framework: There are test failures.
[ERROR] 
[ERROR] Please refer to /usr/build/test-framework/target/surefire-reports for the individual test results.
[ERROR] -> [Help 1]
[ERROR] 
[ERROR] To see the full stack trace of the errors, re-run Maven with the -e switch.
[ERROR] Re-run Maven using the -X switch to enable full debug logging.
[ERROR] 
[ERROR] For more information about the errors and possible solutions, please read the following articles:
[ERROR] [Help 1] http://cwiki.apache.org/confluence/display/MAVEN/MojoFailureException
[ERROR] 
[ERROR] After correcting the problems, you can resume the build with the command
[ERROR]   mvn <goals> -rf :brooklyn-test-framework
Build step 'Execute shell' marked build as failure
Recording test results
TestNG Reports Processing: START
Looking for TestNG results report in workspace using pattern: **/testng-results.xml
Saving reports...
Processing '/x1/jenkins/jenkins-home/jobs/brooklyn-server-master-docker/builds/91/testng/testng-results-1.xml'
Processing '/x1/jenkins/jenkins-home/jobs/brooklyn-server-master-docker/builds/91/testng/testng-results-10.xml'
Processing '/x1/jenkins/jenkins-home/jobs/brooklyn-server-master-docker/builds/91/testng/testng-results-11.xml'
Processing '/x1/jenkins/jenkins-home/jobs/brooklyn-server-master-docker/builds/91/testng/testng-results-12.xml'
Processing '/x1/jenkins/jenkins-home/jobs/brooklyn-server-master-docker/builds/91/testng/testng-results-13.xml'
Processing '/x1/jenkins/jenkins-home/jobs/brooklyn-server-master-docker/builds/91/testng/testng-results-14.xml'
Processing '/x1/jenkins/jenkins-home/jobs/brooklyn-server-master-docker/builds/91/testng/testng-results-15.xml'
Processing '/x1/jenkins/jenkins-home/jobs/brooklyn-server-master-docker/builds/91/testng/testng-results-16.xml'
Processing '/x1/jenkins/jenkins-home/jobs/brooklyn-server-master-docker/builds/91/testng/testng-results-17.xml'
Processing '/x1/jenkins/jenkins-home/jobs/brooklyn-server-master-docker/builds/91/testng/testng-results-18.xml'
Processing '/x1/jenkins/jenkins-home/jobs/brooklyn-server-master-docker/builds/91/testng/testng-results-19.xml'
Processing '/x1/jenkins/jenkins-home/jobs/brooklyn-server-master-docker/builds/91/testng/testng-results-2.xml'
Processing '/x1/jenkins/jenkins-home/jobs/brooklyn-server-master-docker/builds/91/testng/testng-results-3.xml'
Processing '/x1/jenkins/jenkins-home/jobs/brooklyn-server-master-docker/builds/91/testng/testng-results-4.xml'
Processing '/x1/jenkins/jenkins-home/jobs/brooklyn-server-master-docker/builds/91/testng/testng-results-5.xml'
Processing '/x1/jenkins/jenkins-home/jobs/brooklyn-server-master-docker/builds/91/testng/testng-results-6.xml'
Processing '/x1/jenkins/jenkins-home/jobs/brooklyn-server-master-docker/builds/91/testng/testng-results-7.xml'
Processing '/x1/jenkins/jenkins-home/jobs/brooklyn-server-master-docker/builds/91/testng/testng-results-8.xml'
Processing '/x1/jenkins/jenkins-home/jobs/brooklyn-server-master-docker/builds/91/testng/testng-results-9.xml'
Processing '/x1/jenkins/jenkins-home/jobs/brooklyn-server-master-docker/builds/91/testng/testng-results.xml'
0.019952% of tests failed, which exceeded threshold of 0%. Marking build as UNSTABLE
TestNG Reports Processing: FINISH