OSDir

[Date Prev][Date Next][Thread Prev][Thread Next][Date Index][Thread Index]

Build failed in Jenkins: brooklyn-library-master-docker #186


See <https://builds.apache.org/job/brooklyn-library-master-docker/186/display/redirect>

------------------------------------------
[...truncated 1.40 MB...]
  .m2/repository/org/codehaus/plexus/plexus-utils/3.0.8/plexus-utils-3.0.8.pom.sha1
  .m2/repository/org/codehaus/plexus/plexus-utils/3.0.8/_remote.repositories
  .m2/repository/org/codehaus/plexus/plexus-utils/3.0.21/plexus-utils-3.0.21.pom.sha1
  .m2/repository/org/codehaus/plexus/plexus-utils/3.0.21/_remote.repositories
  .m2/repository/org/codehaus/plexus/plexus-utils/3.0.21/plexus-utils-3.0.21.jar.sha1
  .m2/repository/org/codehaus/plexus/plexus-utils/3.0/plexus-utils-3.0.pom.sha1
  .m2/repository/org/codehaus/plexus/plexus-utils/3.0/_remote.repositories
  .m2/repository/org/codehaus/plexus/plexus-utils/3.0/plexus-utils-3.0.jar.sha1
  .m2/repository/org/codehaus/plexus/plexus-utils/1.4.2/plexus-utils-1.4.2.pom
  .m2/repository/org/codehaus/plexus/plexus-utils/1.4.2/_remote.repositories
  .m2/repository/org/codehaus/plexus/plexus-utils/1.4.2/plexus-utils-1.4.2.jar.sha1
  .m2/repository/org/codehaus/plexus/plexus-utils/1.4.2/plexus-utils-1.4.2.pom.sha1
  .m2/repository/org/codehaus/plexus/plexus-utils/2.0.5/plexus-utils-2.0.5.jar.sha1
  .m2/repository/org/codehaus/plexus/plexus-utils/2.0.5/_remote.repositories
  .m2/repository/org/codehaus/plexus/plexus-utils/2.0.5/plexus-utils-2.0.5.pom.sha1
  .m2/repository/org/codehaus/plexus/plexus-utils/1.5.7/plexus-utils-1.5.7.pom
  .m2/repository/org/codehaus/plexus/plexus-utils/1.5.7/_remote.repositories
  .m2/repository/org/codehaus/plexus/plexus-utils/1.5.7/plexus-utils-1.5.7.pom.sha1
  .m2/repository/org/codehaus/plexus/plexus-utils/1.0.4/plexus-utils-1.0.4.pom
  .m2/repository/org/codehaus/plexus/plexus-utils/1.0.4/_remote.repositories
  .m2/repository/org/codehaus/plexus/plexus-utils/1.0.4/plexus-utils-1.0.4.pom.sha1
  .m2/repository/org/codehaus/plexus/plexus/1.0.8/plexus-1.0.8.pom.sha1
  .m2/repository/org/codehaus/plexus/plexus/1.0.8/plexus-1.0.8.pom
  .m2/repository/org/codehaus/plexus/plexus/1.0.8/_remote.repositories
  .m2/repository/org/codehaus/plexus/plexus/3.3/_remote.repositories
  .m2/repository/org/codehaus/plexus/plexus/3.3/plexus-3.3.pom.sha1
  .m2/repository/org/codehaus/plexus/plexus/2.0.3/_remote.repositories
  .m2/repository/org/codehaus/plexus/plexus/2.0.3/plexus-2.0.3.pom.sha1
  .m2/repository/org/codehaus/plexus/plexus/1.0.10/_remote.repositories
  .m2/repository/org/codehaus/plexus/plexus/1.0.10/plexus-1.0.10.pom
  .m2/repository/org/codehaus/plexus/plexus/1.0.10/plexus-1.0.10.pom.sha1
  .m2/repository/org/codehaus/plexus/plexus/2.0.2/plexus-2.0.2.pom.sha1
  .m2/repository/org/codehaus/plexus/plexus/2.0.2/_remote.repositories
  .m2/repository/org/codehaus/plexus/plexus/3.1/_remote.repositories
  .m2/repository/org/codehaus/plexus/plexus/3.1/plexus-3.1.pom.sha1
  .m2/repository/org/codehaus/plexus/plexus/2.0.7/plexus-2.0.7.pom.sha1
  .m2/repository/org/codehaus/plexus/plexus/2.0.7/_remote.repositories
  .m2/repository/org/codehaus/plexus/plexus/1.0.9/_remote.repositories
  .m2/repository/org/codehaus/plexus/plexus/1.0.9/plexus-1.0.9.pom.sha1
  .m2/repository/org/codehaus/plexus/plexus/1.0.9/plexus-1.0.9.pom
  .m2/repository/org/codehaus/plexus/plexus/3.3.1/plexus-3.3.1.pom.sha1
  .m2/repository/org/codehaus/plexus/plexus/3.3.1/_remote.repositories
  .m2/repository/org/codehaus/plexus/plexus/1.0.11/plexus-1.0.11.pom.sha1
  .m2/repository/org/codehaus/plexus/plexus/1.0.11/_remote.repositories
  .m2/repository/org/codehaus/plexus/plexus/2.0.6/plexus-2.0.6.pom.sha1
  .m2/repository/org/codehaus/plexus/plexus/2.0.6/_remote.repositories
  .m2/repository/org/codehaus/plexus/plexus/3.2/_remote.repositories
  .m2/repository/org/codehaus/plexus/plexus/3.2/plexus-3.2.pom.sha1
  .m2/repository/org/codehaus/plexus/plexus/2.0.5/plexus-2.0.5.pom.sha1
  .m2/repository/org/codehaus/plexus/plexus/2.0.5/_remote.repositories
  .m2/repository/org/codehaus/plexus/plexus/3.0.1/plexus-3.0.1.pom.sha1
  .m2/repository/org/codehaus/plexus/plexus/3.0.1/_remote.repositories
  .m2/repository/org/codehaus/plexus/plexus/1.0.4/plexus-1.0.4.pom.sha1
  .m2/repository/org/codehaus/plexus/plexus/1.0.4/_remote.repositories
  .m2/repository/org/codehaus/plexus/plexus/1.0.4/plexus-1.0.4.pom
  .m2/repository/org/codehaus/plexus/plexus-component-annotations/1.5.5/_remote.repositories
  .m2/repository/org/codehaus/plexus/plexus-component-annotations/1.5.5/plexus-component-annotations-1.5.5.pom
  .m2/repository/org/codehaus/plexus/plexus-component-annotations/1.5.5/plexus-component-annotations-1.5.5.pom.sha1
  .m2/repository/org/codehaus/plexus/plexus-component-annotations/1.5.5/plexus-component-annotations-1.5.5.jar.sha1
  .m2/repository/org/pegdown/pegdown/1.2.1/_remote.repositories
  .m2/repository/org/pegdown/pegdown/1.2.1/pegdown-1.2.1.jar.sha1
  .m2/repository/org/pegdown/pegdown/1.2.1/pegdown-1.2.1.pom.sha1
  .m2/repository/org/slf4j/slf4j-jdk14/1.5.6/slf4j-jdk14-1.5.6.pom.sha1
  .m2/repository/org/slf4j/slf4j-jdk14/1.5.6/_remote.repositories
  .m2/repository/org/slf4j/slf4j-jdk14/1.5.6/slf4j-jdk14-1.5.6.pom
  .m2/repository/org/slf4j/slf4j-jdk14/1.5.6/slf4j-jdk14-1.5.6.jar.sha1
  .m2/repository/org/slf4j/slf4j-jdk14/1.7.12/slf4j-jdk14-1.7.12.pom
  .m2/repository/org/slf4j/slf4j-jdk14/1.7.12/_remote.repositories
  .m2/repository/org/slf4j/slf4j-jdk14/1.7.12/slf4j-jdk14-1.7.12.jar.sha1
  .m2/repository/org/slf4j/slf4j-jdk14/1.7.12/slf4j-jdk14-1.7.12.pom.sha1
  .m2/repository/org/slf4j/slf4j-parent/1.5.6/slf4j-parent-1.5.6.pom.sha1
  .m2/repository/org/slf4j/slf4j-parent/1.5.6/slf4j-parent-1.5.6.pom
  .m2/repository/org/slf4j/slf4j-parent/1.5.6/_remote.repositories
  .m2/repository/org/slf4j/slf4j-parent/1.7.12/_remote.repositories
  .m2/repository/org/slf4j/slf4j-parent/1.7.12/slf4j-parent-1.7.12.pom
  .m2/repository/org/slf4j/slf4j-parent/1.7.12/slf4j-parent-1.7.12.pom.sha1
  .m2/repository/org/slf4j/jcl-over-slf4j/1.5.6/jcl-over-slf4j-1.5.6.jar.sha1
  .m2/repository/org/slf4j/jcl-over-slf4j/1.5.6/jcl-over-slf4j-1.5.6.pom.sha1
  .m2/repository/org/slf4j/jcl-over-slf4j/1.5.6/jcl-over-slf4j-1.5.6.pom
  .m2/repository/org/slf4j/jcl-over-slf4j/1.5.6/_remote.repositories
  .m2/repository/org/slf4j/jcl-over-slf4j/1.7.12/jcl-over-slf4j-1.7.12.pom
  .m2/repository/org/slf4j/jcl-over-slf4j/1.7.12/_remote.repositories
  .m2/repository/org/slf4j/jcl-over-slf4j/1.7.12/jcl-over-slf4j-1.7.12.pom.sha1
  .m2/repository/org/slf4j/jcl-over-slf4j/1.7.12/jcl-over-slf4j-1.7.12.jar.sha1
  .m2/repository/org/slf4j/slf4j-api/1.5.6/slf4j-api-1.5.6.jar.sha1
  .m2/repository/org/slf4j/slf4j-api/1.5.6/slf4j-api-1.5.6.pom
  .m2/repository/org/slf4j/slf4j-api/1.5.6/_remote.repositories
  .m2/repository/org/slf4j/slf4j-api/1.5.6/slf4j-api-1.5.6.pom.sha1
  .m2/repository/org/slf4j/slf4j-api/1.7.12/slf4j-api-1.7.12.jar.sha1
  .m2/repository/org/slf4j/slf4j-api/1.7.12/_remote.repositories
  .m2/repository/org/slf4j/slf4j-api/1.7.12/slf4j-api-1.7.12.pom
  .m2/repository/org/slf4j/slf4j-api/1.7.12/slf4j-api-1.7.12.pom.sha1
  .m2/repository/org/beanshell/bsh/2.0b4/bsh-2.0b4.jar.sha1
  .m2/repository/org/beanshell/bsh/2.0b4/_remote.repositories
  .m2/repository/org/beanshell/bsh/2.0b4/bsh-2.0b4.pom
  .m2/repository/org/beanshell/bsh/2.0b4/bsh-2.0b4.pom.sha1
  .m2/repository/org/beanshell/beanshell/2.0b4/beanshell-2.0b4.pom
  .m2/repository/org/beanshell/beanshell/2.0b4/_remote.repositories
  .m2/repository/org/beanshell/beanshell/2.0b4/beanshell-2.0b4.pom.sha1
  .m2/repository/org/tmatesoft/sqljet/sqljet/1.0.4/sqljet-1.0.4.jar.sha1
  .m2/repository/org/tmatesoft/sqljet/sqljet/1.0.4/_remote.repositories
  .m2/repository/org/tmatesoft/sqljet/sqljet/1.0.4/sqljet-1.0.4.pom.sha1
  .m2/repository/org/tmatesoft/sqljet/sqljet/1.0.4/sqljet-1.0.4.pom
  .m2/repository/org/tmatesoft/svnkit/trilead-ssh2/build213-svnkit-1.3-patch/trilead-ssh2-build213-svnkit-1.3-patch.pom
  .m2/repository/org/tmatesoft/svnkit/trilead-ssh2/build213-svnkit-1.3-patch/trilead-ssh2-build213-svnkit-1.3-patch.jar.sha1
  .m2/repository/org/tmatesoft/svnkit/trilead-ssh2/build213-svnkit-1.3-patch/_remote.repositories
  .m2/repository/org/tmatesoft/svnkit/trilead-ssh2/build213-svnkit-1.3-patch/trilead-ssh2-build213-svnkit-1.3-patch.pom.sha1
  .m2/repository/org/tmatesoft/svnkit/svnkit/1.3.5/svnkit-1.3.5.pom.sha1
  .m2/repository/org/tmatesoft/svnkit/svnkit/1.3.5/svnkit-1.3.5.pom
  .m2/repository/org/tmatesoft/svnkit/svnkit/1.3.5/_remote.repositories
  .m2/repository/org/tmatesoft/svnkit/svnkit/1.3.5/svnkit-1.3.5.jar.sha1
  .m2/repository/org/osgi/org.osgi.compendium/4.2.0/org.osgi.compendium-4.2.0.pom
  .m2/repository/org/osgi/org.osgi.compendium/4.2.0/org.osgi.compendium-4.2.0.jar.sha1
  .m2/repository/org/osgi/org.osgi.compendium/4.2.0/org.osgi.compendium-4.2.0.pom.sha1
  .m2/repository/org/osgi/org.osgi.compendium/4.2.0/_remote.repositories
  .m2/repository/org/osgi/org.osgi.core/4.1.0/org.osgi.core-4.1.0.pom.sha1
  .m2/repository/org/osgi/org.osgi.core/4.1.0/org.osgi.core-4.1.0.pom
  .m2/repository/org/osgi/org.osgi.core/4.1.0/_remote.repositories
  .m2/repository/org/osgi/org.osgi.core/6.0.0/org.osgi.core-6.0.0.pom.sha1
  .m2/repository/org/osgi/org.osgi.core/6.0.0/_remote.repositories
  .m2/repository/org/osgi/org.osgi.core/6.0.0/org.osgi.core-6.0.0.jar.sha1
  .m2/repository/org/osgi/org.osgi.core/4.3.1/org.osgi.core-4.3.1.jar.sha1
  .m2/repository/org/osgi/org.osgi.core/4.3.1/_remote.repositories
  .m2/repository/org/osgi/org.osgi.core/4.3.1/org.osgi.core-4.3.1.pom.sha1
  .m2/repository/org/osgi/org.osgi.core/4.3.1/org.osgi.core-4.3.1.pom
  .m2/repository/org/tukaani/xz/1.2/xz-1.2.pom
  .m2/repository/org/tukaani/xz/1.2/_remote.repositories
  .m2/repository/org/tukaani/xz/1.2/xz-1.2.jar.sha1
  .m2/repository/org/tukaani/xz/1.2/xz-1.2.pom.sha1
  .m2/repository/sslext/sslext/1.2-0/_remote.repositories
  .m2/repository/sslext/sslext/1.2-0/sslext-1.2-0.pom.sha1
  .m2/repository/sslext/sslext/1.2-0/sslext-1.2-0.jar.sha1
  .m2/repository/sslext/sslext/1.2-0/sslext-1.2-0.pom
  .m2/repository/oro/oro/2.0.8/oro-2.0.8.jar.sha1
  .m2/repository/oro/oro/2.0.8/oro-2.0.8.pom
  .m2/repository/oro/oro/2.0.8/oro-2.0.8.pom.sha1
  .m2/repository/oro/oro/2.0.8/_remote.repositories
  .m2/repository/net/java/dev/jna/jna/3.2.2/jna-3.2.2.pom.sha1
  .m2/repository/net/java/dev/jna/jna/3.2.2/jna-3.2.2.jar.sha1
  .m2/repository/net/java/dev/jna/jna/3.2.2/_remote.repositories
  .m2/repository/net/java/dev/jna/jna/3.2.2/jna-3.2.2.pom
  .m2/repository/net/java/dev/jna/jna/4.3.0/_remote.repositories
  .m2/repository/net/java/dev/jna/jna/4.3.0/jna-4.3.0.jar.sha1
  .m2/repository/net/java/dev/jna/jna/4.3.0/jna-4.3.0.pom.sha1
  .m2/repository/net/java/dev/jna/jna-platform/4.3.0/jna-platform-4.3.0.pom.sha1
  .m2/repository/net/java/dev/jna/jna-platform/4.3.0/_remote.repositories
  .m2/repository/net/java/dev/jna/jna-platform/4.3.0/jna-platform-4.3.0.jar.sha1
  .m2/repository/commons-validator/commons-validator/1.3.1/commons-validator-1.3.1.jar.sha1
  .m2/repository/commons-validator/commons-validator/1.3.1/_remote.repositories
  .m2/repository/commons-validator/commons-validator/1.3.1/commons-validator-1.3.1.pom.sha1
  .m2/repository/commons-validator/commons-validator/1.3.1/commons-validator-1.3.1.pom
  .m2/repository/xml-apis/xml-apis/1.0.b2/xml-apis-1.0.b2.pom.sha1
  .m2/repository/xml-apis/xml-apis/1.0.b2/_remote.repositories
  .m2/repository/xml-apis/xml-apis/1.3.04/_remote.repositories
  .m2/repository/xml-apis/xml-apis/1.3.04/xml-apis-1.3.04.pom.sha1
  .m2/repository/xml-apis/xml-apis/1.3.04/xml-apis-1.3.04.jar.sha1
  .m2/repository/xml-apis/xml-apis/1.3.04/xml-apis-1.3.04.pom
  .m2/repository/xml-apis/xml-apis/1.3.03/xml-apis-1.3.03.pom
  .m2/repository/xml-apis/xml-apis/1.3.03/xml-apis-1.3.03.jar.sha1
  .m2/repository/xml-apis/xml-apis/1.3.03/_remote.repositories
  .m2/repository/xml-apis/xml-apis/1.3.03/xml-apis-1.3.03.pom.sha1
  .m2/repository/xerces/xercesImpl/2.8.0/xercesImpl-2.8.0.pom
  .m2/repository/xerces/xercesImpl/2.8.0/_remote.repositories
  .m2/repository/xerces/xercesImpl/2.8.0/xercesImpl-2.8.0.jar.sha1
  .m2/repository/xerces/xercesImpl/2.8.0/xercesImpl-2.8.0.pom.sha1
  .m2/repository/xerces/xercesImpl/2.9.1/xercesImpl-2.9.1.pom.sha1
  .m2/repository/xerces/xercesImpl/2.9.1/xercesImpl-2.9.1.pom
  .m2/repository/xerces/xercesImpl/2.9.1/_remote.repositories
  .m2/repository/xerces/xercesImpl/2.9.1/xercesImpl-2.9.1.jar.sha1
  .m2/repository/avalon-framework/avalon-framework/4.1.3/avalon-framework-4.1.3.pom
  .m2/repository/avalon-framework/avalon-framework/4.1.3/_remote.repositories
  .m2/repository/avalon-framework/avalon-framework/4.1.3/avalon-framework-4.1.3.pom.sha1
  .m2/repository/log4j/log4j/1.2.12/_remote.repositories
  .m2/repository/log4j/log4j/1.2.12/log4j-1.2.12.pom.sha1
  .m2/repository/log4j/log4j/1.2.12/log4j-1.2.12.pom
  .m2/repository/biz/aQute/bnd/parent/2.4.0/parent-2.4.0.pom.sha1
  .m2/repository/biz/aQute/bnd/parent/2.4.0/_remote.repositories
  .m2/repository/biz/aQute/bnd/parent/2.4.0/parent-2.4.0.pom
  .m2/repository/biz/aQute/bnd/biz.aQute.bndlib/3.2.0/biz.aQute.bndlib-3.2.0.jar.sha1
  .m2/repository/biz/aQute/bnd/biz.aQute.bndlib/3.2.0/_remote.repositories
  .m2/repository/biz/aQute/bnd/biz.aQute.bndlib/3.2.0/biz.aQute.bndlib-3.2.0.pom.sha1
  .m2/repository/biz/aQute/bnd/biz.aQute.bndlib/3.3.0/_remote.repositories
  .m2/repository/biz/aQute/bnd/biz.aQute.bndlib/3.3.0/biz.aQute.bndlib-3.3.0.pom.sha1
  .m2/repository/biz/aQute/bnd/biz.aQute.bndlib/3.3.0/biz.aQute.bndlib-3.3.0.jar.sha1
  .m2/repository/biz/aQute/bnd/bndlib/2.4.0/_remote.repositories
  .m2/repository/biz/aQute/bnd/bndlib/2.4.0/bndlib-2.4.0.pom
  .m2/repository/biz/aQute/bnd/bndlib/2.4.0/bndlib-2.4.0.jar.sha1
  .m2/repository/biz/aQute/bnd/bndlib/2.4.0/bndlib-2.4.0.pom.sha1
  .m2/settings-docker.xml
[INFO] ------------------------------------------------------------------------
[INFO] Reactor Summary:
[INFO] 
[INFO] Brooklyn Library Root .............................. FAILURE [ 11.074 s]
[INFO] Brooklyn CM Chef ................................... SKIPPED
[INFO] Brooklyn CM SaltStack .............................. SKIPPED
[INFO] Brooklyn CM Ansible ................................ SKIPPED
[INFO] Brooklyn CM Integration Root ....................... SKIPPED
[INFO] Brooklyn Network Software Entities ................. SKIPPED
[INFO] Brooklyn OSGi Software Entities .................... SKIPPED
[INFO] Brooklyn Database Software Entities ................ SKIPPED
[INFO] Brooklyn Web App Software Entities ................. SKIPPED
[INFO] Brooklyn Messaging Software Entities ............... SKIPPED
[INFO] Brooklyn NoSQL Data Store Software Entities ........ SKIPPED
[INFO] Brooklyn Monitoring Software Entities .............. SKIPPED
[INFO] Brooklyn Web App Software Entities ................. SKIPPED
[INFO] Brooklyn QA ........................................ SKIPPED
[INFO] Brooklyn Examples Aggregator Project ............... SKIPPED
[INFO] Brooklyn Examples Aggregator Project - Webapps ..... SKIPPED
[INFO] hello-world-webapp Maven Webapp .................... SKIPPED
[INFO] hello-world-sql-webapp Maven Webapp ................ SKIPPED
[INFO] Brooklyn Simple Web Cluster Example ................ SKIPPED
[INFO] Brooklyn Library Karaf integration ................. SKIPPED
[INFO] Brooklyn Library Catalog ........................... SKIPPED
[INFO] Brooklyn Library Karaf Features .................... SKIPPED
[INFO] ------------------------------------------------------------------------
[INFO] BUILD FAILURE
[INFO] ------------------------------------------------------------------------
[INFO] Total time: 25.568 s
[INFO] Finished at: 2018-05-05T08:47:22Z
[INFO] Final Memory: 36M/672M
[INFO] ------------------------------------------------------------------------
[ERROR] Failed to execute goal org.apache.rat:apache-rat-plugin:0.12:check (default) on project brooklyn-library: Too many files with unapproved license: 1799 See RAT report in: /usr/build/target/rat.txt -> [Help 1]
[ERROR] 
[ERROR] To see the full stack trace of the errors, re-run Maven with the -e switch.
[ERROR] Re-run Maven using the -X switch to enable full debug logging.
[ERROR] 
[ERROR] For more information about the errors and possible solutions, please read the following articles:
[ERROR] [Help 1] http://cwiki.apache.org/confluence/display/MAVEN/MojoFailureException
Build step 'Execute shell' marked build as failure
Recording test results
ERROR: Step ?Publish JUnit test result report? failed: Test reports were found but none of them are new. Did leafNodes run? 
For example, <https://builds.apache.org/job/brooklyn-library-master-docker/ws/qa/target/surefire-reports/junitreports/TEST-org.apache.brooklyn.qa.camp.EnrichersSlightlySimplerYamlTest.xml> is 12 days old

TestNG Reports Processing: START
Looking for TestNG results report in workspace using pattern: **/testng-results.xml
testng-results.xml was last modified before this build started. Ignoring it.
testng-results.xml was last modified before this build started. Ignoring it.
testng-results.xml was last modified before this build started. Ignoring it.
testng-results.xml was last modified before this build started. Ignoring it.
testng-results.xml was last modified before this build started. Ignoring it.
testng-results.xml was last modified before this build started. Ignoring it.
testng-results.xml was last modified before this build started. Ignoring it.
testng-results.xml was last modified before this build started. Ignoring it.
testng-results.xml was last modified before this build started. Ignoring it.
testng-results.xml was last modified before this build started. Ignoring it.
testng-results.xml was last modified before this build started. Ignoring it.
testng-results.xml was last modified before this build started. Ignoring it.
Saving reports...
Found matching files but did not find any TestNG results.