OSDir

[Date Prev][Date Next][Thread Prev][Thread Next][Date Index][Thread Index]

Build failed in Jenkins: brooklyn-server-master-docker #78


See <https://builds.apache.org/job/brooklyn-server-master-docker/78/display/redirect>

------------------------------------------
[...truncated 5.62 MB...]
2018-05-03 15:18:46,886 INFO  - TESTNG INVOKING CONFIGURATION: "Surefire test" - @AfterMethod org.apache.brooklyn.core.test.BrooklynMgmtUnitTestSupport.tearDown()
2018-05-03 15:18:46,895 INFO  - TESTNG PASSED CONFIGURATION: "Surefire test" - @AfterMethod org.apache.brooklyn.core.test.BrooklynMgmtUnitTestSupport.tearDown() finished in 9 ms
2018-05-03 15:18:46,895 INFO  - TESTNG INVOKING CONFIGURATION: "Surefire test" - @BeforeMethod org.apache.brooklyn.core.entity.EntityPredicatesTest.setUp()
2018-05-03 15:18:46,896 INFO  - Added external config supplier named 'brooklyn-demo-sample': org.apache.brooklyn.core.config.external.InPlaceExternalConfigSupplier@1e773396
2018-05-03 15:18:46,946 INFO  - TESTNG PASSED CONFIGURATION: "Surefire test" - @BeforeMethod org.apache.brooklyn.core.entity.EntityPredicatesTest.setUp() finished in 51 ms
2018-05-03 15:18:46,946 INFO  - TESTNG INVOKING: "Surefire test" - org.apache.brooklyn.core.entity.EntityPredicatesTest.testManaged()
2018-05-03 15:18:46,948 INFO  - TESTNG PASSED: "Surefire test" - org.apache.brooklyn.core.entity.EntityPredicatesTest.testManaged() finished in 2 ms
2018-05-03 15:18:46,948 INFO  - TESTNG INVOKING CONFIGURATION: "Surefire test" - @AfterMethod org.apache.brooklyn.core.test.BrooklynMgmtUnitTestSupport.tearDown()
2018-05-03 15:18:46,954 INFO  - TESTNG PASSED CONFIGURATION: "Surefire test" - @AfterMethod org.apache.brooklyn.core.test.BrooklynMgmtUnitTestSupport.tearDown() finished in 6 ms
2018-05-03 15:18:46,954 INFO  - TESTNG INVOKING CONFIGURATION: "Surefire test" - @BeforeMethod org.apache.brooklyn.core.entity.EntityPredicatesTest.setUp()
2018-05-03 15:18:46,954 INFO  - Added external config supplier named 'brooklyn-demo-sample': org.apache.brooklyn.core.config.external.InPlaceExternalConfigSupplier@23c6ed93
2018-05-03 15:18:47,005 INFO  - TESTNG PASSED CONFIGURATION: "Surefire test" - @BeforeMethod org.apache.brooklyn.core.entity.EntityPredicatesTest.setUp() finished in 51 ms
2018-05-03 15:18:47,005 INFO  - TESTNG INVOKING: "Surefire test" - org.apache.brooklyn.core.entity.EntityPredicatesTest.testWithLocation()
2018-05-03 15:18:47,007 INFO  - TESTNG PASSED: "Surefire test" - org.apache.brooklyn.core.entity.EntityPredicatesTest.testWithLocation() finished in 1 ms
2018-05-03 15:18:47,007 INFO  - TESTNG INVOKING CONFIGURATION: "Surefire test" - @AfterMethod org.apache.brooklyn.core.test.BrooklynMgmtUnitTestSupport.tearDown()
2018-05-03 15:18:47,016 INFO  - TESTNG PASSED CONFIGURATION: "Surefire test" - @AfterMethod org.apache.brooklyn.core.test.BrooklynMgmtUnitTestSupport.tearDown() finished in 9 ms
2018-05-03 15:18:47,017 INFO  - TESTNG INVOKING CONFIGURATION: "Surefire test" - @BeforeMethod org.apache.brooklyn.core.entity.EntityRegistrationTest.setUp()
2018-05-03 15:18:47,017 INFO  - Added external config supplier named 'brooklyn-demo-sample': org.apache.brooklyn.core.config.external.InPlaceExternalConfigSupplier@2fbb9c3f
2018-05-03 15:18:47,036 INFO  - TESTNG PASSED CONFIGURATION: "Surefire test" - @BeforeMethod org.apache.brooklyn.core.entity.EntityRegistrationTest.setUp() finished in 19 ms
2018-05-03 15:18:47,036 INFO  - TESTNG INVOKING: "Surefire test" - org.apache.brooklyn.core.entity.EntityRegistrationTest.testAddAndRemoveChildrenEmitsEvent()
2018-05-03 15:18:47,062 INFO  - TESTNG PASSED: "Surefire test" - org.apache.brooklyn.core.entity.EntityRegistrationTest.testAddAndRemoveChildrenEmitsEvent() finished in 26 ms
2018-05-03 15:18:47,062 INFO  - TESTNG INVOKING CONFIGURATION: "Surefire test" - @AfterMethod org.apache.brooklyn.core.test.BrooklynMgmtUnitTestSupport.tearDown()
2018-05-03 15:18:47,067 INFO  - TESTNG PASSED CONFIGURATION: "Surefire test" - @AfterMethod org.apache.brooklyn.core.test.BrooklynMgmtUnitTestSupport.tearDown() finished in 5 ms
2018-05-03 15:18:47,067 INFO  - TESTNG INVOKING CONFIGURATION: "Surefire test" - @BeforeMethod org.apache.brooklyn.core.entity.EntityFunctionsTest.setUp()
2018-05-03 15:18:47,068 INFO  - Added external config supplier named 'brooklyn-demo-sample': org.apache.brooklyn.core.config.external.InPlaceExternalConfigSupplier@5315f2ec
2018-05-03 15:18:47,111 INFO  - TESTNG PASSED CONFIGURATION: "Surefire test" - @BeforeMethod org.apache.brooklyn.core.entity.EntityFunctionsTest.setUp() finished in 44 ms
2018-05-03 15:18:47,111 INFO  - TESTNG INVOKING: "Surefire test" - org.apache.brooklyn.core.entity.EntityFunctionsTest.testAttribute()
2018-05-03 15:18:47,113 INFO  - TESTNG PASSED: "Surefire test" - org.apache.brooklyn.core.entity.EntityFunctionsTest.testAttribute() finished in 2 ms
2018-05-03 15:18:47,114 INFO  - TESTNG INVOKING CONFIGURATION: "Surefire test" - @AfterMethod org.apache.brooklyn.core.test.BrooklynMgmtUnitTestSupport.tearDown()
2018-05-03 15:18:47,121 INFO  - TESTNG PASSED CONFIGURATION: "Surefire test" - @AfterMethod org.apache.brooklyn.core.test.BrooklynMgmtUnitTestSupport.tearDown() finished in 6 ms
2018-05-03 15:18:47,121 INFO  - TESTNG INVOKING CONFIGURATION: "Surefire test" - @BeforeMethod org.apache.brooklyn.core.entity.EntityFunctionsTest.setUp()
2018-05-03 15:18:47,121 INFO  - Added external config supplier named 'brooklyn-demo-sample': org.apache.brooklyn.core.config.external.InPlaceExternalConfigSupplier@20aa4995
2018-05-03 15:18:47,165 INFO  - TESTNG PASSED CONFIGURATION: "Surefire test" - @BeforeMethod org.apache.brooklyn.core.entity.EntityFunctionsTest.setUp() finished in 44 ms
2018-05-03 15:18:47,165 INFO  - TESTNG INVOKING: "Surefire test" - org.apache.brooklyn.core.entity.EntityFunctionsTest.testConfig()
2018-05-03 15:18:47,167 INFO  - TESTNG PASSED: "Surefire test" - org.apache.brooklyn.core.entity.EntityFunctionsTest.testConfig() finished in 2 ms
2018-05-03 15:18:47,167 INFO  - TESTNG INVOKING CONFIGURATION: "Surefire test" - @AfterMethod org.apache.brooklyn.core.test.BrooklynMgmtUnitTestSupport.tearDown()
2018-05-03 15:18:47,176 INFO  - TESTNG PASSED CONFIGURATION: "Surefire test" - @AfterMethod org.apache.brooklyn.core.test.BrooklynMgmtUnitTestSupport.tearDown() finished in 9 ms
2018-05-03 15:18:47,176 INFO  - TESTNG INVOKING CONFIGURATION: "Surefire test" - @BeforeMethod org.apache.brooklyn.core.entity.EntityFunctionsTest.setUp()
2018-05-03 15:18:47,176 INFO  - Added external config supplier named 'brooklyn-demo-sample': org.apache.brooklyn.core.config.external.InPlaceExternalConfigSupplier@5d152dd8
2018-05-03 15:18:47,229 INFO  - TESTNG PASSED CONFIGURATION: "Surefire test" - @BeforeMethod org.apache.brooklyn.core.entity.EntityFunctionsTest.setUp() finished in 53 ms
2018-05-03 15:18:47,229 INFO  - TESTNG INVOKING: "Surefire test" - org.apache.brooklyn.core.entity.EntityFunctionsTest.testDisplayName()
2018-05-03 15:18:47,229 INFO  - TESTNG PASSED: "Surefire test" - org.apache.brooklyn.core.entity.EntityFunctionsTest.testDisplayName() finished in 0 ms
2018-05-03 15:18:47,230 INFO  - TESTNG INVOKING CONFIGURATION: "Surefire test" - @AfterMethod org.apache.brooklyn.core.test.BrooklynMgmtUnitTestSupport.tearDown()
2018-05-03 15:18:47,238 INFO  - TESTNG PASSED CONFIGURATION: "Surefire test" - @AfterMethod org.apache.brooklyn.core.test.BrooklynMgmtUnitTestSupport.tearDown() finished in 8 ms
2018-05-03 15:18:47,240 INFO  - TESTNG INVOKING CONFIGURATION: "Surefire test" - @BeforeMethod org.apache.brooklyn.core.entity.EntityFunctionsTest.setUp()
2018-05-03 15:18:47,240 INFO  - Added external config supplier named 'brooklyn-demo-sample': org.apache.brooklyn.core.config.external.InPlaceExternalConfigSupplier@7da55769
2018-05-03 15:18:47,285 INFO  - TESTNG PASSED CONFIGURATION: "Surefire test" - @BeforeMethod org.apache.brooklyn.core.entity.EntityFunctionsTest.setUp() finished in 45 ms
2018-05-03 15:18:47,285 INFO  - TESTNG INVOKING: "Surefire test" - org.apache.brooklyn.core.entity.EntityFunctionsTest.testEntityAttributeTest()
2018-05-03 15:18:47,287 INFO  - TESTNG PASSED: "Surefire test" - org.apache.brooklyn.core.entity.EntityFunctionsTest.testEntityAttributeTest() finished in 2 ms
2018-05-03 15:18:47,287 INFO  - TESTNG INVOKING CONFIGURATION: "Surefire test" - @AfterMethod org.apache.brooklyn.core.test.BrooklynMgmtUnitTestSupport.tearDown()
2018-05-03 15:18:47,297 INFO  - TESTNG PASSED CONFIGURATION: "Surefire test" - @AfterMethod org.apache.brooklyn.core.test.BrooklynMgmtUnitTestSupport.tearDown() finished in 10 ms
2018-05-03 15:18:47,297 INFO  - TESTNG INVOKING CONFIGURATION: "Surefire test" - @BeforeMethod org.apache.brooklyn.core.entity.EntityFunctionsTest.setUp()
2018-05-03 15:18:47,298 INFO  - Added external config supplier named 'brooklyn-demo-sample': org.apache.brooklyn.core.config.external.InPlaceExternalConfigSupplier@5b50470e
2018-05-03 15:18:47,339 INFO  - TESTNG PASSED CONFIGURATION: "Surefire test" - @BeforeMethod org.apache.brooklyn.core.entity.EntityFunctionsTest.setUp() finished in 42 ms
2018-05-03 15:18:47,339 INFO  - TESTNG INVOKING: "Surefire test" - org.apache.brooklyn.core.entity.EntityFunctionsTest.testId()
2018-05-03 15:18:47,339 INFO  - TESTNG PASSED: "Surefire test" - org.apache.brooklyn.core.entity.EntityFunctionsTest.testId() finished in 0 ms
2018-05-03 15:18:47,340 INFO  - TESTNG INVOKING CONFIGURATION: "Surefire test" - @AfterMethod org.apache.brooklyn.core.test.BrooklynMgmtUnitTestSupport.tearDown()
2018-05-03 15:18:47,347 INFO  - TESTNG PASSED CONFIGURATION: "Surefire test" - @AfterMethod org.apache.brooklyn.core.test.BrooklynMgmtUnitTestSupport.tearDown() finished in 7 ms
2018-05-03 15:18:47,347 INFO  - TESTNG INVOKING CONFIGURATION: "Surefire test" - @BeforeMethod org.apache.brooklyn.core.entity.EntityFunctionsTest.setUp()
2018-05-03 15:18:47,347 INFO  - Added external config supplier named 'brooklyn-demo-sample': org.apache.brooklyn.core.config.external.InPlaceExternalConfigSupplier@5345911c
2018-05-03 15:18:47,392 INFO  - TESTNG PASSED CONFIGURATION: "Surefire test" - @BeforeMethod org.apache.brooklyn.core.entity.EntityFunctionsTest.setUp() finished in 45 ms
2018-05-03 15:18:47,392 INFO  - TESTNG INVOKING: "Surefire test" - org.apache.brooklyn.core.entity.EntityFunctionsTest.testLocationMatching()
2018-05-03 15:18:47,394 INFO  - TESTNG PASSED: "Surefire test" - org.apache.brooklyn.core.entity.EntityFunctionsTest.testLocationMatching() finished in 2 ms
2018-05-03 15:18:47,394 INFO  - TESTNG INVOKING CONFIGURATION: "Surefire test" - @AfterMethod org.apache.brooklyn.core.test.BrooklynMgmtUnitTestSupport.tearDown()
2018-05-03 15:18:47,402 INFO  - TESTNG PASSED CONFIGURATION: "Surefire test" - @AfterMethod org.apache.brooklyn.core.test.BrooklynMgmtUnitTestSupport.tearDown() finished in 8 ms
2018-05-03 15:18:47,403 INFO  - TESTNG INVOKING: "Surefire test" - org.apache.brooklyn.core.location.LocationRegistryTest.testLocalhostAllowedByDefault()
2018-05-03 15:18:47,404 INFO  - Added external config supplier named 'brooklyn-demo-sample': org.apache.brooklyn.core.config.external.InPlaceExternalConfigSupplier@74ff604
2018-05-03 15:18:47,409 INFO  - No Camp-YAML parser registered for parsing catalog item DSL; skipping DSL-parsing
2018-05-03 15:18:47,412 INFO  - TESTNG PASSED: "Surefire test" - org.apache.brooklyn.core.location.LocationRegistryTest.testLocalhostAllowedByDefault() finished in 9 ms
2018-05-03 15:18:47,412 INFO  - TESTNG INVOKING CONFIGURATION: "Surefire test" - @AfterMethod org.apache.brooklyn.core.location.LocationRegistryTest.tearDown()
2018-05-03 15:18:47,412 INFO  - TESTNG PASSED CONFIGURATION: "Surefire test" - @AfterMethod org.apache.brooklyn.core.location.LocationRegistryTest.tearDown() finished in 0 ms
2018-05-03 15:18:47,412 INFO  - TESTNG INVOKING: "Surefire test" - org.apache.brooklyn.core.location.LocationRegistryTest.testNamedLocationsPropertyDefinedLocations()
2018-05-03 15:18:47,413 INFO  - Added external config supplier named 'brooklyn-demo-sample': org.apache.brooklyn.core.config.external.InPlaceExternalConfigSupplier@7eef67fe
2018-05-03 15:18:47,417 INFO  - No Camp-YAML parser registered for parsing catalog item DSL; skipping DSL-parsing
2018-05-03 15:18:47,417 INFO  - foo properties gave defined locations: {AANafqNg=LocationDefinition{id='AANafqNg', name='foo', spec='byon:(hosts="root@192.168.1.{1,2,3,4}")', config={privateKeyFile=~/.ssh/foo.id_rsa}}}
2018-05-03 15:18:47,417 INFO  - TESTNG PASSED: "Surefire test" - org.apache.brooklyn.core.location.LocationRegistryTest.testNamedLocationsPropertyDefinedLocations() finished in 5 ms
2018-05-03 15:18:47,418 INFO  - TESTNG INVOKING CONFIGURATION: "Surefire test" - @AfterMethod org.apache.brooklyn.core.location.LocationRegistryTest.tearDown()
2018-05-03 15:18:47,419 INFO  - TESTNG PASSED CONFIGURATION: "Surefire test" - @AfterMethod org.apache.brooklyn.core.location.LocationRegistryTest.tearDown() finished in 0 ms
2018-05-03 15:18:47,419 INFO  - TESTNG INVOKING: "Surefire test" - org.apache.brooklyn.core.location.LocationRegistryTest.testCircularReference()
2018-05-03 15:18:47,419 INFO  - Added external config supplier named 'brooklyn-demo-sample': org.apache.brooklyn.core.config.external.InPlaceExternalConfigSupplier@5d7505d9
2018-05-03 15:18:47,423 INFO  - No Camp-YAML parser registered for parsing catalog item DSL; skipping DSL-parsing
2018-05-03 15:18:47,423 INFO  - bar properties gave defined locations: {whIRwtvp=LocationDefinition{id='whIRwtvp', name='bar', spec='named:bar', config={}}}
2018-05-03 15:18:47,426 INFO  - TESTNG PASSED: "Surefire test" - org.apache.brooklyn.core.location.LocationRegistryTest.testCircularReference() finished in 6 ms
2018-05-03 15:18:47,427 INFO  - TESTNG INVOKING CONFIGURATION: "Surefire test" - @AfterMethod org.apache.brooklyn.core.location.LocationRegistryTest.tearDown()
2018-05-03 15:18:47,427 INFO  - TESTNG PASSED CONFIGURATION: "Surefire test" - @AfterMethod org.apache.brooklyn.core.location.LocationRegistryTest.tearDown() finished in 1 ms
2018-05-03 15:18:47,427 INFO  - TESTNG INVOKING: "Surefire test" - org.apache.brooklyn.core.location.LocationRegistryTest.testLocalhostDisallowedIfDisabled()
2018-05-03 15:18:47,428 INFO  - Added external config supplier named 'brooklyn-demo-sample': org.apache.brooklyn.core.config.external.InPlaceExternalConfigSupplier@3491e071
2018-05-03 15:18:47,432 INFO  - No Camp-YAML parser registered for parsing catalog item DSL; skipping DSL-parsing
2018-05-03 15:18:47,434 INFO  - TESTNG PASSED: "Surefire test" - org.apache.brooklyn.core.location.LocationRegistryTest.testLocalhostDisallowedIfDisabled() finished in 7 ms
2018-05-03 15:18:47,435 INFO  - TESTNG INVOKING CONFIGURATION: "Surefire test" - @AfterMethod org.apache.brooklyn.core.location.LocationRegistryTest.tearDown()
2018-05-03 15:18:47,435 INFO  - TESTNG PASSED CONFIGURATION: "Surefire test" - @AfterMethod org.apache.brooklyn.core.location.LocationRegistryTest.tearDown() finished in 0 ms
2018-05-03 15:18:47,435 INFO  - TESTNG INVOKING: "Surefire test" - org.apache.brooklyn.core.location.LocationRegistryTest.testLocalhostEnabled()
2018-05-03 15:18:47,435 INFO  - Added external config supplier named 'brooklyn-demo-sample': org.apache.brooklyn.core.config.external.InPlaceExternalConfigSupplier@17792aa2
2018-05-03 15:18:47,439 INFO  - No Camp-YAML parser registered for parsing catalog item DSL; skipping DSL-parsing
2018-05-03 15:18:47,439 INFO  - TESTNG PASSED: "Surefire test" - org.apache.brooklyn.core.location.LocationRegistryTest.testLocalhostEnabled() finished in 4 ms
2018-05-03 15:18:47,440 INFO  - TESTNG INVOKING CONFIGURATION: "Surefire test" - @AfterMethod org.apache.brooklyn.core.location.LocationRegistryTest.tearDown()
2018-05-03 15:18:47,440 INFO  - TESTNG PASSED CONFIGURATION: "Surefire test" - @AfterMethod org.apache.brooklyn.core.location.LocationRegistryTest.tearDown() finished in 1 ms
2018-05-03 15:18:47,440 INFO  - TESTNG INVOKING: "Surefire test" - org.apache.brooklyn.core.location.LocationRegistryTest.testLocalhostNotPresentByDefault()
2018-05-03 15:18:47,440 INFO  - Added external config supplier named 'brooklyn-demo-sample': org.apache.brooklyn.core.config.external.InPlaceExternalConfigSupplier@33163749
2018-05-03 15:18:47,443 INFO  - No Camp-YAML parser registered for parsing catalog item DSL; skipping DSL-parsing
2018-05-03 15:18:47,443 INFO  - DEFINED LOCATIONS: {}
2018-05-03 15:18:47,443 INFO  - TESTNG PASSED: "Surefire test" - org.apache.brooklyn.core.location.LocationRegistryTest.testLocalhostNotPresentByDefault() finished in 3 ms
2018-05-03 15:18:47,443 INFO  - TESTNG INVOKING CONFIGURATION: "Surefire test" - @AfterMethod org.apache.brooklyn.core.location.LocationRegistryTest.tearDown()
2018-05-03 15:18:47,443 INFO  - TESTNG PASSED CONFIGURATION: "Surefire test" - @AfterMethod org.apache.brooklyn.core.location.LocationRegistryTest.tearDown() finished in 0 ms
2018-05-03 15:18:47,444 INFO  - TESTNG INVOKING: "Surefire test" - org.apache.brooklyn.core.location.LocationRegistryTest.testLocationGetsDefaultDisplayName()
2018-05-03 15:18:47,444 INFO  - Added external config supplier named 'brooklyn-demo-sample': org.apache.brooklyn.core.config.external.InPlaceExternalConfigSupplier@387ded4f
2018-05-03 15:18:47,447 INFO  - No Camp-YAML parser registered for parsing catalog item DSL; skipping DSL-parsing
2018-05-03 15:18:47,453 INFO  - TESTNG PASSED: "Surefire test" - org.apache.brooklyn.core.location.LocationRegistryTest.testLocationGetsDefaultDisplayName() finished in 9 ms
2018-05-03 15:18:47,453 INFO  - TESTNG INVOKING CONFIGURATION: "Surefire test" - @AfterMethod org.apache.brooklyn.core.location.LocationRegistryTest.tearDown()
2018-05-03 15:18:47,454 INFO  - TESTNG PASSED CONFIGURATION: "Surefire test" - @AfterMethod org.apache.brooklyn.core.location.LocationRegistryTest.tearDown() finished in 1 ms
2018-05-03 15:18:47,454 INFO  - TESTNG INVOKING: "Surefire test" - org.apache.brooklyn.core.location.LocationRegistryTest.testLocationGetsDisplayName()
2018-05-03 15:18:47,454 INFO  - Added external config supplier named 'brooklyn-demo-sample': org.apache.brooklyn.core.config.external.InPlaceExternalConfigSupplier@bdc9d0a
2018-05-03 15:18:47,457 INFO  - No Camp-YAML parser registered for parsing catalog item DSL; skipping DSL-parsing
2018-05-03 15:18:47,461 INFO  - TESTNG PASSED: "Surefire test" - org.apache.brooklyn.core.location.LocationRegistryTest.testLocationGetsDisplayName() finished in 7 ms
2018-05-03 15:18:47,461 INFO  - TESTNG INVOKING CONFIGURATION: "Surefire test" - @AfterMethod org.apache.brooklyn.core.location.LocationRegistryTest.tearDown()
2018-05-03 15:18:47,462 INFO  - TESTNG PASSED CONFIGURATION: "Surefire test" - @AfterMethod org.apache.brooklyn.core.location.LocationRegistryTest.tearDown() finished in 1 ms
2018-05-03 15:18:47,462 INFO  - TESTNG INVOKING: "Surefire test" - org.apache.brooklyn.core.location.LocationRegistryTest.testNonsenseParentSupported()
2018-05-03 15:18:47,462 INFO  - Added external config supplier named 'brooklyn-demo-sample': org.apache.brooklyn.core.config.external.InPlaceExternalConfigSupplier@7d76e415
2018-05-03 15:18:47,465 INFO  - No Camp-YAML parser registered for parsing catalog item DSL; skipping DSL-parsing
2018-05-03 15:18:47,466 INFO  - TESTNG PASSED: "Surefire test" - org.apache.brooklyn.core.location.LocationRegistryTest.testNonsenseParentSupported() finished in 4 ms
2018-05-03 15:18:47,466 INFO  - TESTNG INVOKING CONFIGURATION: "Surefire test" - @AfterMethod org.apache.brooklyn.core.location.LocationRegistryTest.tearDown()
2018-05-03 15:18:47,467 INFO  - TESTNG PASSED CONFIGURATION: "Surefire test" - @AfterMethod org.apache.brooklyn.core.location.LocationRegistryTest.tearDown() finished in 1 ms
2018-05-03 15:18:47,467 INFO  - TESTNG INVOKING: "Surefire test" - org.apache.brooklyn.core.location.LocationRegistryTest.testSetupForTesting()
2018-05-03 15:18:47,467 INFO  - Added external config supplier named 'brooklyn-demo-sample': org.apache.brooklyn.core.config.external.InPlaceExternalConfigSupplier@22f6d170
2018-05-03 15:18:47,470 INFO  - No Camp-YAML parser registered for parsing catalog item DSL; skipping DSL-parsing
2018-05-03 15:18:47,470 INFO  - TESTNG PASSED: "Surefire test" - org.apache.brooklyn.core.location.LocationRegistryTest.testSetupForTesting() finished in 3 ms
2018-05-03 15:18:47,471 INFO  - TESTNG INVOKING CONFIGURATION: "Surefire test" - @AfterMethod org.apache.brooklyn.core.location.LocationRegistryTest.tearDown()
2018-05-03 15:18:47,471 INFO  - TESTNG PASSED CONFIGURATION: "Surefire test" - @AfterMethod org.apache.brooklyn.core.location.LocationRegistryTest.tearDown() finished in 0 ms
2018-05-03 15:18:47,475 INFO  - TESTNG INVOKING: "Surefire test" - org.apache.brooklyn.core.location.LocationRegistryTest.testResolvesByNamedAndId()
2018-05-03 15:18:47,475 INFO  - Added external config supplier named 'brooklyn-demo-sample': org.apache.brooklyn.core.config.external.InPlaceExternalConfigSupplier@32e8265f
2018-05-03 15:18:47,478 INFO  - No Camp-YAML parser registered for parsing catalog item DSL; skipping DSL-parsing
2018-05-03 15:18:47,478 INFO  - testResovlesBy has defined locations: {Uk19FBWP=LocationDefinition{id='Uk19FBWP', name='foo', spec='byon:(hosts="root@192.168.1.{1,2,3,4}")', config={privateKeyFile=~/.ssh/foo.id_rsa}}}
2018-05-03 15:18:47,488 INFO  - TESTNG PASSED: "Surefire test" - org.apache.brooklyn.core.location.LocationRegistryTest.testResolvesByNamedAndId() finished in 13 ms
2018-05-03 15:18:47,488 INFO  - TESTNG INVOKING CONFIGURATION: "Surefire test" - @AfterMethod org.apache.brooklyn.core.location.LocationRegistryTest.tearDown()
2018-05-03 15:18:47,489 INFO  - TESTNG PASSED CONFIGURATION: "Surefire test" - @AfterMethod org.apache.brooklyn.core.location.LocationRegistryTest.tearDown() finished in 1 ms
[GC (Allocation Failure)  471683K->310516K(739840K), 0.0387316 secs]
2018-05-03 15:18:47,768 INFO  - TESTNG 
===============================================
    Surefire test
    Tests run: 2316, Failures: 1, Skips: 0
===============================================
[GC (Allocation Failure)  477940K->306699K(738304K), 0.0186540 secs]
[GC (Allocation Failure)  474123K->306028K(741376K), 0.0203816 secs]
[GC (Allocation Failure)  477036K->306079K(740352K), 0.0079129 secs]
[GC (Allocation Failure)  477087K->306206K(743936K), 0.0142602 secs]
[GC (Allocation Failure)  482334K->306216K(742912K), 0.0054945 secs]
[GC (Allocation Failure)  482344K->306604K(747520K), 0.0128357 secs]
[GC (Allocation Failure)  488876K->307468K(745472K), 0.0135871 secs]
Tests run: 2316, Failures: 1, Errors: 0, Skipped: 0, Time elapsed: 201.868 sec <<< FAILURE! - in TestSuite
testCommandExecutedWithEnvironment(org.apache.brooklyn.entity.group.SshCommandMembershipTrackingPolicyTest)  Time elapsed: 0.033 sec  <<< FAILURE!
java.lang.AssertionError: Lists differ at element [0]: echo ignored != mkdir -p '/path/to/myexecutiondir' && cd '/path/to/myexecutiondir' && echo 'myval' expected [echo ignored] but found [mkdir -p '/path/to/myexecutiondir' && cd '/path/to/myexecutiondir' && echo 'myval']
	at org.apache.brooklyn.entity.group.SshCommandMembershipTrackingPolicyTest.testCommandExecutedWithEnvironment(SshCommandMembershipTrackingPolicyTest.java:90)

2018-05-03 15:18:50,617 INFO  - Brooklyn shutdown: stopping entities [TestEntityImpl{id=ou4lv86jmg}, TestEntityImpl{id=wc8hs70nl2}, BlockingEntityImpl{id=f41fqsw6tp}]

Results :

Failed tests: 
  SshCommandMembershipTrackingPolicyTest.testCommandExecutedWithEnvironment:90 Lists differ at element [0]: echo ignored != mkdir -p '/path/to/myexecutiondir' && cd '/path/to/myexecutiondir' && echo 'myval' expected [echo ignored] but found [mkdir -p '/path/to/myexecutiondir' && cd '/path/to/myexecutiondir' && echo 'myval']

Tests run: 2316, Failures: 1, Errors: 0, Skipped: 0

[INFO] ------------------------------------------------------------------------
[INFO] Reactor Summary:
[INFO] 
[INFO] Brooklyn Server Root ............................... SUCCESS [  3.857 s]
[INFO] Brooklyn Parent Project ............................ SUCCESS [  4.860 s]
[INFO] Brooklyn Test Support Utilities .................... SUCCESS [  7.203 s]
[INFO] Brooklyn Logback Includable Configuration .......... SUCCESS [  0.379 s]
[INFO] Brooklyn Common Utilities .......................... SUCCESS [ 25.698 s]
[INFO] Brooklyn API ....................................... SUCCESS [  1.665 s]
[INFO] CAMP Server Parent Project ......................... SUCCESS [  0.163 s]
[INFO] CAMP Base .......................................... SUCCESS [  3.272 s]
[INFO] Brooklyn Test Support .............................. SUCCESS [  0.902 s]
[INFO] Brooklyn REST Swagger Apidoc Utilities ............. SUCCESS [  7.924 s]
[INFO] Brooklyn Logback Configuration ..................... SUCCESS [  0.186 s]
[INFO] CAMP Server ........................................ SUCCESS [  9.985 s]
[INFO] Brooklyn Felix Runtime ............................. SUCCESS [  3.699 s]
[INFO] Brooklyn Groovy Utilities .......................... SUCCESS [  2.238 s]
[INFO] Brooklyn Core ...................................... FAILURE [04:09 min]
[INFO] Brooklyn Policies .................................. SKIPPED
[INFO] Brooklyn WinRM Software Entities ................... SKIPPED
[INFO] Brooklyn Secure JMXMP Agent ........................ SKIPPED
[INFO] Brooklyn JMX RMI Agent ............................. SKIPPED
[INFO] Brooklyn Jclouds Location Targets .................. SKIPPED
[INFO] Brooklyn Software Base ............................. SKIPPED
[INFO] Brooklyn CAMP ...................................... SKIPPED
[INFO] Brooklyn Launcher Common ........................... SKIPPED
[INFO] Brooklyn REST API .................................. SKIPPED
[INFO] Brooklyn REST Resources ............................ SKIPPED
[INFO] Brooklyn REST Server ............................... SKIPPED
[INFO] Brooklyn Launcher .................................. SKIPPED
[INFO] Brooklyn Container Location Targets ................ SKIPPED
[INFO] Brooklyn Command Line Interface .................... SKIPPED
[INFO] Brooklyn Test Framework ............................ SKIPPED
[INFO] Brooklyn OSGi init ................................. SKIPPED
[INFO] Brooklyn OSGi start ................................ SKIPPED
[INFO] Brooklyn Karaf ..................................... SKIPPED
[INFO] Jetty config fragment .............................. SKIPPED
[INFO] Apache Http Component extension .................... SKIPPED
[INFO] Brooklyn Karaf Features ............................ SKIPPED
[INFO] Brooklyn Karaf Shell Commands ...................... SKIPPED
[INFO] ------------------------------------------------------------------------
[INFO] BUILD FAILURE
[INFO] ------------------------------------------------------------------------
[INFO] Total time: 05:33 min
[INFO] Finished at: 2018-05-03T15:18:51Z
[INFO] Final Memory: 73M/740M
[INFO] ------------------------------------------------------------------------
[ERROR] Failed to execute goal org.apache.maven.plugins:maven-surefire-plugin:2.19.1:test (default-test) on project brooklyn-core: There are test failures.
[ERROR] 
[ERROR] Please refer to /usr/build/core/target/surefire-reports for the individual test results.
[ERROR] -> [Help 1]
[ERROR] 
[ERROR] To see the full stack trace of the errors, re-run Maven with the -e switch.
[ERROR] Re-run Maven using the -X switch to enable full debug logging.
[ERROR] 
[ERROR] For more information about the errors and possible solutions, please read the following articles:
[ERROR] [Help 1] http://cwiki.apache.org/confluence/display/MAVEN/MojoFailureException
[ERROR] 
[ERROR] After correcting the problems, you can resume the build with the command
[ERROR]   mvn <goals> -rf :brooklyn-core
Build step 'Execute shell' marked build as failure
Recording test results
TestNG Reports Processing: START
Looking for TestNG results report in workspace using pattern: **/testng-results.xml
testng-results.xml was last modified before this build started. Ignoring it.
testng-results.xml was last modified before this build started. Ignoring it.
testng-results.xml was last modified before this build started. Ignoring it.
testng-results.xml was last modified before this build started. Ignoring it.
testng-results.xml was last modified before this build started. Ignoring it.
testng-results.xml was last modified before this build started. Ignoring it.
testng-results.xml was last modified before this build started. Ignoring it.
testng-results.xml was last modified before this build started. Ignoring it.
testng-results.xml was last modified before this build started. Ignoring it.
testng-results.xml was last modified before this build started. Ignoring it.
testng-results.xml was last modified before this build started. Ignoring it.
testng-results.xml was last modified before this build started. Ignoring it.
testng-results.xml was last modified before this build started. Ignoring it.
testng-results.xml was last modified before this build started. Ignoring it.
Saving reports...
Processing '/x1/jenkins/jenkins-home/jobs/brooklyn-server-master-docker/builds/78/testng/testng-results-1.xml'
Processing '/x1/jenkins/jenkins-home/jobs/brooklyn-server-master-docker/builds/78/testng/testng-results-2.xml'
Processing '/x1/jenkins/jenkins-home/jobs/brooklyn-server-master-docker/builds/78/testng/testng-results-3.xml'
Processing '/x1/jenkins/jenkins-home/jobs/brooklyn-server-master-docker/builds/78/testng/testng-results-4.xml'
Processing '/x1/jenkins/jenkins-home/jobs/brooklyn-server-master-docker/builds/78/testng/testng-results-5.xml'
Processing '/x1/jenkins/jenkins-home/jobs/brooklyn-server-master-docker/builds/78/testng/testng-results.xml'
0.034223% of tests failed, which exceeded threshold of 0%. Marking build as UNSTABLE
TestNG Reports Processing: FINISH