OSDir

[Date Prev][Date Next][Thread Prev][Thread Next][Date Index][Thread Index]

Build failed in Jenkins: brooklyn-library-master-docker #182


See <https://builds.apache.org/job/brooklyn-library-master-docker/182/display/redirect>

------------------------------------------
[...truncated 3.67 MB...]
[INFO] Exclude: **/*.svg
[INFO] Exclude: **/*.crt
[INFO] Exclude: **/*.csr
[INFO] Exclude: **/*.key
[INFO] Exclude: **/*.key.org
[INFO] Exclude: **/*.psd
[INFO] Exclude: **/*.json
[INFO] Exclude: **/*.plxarc
[INFO] Exclude: **/src/test/resources/org/apache/brooklyn/entity/software/base/template_with_extra_substitutions.txt
[INFO] Exclude: **/src/main/resources/banner.txt
[INFO] Exclude: **/src/test/resources/ssl/certs/localhost/info.txt
[INFO] Exclude: **/src/main/history/dependencies.xml
[INFO] Exclude: **/sandbox/examples/src/main/scripts/amis.txt
[INFO] Exclude: docs/**
[INFO] 2 resources included (use -debug for more details)
[INFO] Rat check: Summary over all files. Unapproved: 0, unknown: 0, generated: 0, approved: 2 licenses.
[INFO] 
[INFO] --- maven-source-plugin:2.4:jar-no-fork (attach-sources) @ brooklyn-library-features ---
[INFO] Building jar: /usr/build/karaf/features/target/brooklyn-library-features-1.0.0-SNAPSHOT-sources.jar
[INFO] 
[INFO] --- maven-source-plugin:2.4:test-jar-no-fork (attach-sources) @ brooklyn-library-features ---
[INFO] Building jar: /usr/build/karaf/features/target/brooklyn-library-features-1.0.0-SNAPSHOT-test-sources.jar
[INFO] 
[INFO] --- maven-install-plugin:2.5.2:install (default-install) @ brooklyn-library-features ---
[INFO] No primary artifact to install, installing attached artifacts instead.
[INFO] Installing /usr/build/karaf/features/pom.xml to /root/.m2/repository/org/apache/brooklyn/brooklyn-library-features/1.0.0-SNAPSHOT/brooklyn-library-features-1.0.0-SNAPSHOT.pom
[INFO] Installing /usr/build/karaf/features/target/feature/feature.xml to /root/.m2/repository/org/apache/brooklyn/brooklyn-library-features/1.0.0-SNAPSHOT/brooklyn-library-features-1.0.0-SNAPSHOT-features.xml
[INFO] Installing /usr/build/karaf/features/target/brooklyn-library-features-1.0.0-SNAPSHOT-sources.jar to /root/.m2/repository/org/apache/brooklyn/brooklyn-library-features/1.0.0-SNAPSHOT/brooklyn-library-features-1.0.0-SNAPSHOT-sources.jar
[INFO] Installing /usr/build/karaf/features/target/brooklyn-library-features-1.0.0-SNAPSHOT-test-sources.jar to /root/.m2/repository/org/apache/brooklyn/brooklyn-library-features/1.0.0-SNAPSHOT/brooklyn-library-features-1.0.0-SNAPSHOT-test-sources.jar
[INFO] ------------------------------------------------------------------------
[INFO] Reactor Summary:
[INFO] 
[INFO] Brooklyn Library Root .............................. SUCCESS [  9.880 s]
[INFO] Brooklyn CM Chef ................................... SUCCESS [01:23 min]
[INFO] Brooklyn CM SaltStack .............................. SUCCESS [  7.547 s]
[INFO] Brooklyn CM Ansible ................................ SUCCESS [  5.216 s]
[INFO] Brooklyn CM Integration Root ....................... SUCCESS [  0.149 s]
[INFO] Brooklyn Network Software Entities ................. SUCCESS [  5.977 s]
[INFO] Brooklyn OSGi Software Entities .................... SUCCESS [  4.376 s]
[INFO] Brooklyn Database Software Entities ................ SUCCESS [ 10.600 s]
[INFO] Brooklyn Web App Software Entities ................. SUCCESS [ 29.834 s]
[INFO] Brooklyn Messaging Software Entities ............... SUCCESS [ 30.474 s]
[INFO] Brooklyn NoSQL Data Store Software Entities ........ SUCCESS [ 37.270 s]
[INFO] Brooklyn Monitoring Software Entities .............. SUCCESS [  3.824 s]
[INFO] Brooklyn Web App Software Entities ................. SUCCESS [  0.218 s]
[INFO] Brooklyn QA ........................................ SUCCESS [ 27.262 s]
[INFO] Brooklyn Examples Aggregator Project ............... SUCCESS [  0.094 s]
[INFO] Brooklyn Examples Aggregator Project - Webapps ..... SUCCESS [  0.105 s]
[INFO] hello-world-webapp Maven Webapp .................... SUCCESS [  0.870 s]
[INFO] hello-world-sql-webapp Maven Webapp ................ SUCCESS [  2.211 s]
[INFO] Brooklyn Simple Web Cluster Example ................ SUCCESS [  7.695 s]
[INFO] Brooklyn Library Karaf integration ................. SUCCESS [  0.120 s]
[INFO] Brooklyn Library Catalog ........................... SUCCESS [  0.269 s]
[INFO] Brooklyn Library Karaf Features .................... SUCCESS [  2.435 s]
[INFO] ------------------------------------------------------------------------
[INFO] BUILD SUCCESS
[INFO] ------------------------------------------------------------------------
[INFO] Total time: 04:44 min
[INFO] Finished at: 2018-05-02T14:08:44Z
[INFO] Final Memory: 118M/918M
[INFO] ------------------------------------------------------------------------
[Current build status] check if current [SUCCESS] is worse or equals then [SUCCESS] and better or equals then [SUCCESS]
Run condition [Current build status] enabling perform for step [Execute shell]
[brooklyn-library-master-docker] $ /bin/bash -xe /tmp/jenkins6457518346687300981.sh
+ docker run -i --rm --name brooklyn-library -v <https://builds.apache.org/job/brooklyn-library-master-docker/ws/.m2>:/root/.m2 -v <https://builds.apache.org/job/brooklyn-library-master-docker/ws/repo>:/usr/build -w /usr/build brooklyn:library mvn deploy -DskipTests
[INFO] Scanning for projects...
[INFO] ------------------------------------------------------------------------
[INFO] Reactor Build Order:
[INFO] 
[INFO] Brooklyn Library Root
[INFO] Brooklyn CM Chef
[INFO] Brooklyn CM SaltStack
[INFO] Brooklyn CM Ansible
[INFO] Brooklyn CM Integration Root
[INFO] Brooklyn Network Software Entities
[INFO] Brooklyn OSGi Software Entities
[INFO] Brooklyn Database Software Entities
[INFO] Brooklyn Web App Software Entities
[INFO] Brooklyn Messaging Software Entities
[INFO] Brooklyn NoSQL Data Store Software Entities
[INFO] Brooklyn Monitoring Software Entities
[INFO] Brooklyn Web App Software Entities
[INFO] Brooklyn QA
[INFO] Brooklyn Examples Aggregator Project
[INFO] Brooklyn Examples Aggregator Project - Webapps
[INFO] hello-world-webapp Maven Webapp
[INFO] hello-world-sql-webapp Maven Webapp
[INFO] Brooklyn Simple Web Cluster Example
[INFO] Brooklyn Library Karaf integration
[INFO] Brooklyn Library Catalog
[INFO] Brooklyn Library Karaf Features
[INFO] 
[INFO] ------------------------------------------------------------------------
[INFO] Building Brooklyn Library Root 1.0.0-SNAPSHOT
[INFO] ------------------------------------------------------------------------
Downloading from central: https://repo.maven.apache.org/maven2/org/apache/maven/plugins/maven-deploy-plugin/2.8.2/maven-deploy-plugin-2.8.2.pom
Progress (1): 2.2/7.1 kBProgress (1): 5.0/7.1 kBProgress (1): 7.1 kB                        Downloaded from central: https://repo.maven.apache.org/maven2/org/apache/maven/plugins/maven-deploy-plugin/2.8.2/maven-deploy-plugin-2.8.2.pom (7.1 kB at 14 kB/s)
Downloading from central: https://repo.maven.apache.org/maven2/org/apache/maven/plugins/maven-deploy-plugin/2.8.2/maven-deploy-plugin-2.8.2.jar
Progress (1): 2.2/34 kBProgress (1): 5.0/34 kBProgress (1): 7.7/34 kBProgress (1): 10/34 kB Progress (1): 13/34 kBProgress (1): 16/34 kBProgress (1): 19/34 kBProgress (1): 21/34 kBProgress (1): 24/34 kBProgress (1): 27/34 kBProgress (1): 30/34 kBProgress (1): 32/34 kBProgress (1): 34 kB                      Downloaded from central: https://repo.maven.apache.org/maven2/org/apache/maven/plugins/maven-deploy-plugin/2.8.2/maven-deploy-plugin-2.8.2.jar (34 kB at 948 kB/s)
[INFO] 
[INFO] --- buildnumber-maven-plugin:1.3:create (default) @ brooklyn-library ---
[INFO] Executing: /bin/sh -c cd /usr/build && git rev-parse --verify HEAD
[INFO] Working directory: /usr/build
[INFO] Storing buildNumber: 934ab1a03f08a53954406b255a49fa9a0ce72980 at timestamp: 1525270134974
[WARNING] Cannot get the branch information from the git repository: 
Detecting the current branch failed: fatal: ref HEAD is not a symbolic ref

[INFO] Executing: /bin/sh -c cd /usr/build && git rev-parse --verify HEAD
[INFO] Working directory: /usr/build
[INFO] Storing buildScmBranch: UNKNOWN
[INFO] 
[INFO] --- maven-enforcer-plugin:1.4.1:enforce (brooklyn-build-req) @ brooklyn-library ---
[INFO] 
[INFO] --- maven-remote-resources-plugin:1.5:process (default) @ brooklyn-library ---
[INFO] 
[INFO] --- maven-checkstyle-plugin:2.17:check (verify-style) @ brooklyn-library ---
[INFO] 
[INFO] --- maven-site-plugin:3.4:attach-descriptor (attach-descriptor) @ brooklyn-library ---
[INFO] 
[INFO] --- apache-rat-plugin:0.12:check (default) @ brooklyn-library ---
[INFO] Enabled default license matchers.
[INFO] Will parse SCM ignores for exclusions...
[INFO] Parsing exclusions from /usr/build/.gitignore
[INFO] Finished adding exclusions from SCM ignore files.
[INFO] 94 implicit excludes (use -debug for more details).
[INFO] Exclude: sandbox/**
[INFO] Exclude: release/**
[INFO] Exclude: README.md
[INFO] Exclude: **/.git/**
[INFO] Exclude: **/.gitignore
[INFO] Exclude: **/.repository/**
[INFO] Exclude: **/.idea/**
[INFO] Exclude: **/*.iml
[INFO] Exclude: **/.classpath/**
[INFO] Exclude: **/.project
[INFO] Exclude: **/.settings/**
[INFO] Exclude: **/*.log
[INFO] Exclude: **/brooklyn*.log.*
[INFO] Exclude: **/target/**
[INFO] Exclude: **/nbactions.xml
[INFO] Exclude: **/nb-configuration.xml
[INFO] Exclude: ignored/**
[INFO] Exclude: LICENSE.md
[INFO] Exclude: .mvn/jvm.config
[INFO] Exclude: **/src/main/license/**
[INFO] Exclude: **/src/test/license/**
[INFO] Exclude: **/MANIFEST.MF
[INFO] Exclude: **/test-output/**
[INFO] Exclude: **/*.pem.pub
[INFO] Exclude: **/*.pem
[INFO] Exclude: **/*_rsa.pub
[INFO] Exclude: **/*_rsa
[INFO] Exclude: **/*.svg
[INFO] Exclude: **/*.crt
[INFO] Exclude: **/*.csr
[INFO] Exclude: **/*.key
[INFO] Exclude: **/*.key.org
[INFO] Exclude: **/*.psd
[INFO] Exclude: **/*.json
[INFO] Exclude: **/*.plxarc
[INFO] Exclude: **/src/test/resources/org/apache/brooklyn/entity/software/base/template_with_extra_substitutions.txt
[INFO] Exclude: **/src/main/resources/banner.txt
[INFO] Exclude: **/src/test/resources/ssl/certs/localhost/info.txt
[INFO] Exclude: **/src/main/history/dependencies.xml
[INFO] Exclude: **/sandbox/examples/src/main/scripts/amis.txt
[INFO] Exclude: docs/**
[INFO] 5 resources included (use -debug for more details)
[INFO] Rat check: Summary over all files. Unapproved: 0, unknown: 0, generated: 0, approved: 3 licenses.
[INFO] 
[INFO] --- maven-source-plugin:2.4:jar-no-fork (attach-sources) @ brooklyn-library ---
[INFO] 
[INFO] --- maven-source-plugin:2.4:test-jar-no-fork (attach-sources) @ brooklyn-library ---
[INFO] 
[INFO] --- maven-install-plugin:2.5.2:install (default-install) @ brooklyn-library ---
[INFO] Installing /usr/build/pom.xml to /root/.m2/repository/org/apache/brooklyn/brooklyn-library/1.0.0-SNAPSHOT/brooklyn-library-1.0.0-SNAPSHOT.pom
[INFO] 
[INFO] --- maven-deploy-plugin:2.8.2:deploy (default-deploy) @ brooklyn-library ---
Downloading from apache.snapshots.https: https://repository.apache.org/content/repositories/snapshots/org/apache/brooklyn/brooklyn-library/1.0.0-SNAPSHOT/maven-metadata.xml
Progress (1): 616 B                   Downloaded from apache.snapshots.https: https://repository.apache.org/content/repositories/snapshots/org/apache/brooklyn/brooklyn-library/1.0.0-SNAPSHOT/maven-metadata.xml (616 B at 1.0 kB/s)
Uploading to apache.snapshots.https: https://repository.apache.org/content/repositories/snapshots/org/apache/brooklyn/brooklyn-library/1.0.0-SNAPSHOT/brooklyn-library-1.0.0-20180502.140858-200.pom
Progress (1): 2.0/5.3 kBProgress (1): 4.1/5.3 kBProgress (1): 5.3 kB                        [INFO] ------------------------------------------------------------------------
[INFO] Reactor Summary:
[INFO] 
[INFO] Brooklyn Library Root .............................. FAILURE [  5.860 s]
[INFO] Brooklyn CM Chef ................................... SKIPPED
[INFO] Brooklyn CM SaltStack .............................. SKIPPED
[INFO] Brooklyn CM Ansible ................................ SKIPPED
[INFO] Brooklyn CM Integration Root ....................... SKIPPED
[INFO] Brooklyn Network Software Entities ................. SKIPPED
[INFO] Brooklyn OSGi Software Entities .................... SKIPPED
[INFO] Brooklyn Database Software Entities ................ SKIPPED
[INFO] Brooklyn Web App Software Entities ................. SKIPPED
[INFO] Brooklyn Messaging Software Entities ............... SKIPPED
[INFO] Brooklyn NoSQL Data Store Software Entities ........ SKIPPED
[INFO] Brooklyn Monitoring Software Entities .............. SKIPPED
[INFO] Brooklyn Web App Software Entities ................. SKIPPED
[INFO] Brooklyn QA ........................................ SKIPPED
[INFO] Brooklyn Examples Aggregator Project ............... SKIPPED
[INFO] Brooklyn Examples Aggregator Project - Webapps ..... SKIPPED
[INFO] hello-world-webapp Maven Webapp .................... SKIPPED
[INFO] hello-world-sql-webapp Maven Webapp ................ SKIPPED
[INFO] Brooklyn Simple Web Cluster Example ................ SKIPPED
[INFO] Brooklyn Library Karaf integration ................. SKIPPED
[INFO] Brooklyn Library Catalog ........................... SKIPPED
[INFO] Brooklyn Library Karaf Features .................... SKIPPED
[INFO] ------------------------------------------------------------------------
[INFO] BUILD FAILURE
[INFO] ------------------------------------------------------------------------
[INFO] Total time: 8.608 s
[INFO] Finished at: 2018-05-02T14:08:59Z
[INFO] Final Memory: 41M/661M
[INFO] ------------------------------------------------------------------------
[ERROR] Failed to execute goal org.apache.maven.plugins:maven-deploy-plugin:2.8.2:deploy (default-deploy) on project brooklyn-library: Failed to deploy artifacts: Could not transfer artifact org.apache.brooklyn:brooklyn-library:pom:1.0.0-20180502.140858-200 from/to apache.snapshots.https (https://repository.apache.org/content/repositories/snapshots): Failed to transfer file: https://repository.apache.org/content/repositories/snapshots/org/apache/brooklyn/brooklyn-library/1.0.0-SNAPSHOT/brooklyn-library-1.0.0-20180502.140858-200.pom. Return code is: 401, ReasonPhrase: Unauthorized. -> [Help 1]
[ERROR] 
[ERROR] To see the full stack trace of the errors, re-run Maven with the -e switch.
[ERROR] Re-run Maven using the -X switch to enable full debug logging.
[ERROR] 
[ERROR] For more information about the errors and possible solutions, please read the following articles:
[ERROR] [Help 1] http://cwiki.apache.org/confluence/display/MAVEN/MojoExecutionException
Build step 'Conditional step (single)' marked build as failure
Recording test results
TestNG Reports Processing: START
Looking for TestNG results report in workspace using pattern: **/testng-results.xml
testng-results.xml was last modified before this build started. Ignoring it.
testng-results.xml was last modified before this build started. Ignoring it.
testng-results.xml was last modified before this build started. Ignoring it.
testng-results.xml was last modified before this build started. Ignoring it.
testng-results.xml was last modified before this build started. Ignoring it.
testng-results.xml was last modified before this build started. Ignoring it.
testng-results.xml was last modified before this build started. Ignoring it.
testng-results.xml was last modified before this build started. Ignoring it.
testng-results.xml was last modified before this build started. Ignoring it.
testng-results.xml was last modified before this build started. Ignoring it.
testng-results.xml was last modified before this build started. Ignoring it.
testng-results.xml was last modified before this build started. Ignoring it.
Saving reports...
Processing '/x1/jenkins/jenkins-home/jobs/brooklyn-library-master-docker/builds/182/testng/testng-results-1.xml'
Processing '/x1/jenkins/jenkins-home/jobs/brooklyn-library-master-docker/builds/182/testng/testng-results-10.xml'
Processing '/x1/jenkins/jenkins-home/jobs/brooklyn-library-master-docker/builds/182/testng/testng-results-11.xml'
Processing '/x1/jenkins/jenkins-home/jobs/brooklyn-library-master-docker/builds/182/testng/testng-results-2.xml'
Processing '/x1/jenkins/jenkins-home/jobs/brooklyn-library-master-docker/builds/182/testng/testng-results-3.xml'
Processing '/x1/jenkins/jenkins-home/jobs/brooklyn-library-master-docker/builds/182/testng/testng-results-4.xml'
Processing '/x1/jenkins/jenkins-home/jobs/brooklyn-library-master-docker/builds/182/testng/testng-results-5.xml'
Processing '/x1/jenkins/jenkins-home/jobs/brooklyn-library-master-docker/builds/182/testng/testng-results-6.xml'
Processing '/x1/jenkins/jenkins-home/jobs/brooklyn-library-master-docker/builds/182/testng/testng-results-7.xml'
Processing '/x1/jenkins/jenkins-home/jobs/brooklyn-library-master-docker/builds/182/testng/testng-results-8.xml'
Processing '/x1/jenkins/jenkins-home/jobs/brooklyn-library-master-docker/builds/182/testng/testng-results-9.xml'
Processing '/x1/jenkins/jenkins-home/jobs/brooklyn-library-master-docker/builds/182/testng/testng-results.xml'
TestNG Reports Processing: FINISH