OSDir


[Date Prev][Date Next][Thread Prev][Thread Next][Date Index][Thread Index]

Build failed in Jenkins: brooklyn-master-build-docker #348


See <https://builds.apache.org/job/brooklyn-master-build-docker/348/display/redirect>

------------------------------------------
[...truncated 4.99 MB...]
2018-04-11 14:38:39,696 INFO  - Docker Host StubHostImpl{id=hfz6ps7qyb}: member SshMachineLocation[StubContainerLocation:q7b7:null@1.2.3.4/1.2.3.4:22(id=q7b78d1n0m)] released
[GC (Allocation Failure)  241299K->64686K(748032K), 0.0296034 secs]
2018-04-11 14:38:39,757 WARN  - Use of deprecated ConfigKey group.members.delegate in DynamicGroupImpl{id=mde1mh9y5s} (as of 0.9.0)
2018-04-11 14:38:39,767 WARN  nAqOpiQx-[o8az1gbkxd,blmimnzu7i,ucouy3w4k2,l63hjwoc0l,cocoxqnk9q] Deprecated use of unmanaged location (SshMachineLocation[StubContainerLocation:fai0:null@1.2.3.4/1.2.3.4:22(id=fai0i0aknh)]); will be managed automatically now but not supported in future versions
2018-04-11 14:38:39,769 INFO  nAqOpiQx-[o8az1gbkxd,blmimnzu7i,ucouy3w4k2,l63hjwoc0l,cocoxqnk9q] Starting entity StubContainerImpl{id=cocoxqnk9q} at [SshMachineLocation[localhost:null@c3490f7b05ed/172.17.0.3:22(id=spwr57zsv5)]]
2018-04-11 14:38:39,772 INFO  - Docker Host StubHostImpl{id=ucouy3w4k2}: member SshMachineLocation[StubContainerLocation:fai0:null@1.2.3.4/1.2.3.4:22(id=fai0i0aknh)] released
2018-04-11 14:38:39,788 WARN  - Use of deprecated ConfigKey group.members.delegate in DynamicGroupImpl{id=djzo463qdk} (as of 0.9.0)
2018-04-11 14:38:39,791 WARN  nl7GXwwu-[s9753vpaau,e217xs0dym,j9x7fvcdfk,vw6b69jys8,yy4lb8krdl] Deprecated use of unmanaged location (SshMachineLocation[StubContainerLocation:o8c3:null@1.2.3.4/1.2.3.4:22(id=o8c3akkxmm)]); will be managed automatically now but not supported in future versions
2018-04-11 14:38:39,793 INFO  nl7GXwwu-[s9753vpaau,e217xs0dym,j9x7fvcdfk,vw6b69jys8,yy4lb8krdl] Starting entity StubContainerImpl{id=yy4lb8krdl} at [SshMachineLocation[localhost:null@c3490f7b05ed/172.17.0.3:22(id=ahimqqe6oy)]]
2018-04-11 14:38:39,795 INFO  - Docker Host StubHostImpl{id=j9x7fvcdfk}: member SshMachineLocation[StubContainerLocation:o8c3:null@1.2.3.4/1.2.3.4:22(id=o8c3akkxmm)] released
2018-04-11 14:38:39,816 WARN  - Use of deprecated ConfigKey group.members.delegate in DynamicGroupImpl{id=l469iezt97} (as of 0.9.0)
2018-04-11 14:38:39,823 WARN  eWlVzl4V-[cba9ckogo3,kcptbb1c5v,bvwnst6njh,nf4t453yeq,ywon8v29ze] Deprecated use of unmanaged location (SshMachineLocation[StubContainerLocation:oefr:null@1.2.3.4/1.2.3.4:22(id=oefr5lwost)]); will be managed automatically now but not supported in future versions
2018-04-11 14:38:39,825 INFO  eWlVzl4V-[cba9ckogo3,kcptbb1c5v,bvwnst6njh,nf4t453yeq,ywon8v29ze] Starting entity StubContainerImpl{id=ywon8v29ze} at [SshMachineLocation[localhost:null@c3490f7b05ed/172.17.0.3:22(id=leoy1osgjv)]]
2018-04-11 14:38:39,827 INFO  - Docker Host StubHostImpl{id=bvwnst6njh}: member SshMachineLocation[StubContainerLocation:oefr:null@1.2.3.4/1.2.3.4:22(id=oefr5lwost)] released
2018-04-11 14:38:39,834 WARN  - Error processing subscriptions to LSM.publish(StubContainerImpl{id=ywon8v29ze}.Sensor: service.state (org.apache.brooklyn.core.entity.lifecycle.Lifecycle)=stopping @ 1523457519832): java.lang.IllegalStateException: Entity DelegateEntityImpl{id=dyd4w7x146} is no longer managed, when trying to publish Sensor: service.state (org.apache.brooklyn.core.entity.lifecycle.Lifecycle) stopping
java.lang.IllegalStateException: Entity DelegateEntityImpl{id=dyd4w7x146} is no longer managed, when trying to publish Sensor: service.state (org.apache.brooklyn.core.entity.lifecycle.Lifecycle) stopping
	at org.apache.brooklyn.core.entity.AbstractEntity$BasicSensorSupport.emitInternal(AbstractEntity.java:1079) ~[brooklyn-core-1.0.0-SNAPSHOT.jar:1.0.0-SNAPSHOT]
2018-04-11 14:38:39,839 WARN  - Use of deprecated ConfigKey group.members.delegate in DynamicGroupImpl{id=agtsw39m2r} (as of 0.9.0)
2018-04-11 14:38:39,844 WARN  - Setting StubInfrastructureImpl{id=cba9ckogo3} on-fire due to problems when expected running, up=false, not-up-indicators: {service-lifecycle-indicators-from-children-and-members=DynamicGroupImpl{id=l469iezt97} is not up}
2018-04-11 14:38:39,853 WARN  s2lENSbh-[ewo83j6q04,a6iot6o0ca,mbmm0masuy,i8wr735qcu,c0fxnqtwrs] Deprecated use of unmanaged location (SshMachineLocation[StubContainerLocation:s544:null@1.2.3.4/1.2.3.4:22(id=s544crfxvm)]); will be managed automatically now but not supported in future versions
2018-04-11 14:38:39,861 INFO  s2lENSbh-[ewo83j6q04,a6iot6o0ca,mbmm0masuy,i8wr735qcu,c0fxnqtwrs] Starting entity StubContainerImpl{id=c0fxnqtwrs} at [SshMachineLocation[localhost:null@c3490f7b05ed/172.17.0.3:22(id=cawlm0uyiv)]]
2018-04-11 14:38:39,866 INFO  - Docker Host StubHostImpl{id=mbmm0masuy}: member SshMachineLocation[StubContainerLocation:s544:null@1.2.3.4/1.2.3.4:22(id=s544crfxvm)] released
2018-04-11 14:38:39,879 WARN  - Use of deprecated ConfigKey group.members.delegate in DynamicGroupImpl{id=snxdpt60t1} (as of 0.9.0)
2018-04-11 14:38:39,897 WARN  vvWu6f5X-[fyeninxqy4,fd5tt6z6yd,k6qpdjffb1,h3ukjicuhw,qvn6zfh9d9] Deprecated use of unmanaged location (SshMachineLocation[StubContainerLocation:fsq0:null@1.2.3.4/1.2.3.4:22(id=fsq0vpz507)]); will be managed automatically now but not supported in future versions
2018-04-11 14:38:39,899 INFO  vvWu6f5X-[fyeninxqy4,fd5tt6z6yd,k6qpdjffb1,h3ukjicuhw,qvn6zfh9d9] Starting entity StubContainerImpl{id=qvn6zfh9d9} at [SshMachineLocation[localhost:null@c3490f7b05ed/172.17.0.3:22(id=f98jzeizl1)]]
2018-04-11 14:38:39,904 INFO  - Docker Host StubHostImpl{id=k6qpdjffb1}: member SshMachineLocation[StubContainerLocation:fsq0:null@1.2.3.4/1.2.3.4:22(id=fsq0vpz507)] released
2018-04-11 14:38:39,915 WARN  - Setting StubInfrastructureImpl{id=fyeninxqy4} on-fire due to problems when expected running, up=false, not-up-indicators: {}
2018-04-11 14:38:39,921 WARN  - Use of deprecated ConfigKey group.members.delegate in DynamicGroupImpl{id=krhmtma5ta} (as of 0.9.0)
2018-04-11 14:38:39,932 WARN  APEd4xf5-[j99229abfg,s5j8wknu3d,v07djrqgtc,lyujrft8lj,nho5wqrlvx] Deprecated use of unmanaged location (SshMachineLocation[StubContainerLocation:xkkz:null@1.2.3.4/1.2.3.4:22(id=xkkzz13bvy)]); will be managed automatically now but not supported in future versions
2018-04-11 14:38:39,933 INFO  APEd4xf5-[j99229abfg,s5j8wknu3d,v07djrqgtc,lyujrft8lj,nho5wqrlvx] Starting entity StubContainerImpl{id=nho5wqrlvx} at [SshMachineLocation[localhost:null@c3490f7b05ed/172.17.0.3:22(id=dba1jskczk)]]
2018-04-11 14:38:39,936 INFO  - Docker Host StubHostImpl{id=v07djrqgtc}: member SshMachineLocation[StubContainerLocation:xkkz:null@1.2.3.4/1.2.3.4:22(id=xkkzz13bvy)] released
2018-04-11 14:38:39,940 WARN  - Error processing subscriptions to LSM.publish(StubContainerImpl{id=nho5wqrlvx}.Sensor: service.isUp (java.lang.Boolean)=false @ 1523457519937): java.lang.IllegalStateException: Entity DelegateEntityImpl{id=tkif4tcdot} is no longer managed, when trying to publish Sensor: service.isUp (java.lang.Boolean) false
java.lang.IllegalStateException: Entity DelegateEntityImpl{id=tkif4tcdot} is no longer managed, when trying to publish Sensor: service.isUp (java.lang.Boolean) false
	at org.apache.brooklyn.core.entity.AbstractEntity$BasicSensorSupport.emitInternal(AbstractEntity.java:1079) ~[brooklyn-core-1.0.0-SNAPSHOT.jar:1.0.0-SNAPSHOT]
2018-04-11 14:38:39,941 WARN  - Error processing subscriptions to LSM.publish(StubContainerImpl{id=nho5wqrlvx}.Sensor: service.state.expected (org.apache.brooklyn.core.entity.lifecycle.Lifecycle$Transition)=stopped @ 1523457519938 / Wed Apr 11 14:38:39 UTC 2018 @ 1523457519938): java.lang.IllegalStateException: Entity DelegateEntityImpl{id=tkif4tcdot} is no longer managed, when trying to publish Sensor: service.state.expected (org.apache.brooklyn.core.entity.lifecycle.Lifecycle$Transition) stopped @ 1523457519938 / Wed Apr 11 14:38:39 UTC 2018
java.lang.IllegalStateException: Entity DelegateEntityImpl{id=tkif4tcdot} is no longer managed, when trying to publish Sensor: service.state.expected (org.apache.brooklyn.core.entity.lifecycle.Lifecycle$Transition) stopped @ 1523457519938 / Wed Apr 11 14:38:39 UTC 2018
	at org.apache.brooklyn.core.entity.AbstractEntity$BasicSensorSupport.emitInternal(AbstractEntity.java:1079) ~[brooklyn-core-1.0.0-SNAPSHOT.jar:1.0.0-SNAPSHOT]
2018-04-11 14:38:39,941 INFO  - TESTNG PASSED: "Surefire test" - org.apache.brooklyn.core.location.dynamic.clocker.ClockerDynamicLocationPatternRebindTest.testRebind() finished in 10990 ms
2018-04-11 14:38:39,941 INFO  - TESTNG INVOKING CONFIGURATION: "Surefire test" - @AfterMethod org.apache.brooklyn.core.mgmt.rebind.RebindTestFixture.tearDown()
2018-04-11 14:38:40,001 INFO  xOEcXzYM-[j99229abfg] Stopping application StubInfrastructureImpl{id=j99229abfg}
2018-04-11 14:38:40,056 INFO  RZkBjZhu-[l662fuas0x] Stopping application StubInfrastructureImpl{id=l662fuas0x}
2018-04-11 14:38:40,063 INFO  Ns3cTYUU-[rk0mk4uyl8] Stopping application StubInfrastructureImpl{id=rk0mk4uyl8}
2018-04-11 14:38:40,065 INFO  z0AmzxQI-[o8az1gbkxd] Stopping application StubInfrastructureImpl{id=o8az1gbkxd}
2018-04-11 14:38:40,092 INFO  KVoHVEXK-[fyeninxqy4] Stopping application StubInfrastructureImpl{id=fyeninxqy4}
2018-04-11 14:38:40,093 INFO  kusWeoqC-[xonnf2rfam] Stopping application StubInfrastructureImpl{id=xonnf2rfam}
2018-04-11 14:38:40,100 INFO  UmHgfWJR-[s9753vpaau] Stopping application StubInfrastructureImpl{id=s9753vpaau}
2018-04-11 14:38:40,100 INFO  xR5voP6I-[cba9ckogo3] Stopping application StubInfrastructureImpl{id=cba9ckogo3}
2018-04-11 14:38:40,102 INFO  N8Qoolxi-[ewo83j6q04] Stopping application StubInfrastructureImpl{id=ewo83j6q04}
2018-04-11 14:38:40,119 INFO  q1Vi7md3-[kuojqkxfiq] Stopping application StubInfrastructureImpl{id=kuojqkxfiq}
2018-04-11 14:38:40,121 INFO  z0AmzxQI-[o8az1gbkxd] Stopped application StubInfrastructureImpl{id=o8az1gbkxd}
2018-04-11 14:38:40,121 INFO  Ns3cTYUU-[rk0mk4uyl8] Stopped application StubInfrastructureImpl{id=rk0mk4uyl8}
2018-04-11 14:38:40,125 INFO  KVoHVEXK-[fyeninxqy4] Stopped application StubInfrastructureImpl{id=fyeninxqy4}
2018-04-11 14:38:40,128 INFO  xOEcXzYM-[j99229abfg] Stopped application StubInfrastructureImpl{id=j99229abfg}
2018-04-11 14:38:40,131 INFO  RZkBjZhu-[l662fuas0x] Stopped application StubInfrastructureImpl{id=l662fuas0x}
2018-04-11 14:38:40,134 INFO  N8Qoolxi-[ewo83j6q04] Stopped application StubInfrastructureImpl{id=ewo83j6q04}
2018-04-11 14:38:40,134 INFO  kusWeoqC-[xonnf2rfam] Stopped application StubInfrastructureImpl{id=xonnf2rfam}
2018-04-11 14:38:40,134 INFO  xR5voP6I-[cba9ckogo3] Stopped application StubInfrastructureImpl{id=cba9ckogo3}
2018-04-11 14:38:40,147 INFO  q1Vi7md3-[kuojqkxfiq] Stopped application StubInfrastructureImpl{id=kuojqkxfiq}
2018-04-11 14:38:40,147 INFO  UmHgfWJR-[s9753vpaau] Stopped application StubInfrastructureImpl{id=s9753vpaau}
2018-04-11 14:38:40,152 WARN  - Error notifying listener of itemAdded(StubInfrastructureImpl{id=kuojqkxfiq})
java.lang.IllegalStateException: Entity DynamicMultiGroupImpl{id=ymg68kh3tw} is no longer managed; execution context not available
	at org.apache.brooklyn.core.mgmt.internal.NonDeploymentManagementContext.getExecutionContext(NonDeploymentManagementContext.java:282) ~[brooklyn-core-1.0.0-SNAPSHOT.jar:1.0.0-SNAPSHOT]
2018-04-11 14:38:40,298 INFO  WC6NN6mn-[s9753vpaau] Stopping application StubInfrastructureImpl{id=s9753vpaau}
2018-04-11 14:38:40,309 INFO  VPyDQp7I-[l662fuas0x] Stopping application StubInfrastructureImpl{id=l662fuas0x}
2018-04-11 14:38:40,316 INFO  fllLPYgx-[ewo83j6q04] Stopping application StubInfrastructureImpl{id=ewo83j6q04}
2018-04-11 14:38:40,318 INFO  Ygs5ttuT-[kuojqkxfiq] Stopping application StubInfrastructureImpl{id=kuojqkxfiq}
2018-04-11 14:38:40,320 INFO  u20JrjEs-[cba9ckogo3] Stopping application StubInfrastructureImpl{id=cba9ckogo3}
2018-04-11 14:38:40,357 INFO  oBZ2DHLB-[j99229abfg] Stopping application StubInfrastructureImpl{id=j99229abfg}
2018-04-11 14:38:40,362 INFO  QzhYexrA-[rk0mk4uyl8] Stopping application StubInfrastructureImpl{id=rk0mk4uyl8}
2018-04-11 14:38:40,363 INFO  HGEHAVMq-[xonnf2rfam] Stopping application StubInfrastructureImpl{id=xonnf2rfam}
2018-04-11 14:38:40,367 INFO  fllLPYgx-[ewo83j6q04] Stopped application StubInfrastructureImpl{id=ewo83j6q04}
2018-04-11 14:38:40,368 INFO  VPyDQp7I-[l662fuas0x] Stopped application StubInfrastructureImpl{id=l662fuas0x}
2018-04-11 14:38:40,369 INFO  t83JjPhw-[o8az1gbkxd] Stopping application StubInfrastructureImpl{id=o8az1gbkxd}
2018-04-11 14:38:40,374 INFO  fooe6SC1-[fyeninxqy4] Stopping application StubInfrastructureImpl{id=fyeninxqy4}
2018-04-11 14:38:40,375 INFO  WC6NN6mn-[s9753vpaau] Stopped application StubInfrastructureImpl{id=s9753vpaau}
2018-04-11 14:38:40,375 INFO  Ygs5ttuT-[kuojqkxfiq] Stopped application StubInfrastructureImpl{id=kuojqkxfiq}
2018-04-11 14:38:40,381 INFO  u20JrjEs-[cba9ckogo3] Stopped application StubInfrastructureImpl{id=cba9ckogo3}
2018-04-11 14:38:40,386 INFO  oBZ2DHLB-[j99229abfg] Stopped application StubInfrastructureImpl{id=j99229abfg}
2018-04-11 14:38:40,387 INFO  fooe6SC1-[fyeninxqy4] Stopped application StubInfrastructureImpl{id=fyeninxqy4}
2018-04-11 14:38:40,386 INFO  t83JjPhw-[o8az1gbkxd] Stopped application StubInfrastructureImpl{id=o8az1gbkxd}
2018-04-11 14:38:40,390 INFO  HGEHAVMq-[xonnf2rfam] Stopped application StubInfrastructureImpl{id=xonnf2rfam}
2018-04-11 14:38:40,397 INFO  QzhYexrA-[rk0mk4uyl8] Stopped application StubInfrastructureImpl{id=rk0mk4uyl8}
2018-04-11 14:38:43,447 INFO  - TESTNG PASSED CONFIGURATION: "Surefire test" - @AfterMethod org.apache.brooklyn.core.mgmt.rebind.RebindTestFixture.tearDown() finished in 3506 ms
2018-04-11 14:38:43,552 INFO  - TESTNG 
===============================================
    Surefire test
    Tests run: 234, Failures: 1, Skips: 0
===============================================
[GC (Allocation Failure)  248494K->67617K(746496K), 0.0611387 secs]
Tests run: 234, Failures: 1, Errors: 0, Skipped: 0, Time elapsed: 99.196 sec <<< FAILURE! - in TestSuite
testRebindWhileProvisioning(org.apache.brooklyn.entity.software.base.SoftwareProcessRebindNotRunningEntityTest)  Time elapsed: 0.051 sec  <<< FAILURE!
java.lang.AssertionError: entity=VanillaSoftwareProcessImpl{id=uyhmyj5qgy}; attribute=Sensor: service.state (org.apache.brooklyn.core.entity.lifecycle.Lifecycle) expected [starting] but found [created]
	at org.apache.brooklyn.entity.software.base.SoftwareProcessRebindNotRunningEntityTest.testRebindWhileProvisioning(SoftwareProcessRebindNotRunningEntityTest.java:254)


Results :

Failed tests: 
org.apache.brooklyn.entity.software.base.SoftwareProcessRebindNotRunningEntityTest.testRebindWhileProvisioning(org.apache.brooklyn.entity.software.base.SoftwareProcessRebindNotRunningEntityTest)
  Run 1: PASS
  Run 2: SoftwareProcessRebindNotRunningEntityTest.testRebindWhileProvisioning:254 entity=VanillaSoftwareProcessImpl{id=uyhmyj5qgy}; attribute=Sensor: service.state (org.apache.brooklyn.core.entity.lifecycle.Lifecycle) expected [starting] but found [created]
  Run 3: PASS


Tests run: 232, Failures: 1, Errors: 0, Skipped: 0

[INFO] ------------------------------------------------------------------------
[INFO] Reactor Summary:
[INFO] 
[INFO] Brooklyn REST JavaScript Web GUI ................... SUCCESS [ 40.003 s]
[INFO] Brooklyn Server Root ............................... SUCCESS [  0.226 s]
[INFO] Brooklyn Parent Project ............................ SUCCESS [  2.938 s]
[INFO] Brooklyn Test Support Utilities .................... SUCCESS [  4.930 s]
[INFO] Brooklyn Logback Includable Configuration .......... SUCCESS [  0.464 s]
[INFO] Brooklyn Common Utilities .......................... SUCCESS [ 26.659 s]
[INFO] Brooklyn API ....................................... SUCCESS [  2.518 s]
[INFO] CAMP Server Parent Project ......................... SUCCESS [  0.245 s]
[INFO] CAMP Base .......................................... SUCCESS [  3.785 s]
[INFO] Brooklyn Test Support .............................. SUCCESS [  1.775 s]
[INFO] Brooklyn REST Swagger Apidoc Utilities ............. SUCCESS [  1.311 s]
[INFO] Brooklyn Logback Configuration ..................... SUCCESS [  0.227 s]
[INFO] CAMP Server ........................................ SUCCESS [  6.535 s]
[INFO] Brooklyn Felix Runtime ............................. SUCCESS [  3.205 s]
[INFO] Brooklyn Groovy Utilities .......................... SUCCESS [  2.701 s]
[INFO] Brooklyn Core ...................................... SUCCESS [04:56 min]
[INFO] Brooklyn Policies .................................. SUCCESS [ 44.356 s]
[INFO] Brooklyn WinRM Software Entities ................... SUCCESS [ 13.878 s]
[INFO] Brooklyn Secure JMXMP Agent ........................ SUCCESS [ 10.381 s]
[INFO] Brooklyn JMX RMI Agent ............................. SUCCESS [  0.487 s]
[INFO] Brooklyn Jclouds Location Targets .................. SUCCESS [ 46.197 s]
[INFO] Brooklyn Software Base ............................. FAILURE [01:50 min]
[INFO] Brooklyn CAMP ...................................... SKIPPED
[INFO] Brooklyn Launcher Common ........................... SKIPPED
[INFO] Brooklyn REST API .................................. SKIPPED
[INFO] Brooklyn REST Resources ............................ SKIPPED
[INFO] Brooklyn REST Server ............................... SKIPPED
[INFO] Brooklyn Launcher .................................. SKIPPED
[INFO] Brooklyn Container Location Targets ................ SKIPPED
[INFO] Brooklyn Command Line Interface .................... SKIPPED
[INFO] Brooklyn Test Framework ............................ SKIPPED
[INFO] Brooklyn OSGi init ................................. SKIPPED
[INFO] Brooklyn OSGi start ................................ SKIPPED
[INFO] Brooklyn Karaf ..................................... SKIPPED
[INFO] Jetty config fragment .............................. SKIPPED
[INFO] Apache Http Component extension .................... SKIPPED
[INFO] Brooklyn Karaf Features ............................ SKIPPED
[INFO] Brooklyn Karaf Shell Commands ...................... SKIPPED
[INFO] Brooklyn Library Root .............................. SKIPPED
[INFO] Brooklyn CM Chef ................................... SKIPPED
[INFO] Brooklyn CM SaltStack .............................. SKIPPED
[INFO] Brooklyn CM Ansible ................................ SKIPPED
[INFO] Brooklyn CM Integration Root ....................... SKIPPED
[INFO] Brooklyn Network Software Entities ................. SKIPPED
[INFO] Brooklyn OSGi Software Entities .................... SKIPPED
[INFO] Brooklyn Database Software Entities ................ SKIPPED
[INFO] Brooklyn Web App Software Entities ................. SKIPPED
[INFO] Brooklyn Messaging Software Entities ............... SKIPPED
[INFO] Brooklyn NoSQL Data Store Software Entities ........ SKIPPED
[INFO] Brooklyn Monitoring Software Entities .............. SKIPPED
[INFO] Brooklyn Web App Software Entities ................. SKIPPED
[INFO] Brooklyn QA ........................................ SKIPPED
[INFO] Brooklyn Examples Aggregator Project ............... SKIPPED
[INFO] Brooklyn Examples Aggregator Project - Webapps ..... SKIPPED
[INFO] hello-world-webapp Maven Webapp .................... SKIPPED
[INFO] hello-world-sql-webapp Maven Webapp ................ SKIPPED
[INFO] Brooklyn Simple Web Cluster Example ................ SKIPPED
[INFO] Brooklyn Library Karaf integration ................. SKIPPED
[INFO] Brooklyn Library Catalog ........................... SKIPPED
[INFO] Brooklyn Library Karaf Features .................... SKIPPED
[INFO] Brooklyn Client .................................... SKIPPED
[INFO] Brooklyn Client Command Line Interface ............. SKIPPED
[INFO] Brooklyn REST java Client .......................... SKIPPED
[INFO] Brooklyn Downstream Project Parent ................. SKIPPED
[INFO] Brooklyn Dist Root ................................. SKIPPED
[INFO] Brooklyn All Things ................................ SKIPPED
[INFO] Brooklyn Distribution .............................. SKIPPED
[INFO] Brooklyn Karaf Distribution Parent ................. SKIPPED
[INFO] Brooklyn Karaf Server Configuration ................ SKIPPED
[INFO] Brooklyn Dist Karaf Features ....................... SKIPPED
[INFO] Brooklyn Karaf Distribution ........................ SKIPPED
[INFO] Brooklyn Karaf pax-exam itest ...................... SKIPPED
[INFO] Brooklyn Vagrant Getting Started Environment ....... SKIPPED
[INFO] Brooklyn Quick-Start Project Archetype ............. SKIPPED
[INFO] Brooklyn Shared Package Files ...................... SKIPPED
[INFO] Brooklyn RPM Package ............................... SKIPPED
[INFO] Brooklyn DEB Package ............................... SKIPPED
[INFO] Brooklyn Root ...................................... SKIPPED
[INFO] ------------------------------------------------------------------------
[INFO] BUILD FAILURE
[INFO] ------------------------------------------------------------------------
[INFO] Total time: 10:26 min
[INFO] Finished at: 2018-04-11T14:38:44Z
[INFO] Final Memory: 120M/957M
[INFO] ------------------------------------------------------------------------
[ERROR] Failed to execute goal org.apache.maven.plugins:maven-surefire-plugin:2.19.1:test (default-test) on project brooklyn-software-base: There are test failures.
[ERROR] 
[ERROR] Please refer to /usr/build/brooklyn-server/software/base/target/surefire-reports for the individual test results.
[ERROR] -> [Help 1]
[ERROR] 
[ERROR] To see the full stack trace of the errors, re-run Maven with the -e switch.
[ERROR] Re-run Maven using the -X switch to enable full debug logging.
[ERROR] 
[ERROR] For more information about the errors and possible solutions, please read the following articles:
[ERROR] [Help 1] http://cwiki.apache.org/confluence/display/MAVEN/MojoFailureException
[ERROR] 
[ERROR] After correcting the problems, you can resume the build with the command
[ERROR]   mvn <goals> -rf :brooklyn-software-base
Build step 'Execute shell' marked build as failure
Recording test results
TestNG Reports Processing: START
Looking for TestNG results report in workspace using pattern: **/testng-results.xml
testng-results.xml was last modified before this build started. Ignoring it.
testng-results.xml was last modified before this build started. Ignoring it.
testng-results.xml was last modified before this build started. Ignoring it.
testng-results.xml was last modified before this build started. Ignoring it.
testng-results.xml was last modified before this build started. Ignoring it.
testng-results.xml was last modified before this build started. Ignoring it.
testng-results.xml was last modified before this build started. Ignoring it.
testng-results.xml was last modified before this build started. Ignoring it.
testng-results.xml was last modified before this build started. Ignoring it.
testng-results.xml was last modified before this build started. Ignoring it.
testng-results.xml was last modified before this build started. Ignoring it.
testng-results.xml was last modified before this build started. Ignoring it.
testng-results.xml was last modified before this build started. Ignoring it.
testng-results.xml was last modified before this build started. Ignoring it.
testng-results.xml was last modified before this build started. Ignoring it.
testng-results.xml was last modified before this build started. Ignoring it.
testng-results.xml was last modified before this build started. Ignoring it.
testng-results.xml was last modified before this build started. Ignoring it.
testng-results.xml was last modified before this build started. Ignoring it.
testng-results.xml was last modified before this build started. Ignoring it.
testng-results.xml was last modified before this build started. Ignoring it.
testng-results.xml was last modified before this build started. Ignoring it.
testng-results.xml was last modified before this build started. Ignoring it.
testng-results.xml was last modified before this build started. Ignoring it.
Saving reports...
Processing '/x1/jenkins/jenkins-home/jobs/brooklyn-master-build-docker/builds/348/testng/testng-results-1.xml'
Processing '/x1/jenkins/jenkins-home/jobs/brooklyn-master-build-docker/builds/348/testng/testng-results-10.xml'
Processing '/x1/jenkins/jenkins-home/jobs/brooklyn-master-build-docker/builds/348/testng/testng-results-2.xml'
Processing '/x1/jenkins/jenkins-home/jobs/brooklyn-master-build-docker/builds/348/testng/testng-results-3.xml'
Processing '/x1/jenkins/jenkins-home/jobs/brooklyn-master-build-docker/builds/348/testng/testng-results-4.xml'
Processing '/x1/jenkins/jenkins-home/jobs/brooklyn-master-build-docker/builds/348/testng/testng-results-5.xml'
Processing '/x1/jenkins/jenkins-home/jobs/brooklyn-master-build-docker/builds/348/testng/testng-results-6.xml'
Processing '/x1/jenkins/jenkins-home/jobs/brooklyn-master-build-docker/builds/348/testng/testng-results-7.xml'
Processing '/x1/jenkins/jenkins-home/jobs/brooklyn-master-build-docker/builds/348/testng/testng-results-8.xml'
Processing '/x1/jenkins/jenkins-home/jobs/brooklyn-master-build-docker/builds/348/testng/testng-results-9.xml'
Processing '/x1/jenkins/jenkins-home/jobs/brooklyn-master-build-docker/builds/348/testng/testng-results.xml'
0.028490% of tests failed, which exceeded threshold of 0%. Marking build as UNSTABLE
TestNG Reports Processing: FINISH