OSDir

[Date Prev][Date Next][Thread Prev][Thread Next][Date Index][Thread Index]

Build failed in Jenkins: brooklyn-master-build-docker #392


See <https://builds.apache.org/job/brooklyn-master-build-docker/392/display/redirect?page=changes>

Changes:

[github] Fix issue in doap_Brooklyn.rdf

------------------------------------------
[...truncated 6.65 MB...]
2018-04-30 12:23:48,462 INFO  - TESTNG INVOKING: "Surefire test" - org.apache.brooklyn.core.location.AbstractLocationTest.testFieldSetFromFlagUsesDefault()
2018-04-30 12:23:48,462 INFO  - TESTNG PASSED: "Surefire test" - org.apache.brooklyn.core.location.AbstractLocationTest.testFieldSetFromFlagUsesDefault() finished in 0 ms
2018-04-30 12:23:48,463 INFO  - TESTNG INVOKING CONFIGURATION: "Surefire test" - @AfterMethod org.apache.brooklyn.core.location.AbstractLocationTest.tearDown()
2018-04-30 12:23:48,463 INFO  - TESTNG PASSED CONFIGURATION: "Surefire test" - @AfterMethod org.apache.brooklyn.core.location.AbstractLocationTest.tearDown() finished in 0 ms
2018-04-30 12:23:48,463 INFO  - TESTNG INVOKING CONFIGURATION: "Surefire test" - @BeforeMethod org.apache.brooklyn.core.location.AbstractLocationTest.setUp()
2018-04-30 12:23:48,463 INFO  - Added external config supplier named 'brooklyn-demo-sample': org.apache.brooklyn.core.config.external.InPlaceExternalConfigSupplier@685f49f2
2018-04-30 12:23:48,463 INFO  - TESTNG PASSED CONFIGURATION: "Surefire test" - @BeforeMethod org.apache.brooklyn.core.location.AbstractLocationTest.setUp() finished in 0 ms
2018-04-30 12:23:48,463 INFO  - TESTNG INVOKING: "Surefire test" - org.apache.brooklyn.core.location.AbstractLocationTest.testLocationTags()
2018-04-30 12:23:48,464 INFO  - TESTNG PASSED: "Surefire test" - org.apache.brooklyn.core.location.AbstractLocationTest.testLocationTags() finished in 1 ms
2018-04-30 12:23:48,464 INFO  - TESTNG INVOKING CONFIGURATION: "Surefire test" - @AfterMethod org.apache.brooklyn.core.location.AbstractLocationTest.tearDown()
2018-04-30 12:23:48,465 INFO  - TESTNG PASSED CONFIGURATION: "Surefire test" - @AfterMethod org.apache.brooklyn.core.location.AbstractLocationTest.tearDown() finished in 1 ms
2018-04-30 12:23:48,465 INFO  - TESTNG INVOKING CONFIGURATION: "Surefire test" - @BeforeMethod org.apache.brooklyn.core.location.AbstractLocationTest.setUp()
2018-04-30 12:23:48,465 INFO  - Added external config supplier named 'brooklyn-demo-sample': org.apache.brooklyn.core.config.external.InPlaceExternalConfigSupplier@14d1102f
2018-04-30 12:23:48,465 INFO  - TESTNG PASSED CONFIGURATION: "Surefire test" - @BeforeMethod org.apache.brooklyn.core.location.AbstractLocationTest.setUp() finished in 0 ms
2018-04-30 12:23:48,465 INFO  - TESTNG INVOKING: "Surefire test" - org.apache.brooklyn.core.location.AbstractLocationTest.testSettingParentLocation()
2018-04-30 12:23:48,467 INFO  - TESTNG PASSED: "Surefire test" - org.apache.brooklyn.core.location.AbstractLocationTest.testSettingParentLocation() finished in 2 ms
2018-04-30 12:23:48,467 INFO  - TESTNG INVOKING CONFIGURATION: "Surefire test" - @AfterMethod org.apache.brooklyn.core.location.AbstractLocationTest.tearDown()
2018-04-30 12:23:48,468 INFO  - TESTNG PASSED CONFIGURATION: "Surefire test" - @AfterMethod org.apache.brooklyn.core.location.AbstractLocationTest.tearDown() finished in 1 ms
2018-04-30 12:23:48,468 INFO  - TESTNG INVOKING CONFIGURATION: "Surefire test" - @BeforeMethod org.apache.brooklyn.core.location.LocationConfigTest.setUp()
2018-04-30 12:23:48,468 INFO  - Added external config supplier named 'brooklyn-demo-sample': org.apache.brooklyn.core.config.external.InPlaceExternalConfigSupplier@2f6e312c
2018-04-30 12:23:48,469 INFO  - TESTNG PASSED CONFIGURATION: "Surefire test" - @BeforeMethod org.apache.brooklyn.core.location.LocationConfigTest.setUp() finished in 1 ms
2018-04-30 12:23:48,469 INFO  - TESTNG INVOKING: "Surefire test" - org.apache.brooklyn.core.location.LocationConfigTest.testChildCanOverrideConfigUsingFlagName()
2018-04-30 12:23:48,470 WARN  - Deprecated use of unmanaged location (MyChildLocation{id=dc51cx0n36, name=MyChildLocation:dc51}); will be managed automatically now but not supported in future versions
2018-04-30 12:23:48,471 INFO  - local=ConfigBag[{mychildconfigflagname=overrideMyval, mychildlocation.myconfigwithflagname=overrideMyval}]
2018-04-30 12:23:48,471 INFO  - all=ConfigBag[{mychildconfigflagname=overrideMyval, mychildlocation.myconfigwithflagname=overrideMyval}]
2018-04-30 12:23:48,471 INFO  - TESTNG PASSED: "Surefire test" - org.apache.brooklyn.core.location.LocationConfigTest.testChildCanOverrideConfigUsingFlagName() finished in 2 ms
2018-04-30 12:23:48,471 INFO  - TESTNG INVOKING CONFIGURATION: "Surefire test" - @AfterMethod org.apache.brooklyn.core.location.LocationConfigTest.tearDown()
2018-04-30 12:23:48,471 INFO  - TESTNG PASSED CONFIGURATION: "Surefire test" - @AfterMethod org.apache.brooklyn.core.location.LocationConfigTest.tearDown() finished in 0 ms
2018-04-30 12:23:48,472 INFO  - TESTNG INVOKING CONFIGURATION: "Surefire test" - @BeforeMethod org.apache.brooklyn.core.location.LocationConfigTest.setUp()
2018-04-30 12:23:48,472 INFO  - Added external config supplier named 'brooklyn-demo-sample': org.apache.brooklyn.core.config.external.InPlaceExternalConfigSupplier@7ef31c26
2018-04-30 12:23:48,472 INFO  - TESTNG PASSED CONFIGURATION: "Surefire test" - @BeforeMethod org.apache.brooklyn.core.location.LocationConfigTest.setUp() finished in 0 ms
2018-04-30 12:23:48,472 INFO  - TESTNG INVOKING: "Surefire test" - org.apache.brooklyn.core.location.LocationConfigTest.testChildCanOverrideConfigUsingKeyName()
2018-04-30 12:23:48,473 WARN  - Deprecated use of unmanaged location (MyChildLocation{id=nld1ueyz4r, name=MyChildLocation:nld1}); will be managed automatically now but not supported in future versions
2018-04-30 12:23:48,473 INFO  - TESTNG PASSED: "Surefire test" - org.apache.brooklyn.core.location.LocationConfigTest.testChildCanOverrideConfigUsingKeyName() finished in 1 ms
2018-04-30 12:23:48,473 INFO  - TESTNG INVOKING CONFIGURATION: "Surefire test" - @AfterMethod org.apache.brooklyn.core.location.LocationConfigTest.tearDown()
2018-04-30 12:23:48,474 INFO  - TESTNG PASSED CONFIGURATION: "Surefire test" - @AfterMethod org.apache.brooklyn.core.location.LocationConfigTest.tearDown() finished in 1 ms
2018-04-30 12:23:48,474 INFO  - TESTNG INVOKING CONFIGURATION: "Surefire test" - @BeforeMethod org.apache.brooklyn.core.location.LocationConfigTest.setUp()
2018-04-30 12:23:48,474 INFO  - Added external config supplier named 'brooklyn-demo-sample': org.apache.brooklyn.core.config.external.InPlaceExternalConfigSupplier@766c7925
2018-04-30 12:23:48,474 INFO  - TESTNG PASSED CONFIGURATION: "Surefire test" - @BeforeMethod org.apache.brooklyn.core.location.LocationConfigTest.setUp() finished in 0 ms
2018-04-30 12:23:48,474 INFO  - TESTNG INVOKING: "Surefire test" - org.apache.brooklyn.core.location.LocationConfigTest.testChildConfigBagInheritsUnmatchedAtParent()
2018-04-30 12:23:48,475 WARN  - Deprecated use of unmanaged location (MyChildLocation{id=sffdosor1c, name=MyChildLocation:sffd}); will be managed automatically now but not supported in future versions
2018-04-30 12:23:48,475 INFO  - TESTNG PASSED: "Surefire test" - org.apache.brooklyn.core.location.LocationConfigTest.testChildConfigBagInheritsUnmatchedAtParent() finished in 1 ms
2018-04-30 12:23:48,475 INFO  - TESTNG INVOKING CONFIGURATION: "Surefire test" - @AfterMethod org.apache.brooklyn.core.location.LocationConfigTest.tearDown()
2018-04-30 12:23:48,476 INFO  - TESTNG PASSED CONFIGURATION: "Surefire test" - @AfterMethod org.apache.brooklyn.core.location.LocationConfigTest.tearDown() finished in 1 ms
2018-04-30 12:23:48,476 INFO  - TESTNG INVOKING CONFIGURATION: "Surefire test" - @BeforeMethod org.apache.brooklyn.core.location.LocationConfigTest.setUp()
2018-04-30 12:23:48,476 INFO  - Added external config supplier named 'brooklyn-demo-sample': org.apache.brooklyn.core.config.external.InPlaceExternalConfigSupplier@5ce5f027
2018-04-30 12:23:48,476 INFO  - TESTNG PASSED CONFIGURATION: "Surefire test" - @BeforeMethod org.apache.brooklyn.core.location.LocationConfigTest.setUp() finished in 0 ms
2018-04-30 12:23:48,476 INFO  - TESTNG INVOKING: "Surefire test" - org.apache.brooklyn.core.location.LocationConfigTest.testChildInheritsFromParent()
2018-04-30 12:23:48,477 WARN  - Deprecated use of unmanaged location (MyChildLocation{id=v5msop5ttk, name=MyChildLocation:v5ms}); will be managed automatically now but not supported in future versions
2018-04-30 12:23:48,477 INFO  - TESTNG PASSED: "Surefire test" - org.apache.brooklyn.core.location.LocationConfigTest.testChildInheritsFromParent() finished in 1 ms
2018-04-30 12:23:48,477 INFO  - TESTNG INVOKING CONFIGURATION: "Surefire test" - @AfterMethod org.apache.brooklyn.core.location.LocationConfigTest.tearDown()
2018-04-30 12:23:48,478 INFO  - TESTNG PASSED CONFIGURATION: "Surefire test" - @AfterMethod org.apache.brooklyn.core.location.LocationConfigTest.tearDown() finished in 1 ms
2018-04-30 12:23:48,478 INFO  - TESTNG INVOKING CONFIGURATION: "Surefire test" - @BeforeMethod org.apache.brooklyn.core.location.LocationConfigTest.setUp()
2018-04-30 12:23:48,478 INFO  - Added external config supplier named 'brooklyn-demo-sample': org.apache.brooklyn.core.config.external.InPlaceExternalConfigSupplier@5ea63595
2018-04-30 12:23:48,478 INFO  - TESTNG PASSED CONFIGURATION: "Surefire test" - @BeforeMethod org.apache.brooklyn.core.location.LocationConfigTest.setUp() finished in 0 ms
2018-04-30 12:23:48,478 INFO  - TESTNG INVOKING: "Surefire test" - org.apache.brooklyn.core.location.LocationConfigTest.testConfigBagContainsMatchesForConfigKeyName()
2018-04-30 12:23:48,479 INFO  - TESTNG PASSED: "Surefire test" - org.apache.brooklyn.core.location.LocationConfigTest.testConfigBagContainsMatchesForConfigKeyName() finished in 1 ms
2018-04-30 12:23:48,479 INFO  - TESTNG INVOKING CONFIGURATION: "Surefire test" - @AfterMethod org.apache.brooklyn.core.location.LocationConfigTest.tearDown()
2018-04-30 12:23:48,479 INFO  - TESTNG PASSED CONFIGURATION: "Surefire test" - @AfterMethod org.apache.brooklyn.core.location.LocationConfigTest.tearDown() finished in 0 ms
2018-04-30 12:23:48,479 INFO  - TESTNG INVOKING CONFIGURATION: "Surefire test" - @BeforeMethod org.apache.brooklyn.core.location.LocationConfigTest.setUp()
2018-04-30 12:23:48,479 INFO  - Added external config supplier named 'brooklyn-demo-sample': org.apache.brooklyn.core.config.external.InPlaceExternalConfigSupplier@63c6de9c
2018-04-30 12:23:48,480 INFO  - TESTNG PASSED CONFIGURATION: "Surefire test" - @BeforeMethod org.apache.brooklyn.core.location.LocationConfigTest.setUp() finished in 1 ms
2018-04-30 12:23:48,480 INFO  - TESTNG INVOKING: "Surefire test" - org.apache.brooklyn.core.location.LocationConfigTest.testConfigBagContainsMatchesForFlagName()
2018-04-30 12:23:48,480 INFO  - TESTNG PASSED: "Surefire test" - org.apache.brooklyn.core.location.LocationConfigTest.testConfigBagContainsMatchesForFlagName() finished in 0 ms
2018-04-30 12:23:48,480 INFO  - TESTNG INVOKING CONFIGURATION: "Surefire test" - @AfterMethod org.apache.brooklyn.core.location.LocationConfigTest.tearDown()
2018-04-30 12:23:48,480 INFO  - TESTNG PASSED CONFIGURATION: "Surefire test" - @AfterMethod org.apache.brooklyn.core.location.LocationConfigTest.tearDown() finished in 0 ms
2018-04-30 12:23:48,481 INFO  - TESTNG INVOKING CONFIGURATION: "Surefire test" - @BeforeMethod org.apache.brooklyn.core.location.LocationConfigTest.setUp()
2018-04-30 12:23:48,481 INFO  - Added external config supplier named 'brooklyn-demo-sample': org.apache.brooklyn.core.config.external.InPlaceExternalConfigSupplier@4bb17e28
2018-04-30 12:23:48,481 INFO  - TESTNG PASSED CONFIGURATION: "Surefire test" - @BeforeMethod org.apache.brooklyn.core.location.LocationConfigTest.setUp() finished in 0 ms
2018-04-30 12:23:48,481 INFO  - TESTNG INVOKING: "Surefire test" - org.apache.brooklyn.core.location.LocationConfigTest.testConfigBagContainsUnmatched()
2018-04-30 12:23:48,482 INFO  - TESTNG PASSED: "Surefire test" - org.apache.brooklyn.core.location.LocationConfigTest.testConfigBagContainsUnmatched() finished in 0 ms
2018-04-30 12:23:48,482 INFO  - TESTNG INVOKING CONFIGURATION: "Surefire test" - @AfterMethod org.apache.brooklyn.core.location.LocationConfigTest.tearDown()
2018-04-30 12:23:48,482 INFO  - TESTNG PASSED CONFIGURATION: "Surefire test" - @AfterMethod org.apache.brooklyn.core.location.LocationConfigTest.tearDown() finished in 0 ms
2018-04-30 12:23:48,482 INFO  - TESTNG INVOKING CONFIGURATION: "Surefire test" - @BeforeMethod org.apache.brooklyn.core.location.LocationConfigTest.setUp()
2018-04-30 12:23:48,482 INFO  - Added external config supplier named 'brooklyn-demo-sample': org.apache.brooklyn.core.config.external.InPlaceExternalConfigSupplier@2beec68c
2018-04-30 12:23:48,482 INFO  - TESTNG PASSED CONFIGURATION: "Surefire test" - @BeforeMethod org.apache.brooklyn.core.location.LocationConfigTest.setUp() finished in 0 ms
2018-04-30 12:23:48,482 INFO  - TESTNG INVOKING: "Surefire test" - org.apache.brooklyn.core.location.LocationConfigTest.testLocationCanOverrideConfigDefaultValue()
2018-04-30 12:23:48,484 INFO  - TESTNG PASSED: "Surefire test" - org.apache.brooklyn.core.location.LocationConfigTest.testLocationCanOverrideConfigDefaultValue() finished in 2 ms
2018-04-30 12:23:48,484 INFO  - TESTNG INVOKING CONFIGURATION: "Surefire test" - @AfterMethod org.apache.brooklyn.core.location.LocationConfigTest.tearDown()
2018-04-30 12:23:48,484 INFO  - TESTNG PASSED CONFIGURATION: "Surefire test" - @AfterMethod org.apache.brooklyn.core.location.LocationConfigTest.tearDown() finished in 0 ms
2018-04-30 12:23:48,485 INFO  - TESTNG INVOKING CONFIGURATION: "Surefire test" - @BeforeMethod org.apache.brooklyn.core.location.TestPortSupplierLocation.setUp()
2018-04-30 12:23:48,485 INFO  - Added external config supplier named 'brooklyn-demo-sample': org.apache.brooklyn.core.config.external.InPlaceExternalConfigSupplier@2453a5a2
2018-04-30 12:23:48,531 INFO  - TESTNG PASSED CONFIGURATION: "Surefire test" - @BeforeMethod org.apache.brooklyn.core.location.TestPortSupplierLocation.setUp() finished in 46 ms
2018-04-30 12:23:48,531 INFO  - TESTNG INVOKING: "Surefire test" - org.apache.brooklyn.core.location.TestPortSupplierLocation.testNullBeforeSetting()
2018-04-30 12:23:48,531 INFO  - TESTNG PASSED: "Surefire test" - org.apache.brooklyn.core.location.TestPortSupplierLocation.testNullBeforeSetting() finished in 0 ms
2018-04-30 12:23:48,532 INFO  - TESTNG INVOKING CONFIGURATION: "Surefire test" - @AfterMethod org.apache.brooklyn.core.test.BrooklynMgmtUnitTestSupport.tearDown()
2018-04-30 12:23:48,536 INFO  - TESTNG PASSED CONFIGURATION: "Surefire test" - @AfterMethod org.apache.brooklyn.core.test.BrooklynMgmtUnitTestSupport.tearDown() finished in 5 ms
2018-04-30 12:23:48,536 INFO  - TESTNG INVOKING CONFIGURATION: "Surefire test" - @BeforeMethod org.apache.brooklyn.core.location.TestPortSupplierLocation.setUp()
2018-04-30 12:23:48,537 INFO  - Added external config supplier named 'brooklyn-demo-sample': org.apache.brooklyn.core.config.external.InPlaceExternalConfigSupplier@20aa4995
2018-04-30 12:23:48,580 INFO  - TESTNG PASSED CONFIGURATION: "Surefire test" - @BeforeMethod org.apache.brooklyn.core.location.TestPortSupplierLocation.setUp() finished in 44 ms
2018-04-30 12:23:48,580 INFO  - TESTNG INVOKING: "Surefire test" - org.apache.brooklyn.core.location.TestPortSupplierLocation.testObtainsPort()
2018-04-30 12:23:48,583 INFO  - TESTNG PASSED: "Surefire test" - org.apache.brooklyn.core.location.TestPortSupplierLocation.testObtainsPort() finished in 3 ms
2018-04-30 12:23:48,583 INFO  - TESTNG INVOKING CONFIGURATION: "Surefire test" - @AfterMethod org.apache.brooklyn.core.test.BrooklynMgmtUnitTestSupport.tearDown()
2018-04-30 12:23:48,587 INFO  - TESTNG PASSED CONFIGURATION: "Surefire test" - @AfterMethod org.apache.brooklyn.core.test.BrooklynMgmtUnitTestSupport.tearDown() finished in 4 ms
2018-04-30 12:23:48,587 INFO  - TESTNG INVOKING CONFIGURATION: "Surefire test" - @BeforeMethod org.apache.brooklyn.core.location.TestPortSupplierLocation.setUp()
2018-04-30 12:23:48,588 INFO  - Added external config supplier named 'brooklyn-demo-sample': org.apache.brooklyn.core.config.external.InPlaceExternalConfigSupplier@241d6552
2018-04-30 12:23:48,631 INFO  - TESTNG PASSED CONFIGURATION: "Surefire test" - @BeforeMethod org.apache.brooklyn.core.location.TestPortSupplierLocation.setUp() finished in 44 ms
2018-04-30 12:23:48,631 INFO  - TESTNG INVOKING: "Surefire test" - org.apache.brooklyn.core.location.TestPortSupplierLocation.testRepeatedConvertAccessIncrements()
2018-04-30 12:23:48,634 INFO  - TESTNG PASSED: "Surefire test" - org.apache.brooklyn.core.location.TestPortSupplierLocation.testRepeatedConvertAccessIncrements() finished in 3 ms
2018-04-30 12:23:48,634 INFO  - TESTNG INVOKING CONFIGURATION: "Surefire test" - @AfterMethod org.apache.brooklyn.core.test.BrooklynMgmtUnitTestSupport.tearDown()
2018-04-30 12:23:48,638 INFO  - TESTNG PASSED CONFIGURATION: "Surefire test" - @AfterMethod org.apache.brooklyn.core.test.BrooklynMgmtUnitTestSupport.tearDown() finished in 4 ms
2018-04-30 12:23:48,638 INFO  - TESTNG INVOKING CONFIGURATION: "Surefire test" - @BeforeMethod org.apache.brooklyn.core.location.TestPortSupplierLocation.setUp()
2018-04-30 12:23:48,638 INFO  - Added external config supplier named 'brooklyn-demo-sample': org.apache.brooklyn.core.config.external.InPlaceExternalConfigSupplier@1fff3cb1
2018-04-30 12:23:48,682 INFO  - TESTNG PASSED CONFIGURATION: "Surefire test" - @BeforeMethod org.apache.brooklyn.core.location.TestPortSupplierLocation.setUp() finished in 44 ms
2018-04-30 12:23:48,682 INFO  - TESTNG INVOKING: "Surefire test" - org.apache.brooklyn.core.location.TestPortSupplierLocation.testSimulatedRestrictedPermitted()
2018-04-30 12:23:48,749 INFO  - TESTNG PASSED: "Surefire test" - org.apache.brooklyn.core.location.TestPortSupplierLocation.testSimulatedRestrictedPermitted() finished in 67 ms
2018-04-30 12:23:48,749 INFO  - TESTNG INVOKING CONFIGURATION: "Surefire test" - @AfterMethod org.apache.brooklyn.core.test.BrooklynMgmtUnitTestSupport.tearDown()
2018-04-30 12:23:48,754 INFO  - TESTNG PASSED CONFIGURATION: "Surefire test" - @AfterMethod org.apache.brooklyn.core.test.BrooklynMgmtUnitTestSupport.tearDown() finished in 5 ms
2018-04-30 12:23:49,036 INFO  - TESTNG 
===============================================
    Surefire test
    Tests run: 2316, Failures: 1, Skips: 0
===============================================
[GC (Allocation Failure)  467338K->282630K(741888K), 0.0393197 secs]
[GC (Allocation Failure)  455686K->278171K(742912K), 0.0144599 secs]
[GC (Allocation Failure)  452633K->278187K(742400K), 0.0096302 secs]
[GC (Allocation Failure)  452779K->278309K(743936K), 0.0064389 secs]
[GC (Allocation Failure)  454949K->278227K(743424K), 0.0165901 secs]
[GC (Allocation Failure)  454867K->278226K(746496K), 0.0199151 secs]
[GC (Allocation Failure)  458962K->278719K(744960K), 0.0167426 secs]
[GC (Allocation Failure)  459455K->281292K(750080K), 0.0170563 secs]
Tests run: 2316, Failures: 1, Errors: 0, Skipped: 0, Time elapsed: 206.571 sec <<< FAILURE! - in TestSuite
testCommandExecutedWithEnvironment(org.apache.brooklyn.entity.group.SshCommandMembershipTrackingPolicyTest)  Time elapsed: 0.04 sec  <<< FAILURE!
java.lang.AssertionError: Lists differ at element [0]: echo ignored != mkdir -p '/path/to/myexecutiondir' && cd '/path/to/myexecutiondir' && echo 'myval' expected [echo ignored] but found [mkdir -p '/path/to/myexecutiondir' && cd '/path/to/myexecutiondir' && echo 'myval']
	at org.apache.brooklyn.entity.group.SshCommandMembershipTrackingPolicyTest.testCommandExecutedWithEnvironment(SshCommandMembershipTrackingPolicyTest.java:90)

2018-04-30 12:23:52,499 INFO  - Brooklyn shutdown: stopping entities [TestEntityImpl{id=kkak8ddiz4}, TestEntityImpl{id=jn6coblz91}, BlockingEntityImpl{id=orrpwnyvy7}]

Results :

Failed tests: 
  SshCommandMembershipTrackingPolicyTest.testCommandExecutedWithEnvironment:90 Lists differ at element [0]: echo ignored != mkdir -p '/path/to/myexecutiondir' && cd '/path/to/myexecutiondir' && echo 'myval' expected [echo ignored] but found [mkdir -p '/path/to/myexecutiondir' && cd '/path/to/myexecutiondir' && echo 'myval']

Tests run: 2316, Failures: 1, Errors: 0, Skipped: 0

[INFO] ------------------------------------------------------------------------
[INFO] Reactor Summary:
[INFO] 
[INFO] Brooklyn REST JavaScript Web GUI ................... SUCCESS [ 44.205 s]
[INFO] Brooklyn Server Root ............................... SUCCESS [  0.636 s]
[INFO] Brooklyn Parent Project ............................ SUCCESS [  4.077 s]
[INFO] Brooklyn Test Support Utilities .................... SUCCESS [  7.384 s]
[INFO] Brooklyn Logback Includable Configuration .......... SUCCESS [  0.465 s]
[INFO] Brooklyn Common Utilities .......................... SUCCESS [ 30.736 s]
[INFO] Brooklyn API ....................................... SUCCESS [  1.954 s]
[INFO] CAMP Server Parent Project ......................... SUCCESS [  0.185 s]
[INFO] CAMP Base .......................................... SUCCESS [  4.175 s]
[INFO] Brooklyn Test Support .............................. SUCCESS [  1.223 s]
[INFO] Brooklyn REST Swagger Apidoc Utilities ............. SUCCESS [ 10.319 s]
[INFO] Brooklyn Logback Configuration ..................... SUCCESS [  0.623 s]
[INFO] CAMP Server ........................................ SUCCESS [ 12.981 s]
[INFO] Brooklyn Felix Runtime ............................. SUCCESS [  3.664 s]
[INFO] Brooklyn Groovy Utilities .......................... SUCCESS [  2.380 s]
[INFO] Brooklyn Core ...................................... FAILURE [04:25 min]
[INFO] Brooklyn Policies .................................. SKIPPED
[INFO] Brooklyn WinRM Software Entities ................... SKIPPED
[INFO] Brooklyn Secure JMXMP Agent ........................ SKIPPED
[INFO] Brooklyn JMX RMI Agent ............................. SKIPPED
[INFO] Brooklyn Jclouds Location Targets .................. SKIPPED
[INFO] Brooklyn Software Base ............................. SKIPPED
[INFO] Brooklyn CAMP ...................................... SKIPPED
[INFO] Brooklyn Launcher Common ........................... SKIPPED
[INFO] Brooklyn REST API .................................. SKIPPED
[INFO] Brooklyn REST Resources ............................ SKIPPED
[INFO] Brooklyn REST Server ............................... SKIPPED
[INFO] Brooklyn Launcher .................................. SKIPPED
[INFO] Brooklyn Container Location Targets ................ SKIPPED
[INFO] Brooklyn Command Line Interface .................... SKIPPED
[INFO] Brooklyn Test Framework ............................ SKIPPED
[INFO] Brooklyn OSGi init ................................. SKIPPED
[INFO] Brooklyn OSGi start ................................ SKIPPED
[INFO] Brooklyn Karaf ..................................... SKIPPED
[INFO] Jetty config fragment .............................. SKIPPED
[INFO] Apache Http Component extension .................... SKIPPED
[INFO] Brooklyn Karaf Features ............................ SKIPPED
[INFO] Brooklyn Karaf Shell Commands ...................... SKIPPED
[INFO] Brooklyn Library Root .............................. SKIPPED
[INFO] Brooklyn CM Chef ................................... SKIPPED
[INFO] Brooklyn CM SaltStack .............................. SKIPPED
[INFO] Brooklyn CM Ansible ................................ SKIPPED
[INFO] Brooklyn CM Integration Root ....................... SKIPPED
[INFO] Brooklyn Network Software Entities ................. SKIPPED
[INFO] Brooklyn OSGi Software Entities .................... SKIPPED
[INFO] Brooklyn Database Software Entities ................ SKIPPED
[INFO] Brooklyn Web App Software Entities ................. SKIPPED
[INFO] Brooklyn Messaging Software Entities ............... SKIPPED
[INFO] Brooklyn NoSQL Data Store Software Entities ........ SKIPPED
[INFO] Brooklyn Monitoring Software Entities .............. SKIPPED
[INFO] Brooklyn Web App Software Entities ................. SKIPPED
[INFO] Brooklyn QA ........................................ SKIPPED
[INFO] Brooklyn Examples Aggregator Project ............... SKIPPED
[INFO] Brooklyn Examples Aggregator Project - Webapps ..... SKIPPED
[INFO] hello-world-webapp Maven Webapp .................... SKIPPED
[INFO] hello-world-sql-webapp Maven Webapp ................ SKIPPED
[INFO] Brooklyn Simple Web Cluster Example ................ SKIPPED
[INFO] Brooklyn Library Karaf integration ................. SKIPPED
[INFO] Brooklyn Library Catalog ........................... SKIPPED
[INFO] Brooklyn Library Karaf Features .................... SKIPPED
[INFO] Brooklyn Client .................................... SKIPPED
[INFO] Brooklyn Client Command Line Interface ............. SKIPPED
[INFO] Brooklyn REST java Client .......................... SKIPPED
[INFO] Brooklyn Downstream Project Parent ................. SKIPPED
[INFO] Brooklyn Dist Root ................................. SKIPPED
[INFO] Brooklyn All Things ................................ SKIPPED
[INFO] Brooklyn Distribution .............................. SKIPPED
[INFO] Brooklyn Karaf Distribution Parent ................. SKIPPED
[INFO] Brooklyn Karaf Server Configuration ................ SKIPPED
[INFO] Brooklyn Dist Karaf Features ....................... SKIPPED
[INFO] Brooklyn Karaf Distribution ........................ SKIPPED
[INFO] Brooklyn Karaf pax-exam itest ...................... SKIPPED
[INFO] Brooklyn Vagrant Getting Started Environment ....... SKIPPED
[INFO] Brooklyn Quick-Start Project Archetype ............. SKIPPED
[INFO] Brooklyn Shared Package Files ...................... SKIPPED
[INFO] Brooklyn RPM Package ............................... SKIPPED
[INFO] Brooklyn DEB Package ............................... SKIPPED
[INFO] Brooklyn Root ...................................... SKIPPED
[INFO] ------------------------------------------------------------------------
[INFO] BUILD FAILURE
[INFO] ------------------------------------------------------------------------
[INFO] Total time: 06:42 min
[INFO] Finished at: 2018-04-30T12:23:52Z
[INFO] Final Memory: 95M/932M
[INFO] ------------------------------------------------------------------------
[ERROR] Failed to execute goal org.apache.maven.plugins:maven-surefire-plugin:2.19.1:test (default-test) on project brooklyn-core: There are test failures.
[ERROR] 
[ERROR] Please refer to /usr/build/brooklyn-server/core/target/surefire-reports for the individual test results.
[ERROR] -> [Help 1]
[ERROR] 
[ERROR] To see the full stack trace of the errors, re-run Maven with the -e switch.
[ERROR] Re-run Maven using the -X switch to enable full debug logging.
[ERROR] 
[ERROR] For more information about the errors and possible solutions, please read the following articles:
[ERROR] [Help 1] http://cwiki.apache.org/confluence/display/MAVEN/MojoFailureException
[ERROR] 
[ERROR] After correcting the problems, you can resume the build with the command
[ERROR]   mvn <goals> -rf :brooklyn-core
Build step 'Execute shell' marked build as failure
Recording test results
TestNG Reports Processing: START
Looking for TestNG results report in workspace using pattern: **/testng-results.xml
Saving reports...
Processing '/x1/jenkins/jenkins-home/jobs/brooklyn-master-build-docker/builds/392/testng/testng-results-1.xml'
Processing '/x1/jenkins/jenkins-home/jobs/brooklyn-master-build-docker/builds/392/testng/testng-results-2.xml'
Processing '/x1/jenkins/jenkins-home/jobs/brooklyn-master-build-docker/builds/392/testng/testng-results-3.xml'
Processing '/x1/jenkins/jenkins-home/jobs/brooklyn-master-build-docker/builds/392/testng/testng-results-4.xml'
Processing '/x1/jenkins/jenkins-home/jobs/brooklyn-master-build-docker/builds/392/testng/testng-results-5.xml'
Processing '/x1/jenkins/jenkins-home/jobs/brooklyn-master-build-docker/builds/392/testng/testng-results.xml'
0.034223% of tests failed, which exceeded threshold of 0%. Marking build as UNSTABLE
TestNG Reports Processing: FINISH