OSDir

[Date Prev][Date Next][Thread Prev][Thread Next][Date Index][Thread Index]

Build failed in Jenkins: brooklyn-master-build-docker #388


See <https://builds.apache.org/job/brooklyn-master-build-docker/388/display/redirect>

------------------------------------------
[...truncated 3.61 MB...]
2018-04-29 23:08:00,235 INFO  - Added external config supplier named 'brooklyn-demo-sample': org.apache.brooklyn.core.config.external.InPlaceExternalConfigSupplier@15630595
2018-04-29 23:08:00,254 INFO  - TESTNG PASSED CONFIGURATION: "Surefire test" - @BeforeMethod org.apache.brooklyn.core.test.BrooklynAppUnitTestSupport.setUp() finished in 18 ms
2018-04-29 23:08:00,254 INFO  - TESTNG INVOKING: "Surefire test" - org.apache.brooklyn.core.config.MapConfigKeyAndFriendsDeprecationTest.testMergesDeprecatedKeyFromRuntimeParentWithOwn()
2018-04-29 23:08:00,265 WARN  - Unsupported flags when configuring TestEntityImpl{id=hfj5ba3m03}; storing: {oldConfMapDeepMerge={mykey=myval}}
2018-04-29 23:08:00,277 WARN  - Retrieving value with deprecated config key name 'oldConfMapDeepMerge' for key confMapDeepMerge[MapConfigKey:java.util.Map]
2018-04-29 23:08:00,278 WARN  - Retrieving value with deprecated config key name 'oldConfMapDeepMerge' for key confMapDeepMerge[MapConfigKey:java.util.Map]
2018-04-29 23:08:00,279 WARN  - Retrieving value with deprecated config key name 'oldConfMapDeepMerge' for key confMapDeepMerge[MapConfigKey:java.util.Map]
2018-04-29 23:08:00,279 WARN  - Retrieving value with deprecated config key name 'oldConfMapDeepMerge' for key confMapDeepMerge[MapConfigKey:java.util.Map]
2018-04-29 23:08:00,280 INFO  - TESTNG PASSED: "Surefire test" - org.apache.brooklyn.core.config.MapConfigKeyAndFriendsDeprecationTest.testMergesDeprecatedKeyFromRuntimeParentWithOwn() finished in 26 ms
2018-04-29 23:08:00,280 INFO  - TESTNG INVOKING CONFIGURATION: "Surefire test" - @AfterMethod org.apache.brooklyn.core.test.BrooklynMgmtUnitTestSupport.tearDown()
2018-04-29 23:08:00,287 INFO  - TESTNG PASSED CONFIGURATION: "Surefire test" - @AfterMethod org.apache.brooklyn.core.test.BrooklynMgmtUnitTestSupport.tearDown() finished in 7 ms
2018-04-29 23:08:00,287 INFO  - TESTNG INVOKING CONFIGURATION: "Surefire test" - @BeforeMethod org.apache.brooklyn.core.test.BrooklynAppUnitTestSupport.setUp()
2018-04-29 23:08:00,287 INFO  - Added external config supplier named 'brooklyn-demo-sample': org.apache.brooklyn.core.config.external.InPlaceExternalConfigSupplier@a42b963
2018-04-29 23:08:00,300 INFO  - TESTNG PASSED CONFIGURATION: "Surefire test" - @BeforeMethod org.apache.brooklyn.core.test.BrooklynAppUnitTestSupport.setUp() finished in 13 ms
2018-04-29 23:08:00,300 INFO  - TESTNG INVOKING: "Surefire test" - org.apache.brooklyn.core.config.MapConfigKeyAndFriendsDeprecationTest.testMergesKeyFromRuntimeParentWithOwnDeprecated()
2018-04-29 23:08:00,310 WARN  - Unsupported flags when configuring TestEntityImpl{id=evhbfzpn5n}; storing: {confMapDeepMerge={mykey=myval}}
2018-04-29 23:08:00,323 INFO  - TESTNG PASSED: "Surefire test" - org.apache.brooklyn.core.config.MapConfigKeyAndFriendsDeprecationTest.testMergesKeyFromRuntimeParentWithOwnDeprecated() finished in 23 ms
2018-04-29 23:08:00,323 INFO  - TESTNG INVOKING CONFIGURATION: "Surefire test" - @AfterMethod org.apache.brooklyn.core.test.BrooklynMgmtUnitTestSupport.tearDown()
2018-04-29 23:08:00,328 INFO  - TESTNG PASSED CONFIGURATION: "Surefire test" - @AfterMethod org.apache.brooklyn.core.test.BrooklynMgmtUnitTestSupport.tearDown() finished in 5 ms
2018-04-29 23:08:00,328 INFO  - TESTNG INVOKING CONFIGURATION: "Surefire test" - @BeforeMethod org.apache.brooklyn.core.test.BrooklynAppUnitTestSupport.setUp()
2018-04-29 23:08:00,328 INFO  - Added external config supplier named 'brooklyn-demo-sample': org.apache.brooklyn.core.config.external.InPlaceExternalConfigSupplier@5db4b007
2018-04-29 23:08:00,339 INFO  - TESTNG PASSED CONFIGURATION: "Surefire test" - @BeforeMethod org.apache.brooklyn.core.test.BrooklynAppUnitTestSupport.setUp() finished in 11 ms
2018-04-29 23:08:00,339 INFO  - TESTNG INVOKING: "Surefire test" - org.apache.brooklyn.core.config.MapConfigKeyAndFriendsDeprecationTest.testPrefersNonDeprecatedName()
2018-04-29 23:08:00,347 INFO  - TESTNG PASSED: "Surefire test" - org.apache.brooklyn.core.config.MapConfigKeyAndFriendsDeprecationTest.testPrefersNonDeprecatedName() finished in 8 ms
2018-04-29 23:08:00,347 INFO  - TESTNG INVOKING CONFIGURATION: "Surefire test" - @AfterMethod org.apache.brooklyn.core.test.BrooklynMgmtUnitTestSupport.tearDown()
2018-04-29 23:08:00,350 INFO  - TESTNG PASSED CONFIGURATION: "Surefire test" - @AfterMethod org.apache.brooklyn.core.test.BrooklynMgmtUnitTestSupport.tearDown() finished in 3 ms
2018-04-29 23:08:00,351 INFO  - TESTNG INVOKING CONFIGURATION: "Surefire test" - @BeforeMethod org.apache.brooklyn.core.test.BrooklynAppUnitTestSupport.setUp()
2018-04-29 23:08:00,351 INFO  - Added external config supplier named 'brooklyn-demo-sample': org.apache.brooklyn.core.config.external.InPlaceExternalConfigSupplier@63a628da
2018-04-29 23:08:00,361 INFO  - TESTNG PASSED CONFIGURATION: "Surefire test" - @BeforeMethod org.apache.brooklyn.core.test.BrooklynAppUnitTestSupport.setUp() finished in 10 ms
2018-04-29 23:08:00,361 INFO  - TESTNG INVOKING: "Surefire test" - org.apache.brooklyn.core.config.MapConfigKeyAndFriendsDeprecationTest.testUsingDeprecatedName()
2018-04-29 23:08:00,369 INFO  - TESTNG PASSED: "Surefire test" - org.apache.brooklyn.core.config.MapConfigKeyAndFriendsDeprecationTest.testUsingDeprecatedName() finished in 8 ms
2018-04-29 23:08:00,369 INFO  - TESTNG INVOKING CONFIGURATION: "Surefire test" - @AfterMethod org.apache.brooklyn.core.test.BrooklynMgmtUnitTestSupport.tearDown()
2018-04-29 23:08:00,371 INFO  - TESTNG PASSED CONFIGURATION: "Surefire test" - @AfterMethod org.apache.brooklyn.core.test.BrooklynMgmtUnitTestSupport.tearDown() finished in 2 ms
2018-04-29 23:08:00,372 INFO  - TESTNG INVOKING CONFIGURATION: "Surefire test" - @BeforeMethod org.apache.brooklyn.core.test.BrooklynAppUnitTestSupport.setUp()
2018-04-29 23:08:00,372 INFO  - Added external config supplier named 'brooklyn-demo-sample': org.apache.brooklyn.core.config.external.InPlaceExternalConfigSupplier@28f71001
2018-04-29 23:08:00,386 INFO  - TESTNG PASSED CONFIGURATION: "Surefire test" - @BeforeMethod org.apache.brooklyn.core.test.BrooklynAppUnitTestSupport.setUp() finished in 14 ms
2018-04-29 23:08:00,386 INFO  - TESTNG INVOKING: "Surefire test" - org.apache.brooklyn.core.config.MapConfigKeyAndFriendsDeprecationTest.testUsingDeprecatedNameSubkey()
2018-04-29 23:08:00,395 WARN  - Unsupported flags when configuring MyEntityImpl{id=xllj2tb54q}; storing: {confMapDeepMerge.mykey=myval}
2018-04-29 23:08:00,398 INFO  - TESTNG PASSED: "Surefire test" - org.apache.brooklyn.core.config.MapConfigKeyAndFriendsDeprecationTest.testUsingDeprecatedNameSubkey() finished in 11 ms
2018-04-29 23:08:00,398 INFO  - TESTNG INVOKING CONFIGURATION: "Surefire test" - @AfterMethod org.apache.brooklyn.core.test.BrooklynMgmtUnitTestSupport.tearDown()
2018-04-29 23:08:00,400 INFO  - TESTNG PASSED CONFIGURATION: "Surefire test" - @AfterMethod org.apache.brooklyn.core.test.BrooklynMgmtUnitTestSupport.tearDown() finished in 2 ms
2018-04-29 23:08:00,401 INFO  - TESTNG INVOKING: "Surefire test" - org.apache.brooklyn.core.config.BrooklynPropertiesTest.testAddFromUrlClasspath()
2018-04-29 23:08:00,401 INFO  - TESTNG PASSED: "Surefire test" - org.apache.brooklyn.core.config.BrooklynPropertiesTest.testAddFromUrlClasspath() finished in 0 ms
2018-04-29 23:08:00,402 INFO  - TESTNG INVOKING: "Surefire test" - org.apache.brooklyn.core.config.BrooklynPropertiesTest.testAddFromUrlSimple()
2018-04-29 23:08:00,402 INFO  - TESTNG PASSED: "Surefire test" - org.apache.brooklyn.core.config.BrooklynPropertiesTest.testAddFromUrlSimple() finished in 0 ms
2018-04-29 23:08:00,402 INFO  - TESTNG INVOKING: "Surefire test" - org.apache.brooklyn.core.config.BrooklynPropertiesTest.testAddMultipleFromUrl()
2018-04-29 23:08:00,402 INFO  - TESTNG PASSED: "Surefire test" - org.apache.brooklyn.core.config.BrooklynPropertiesTest.testAddMultipleFromUrl() finished in 0 ms
2018-04-29 23:08:00,403 INFO  - TESTNG INVOKING: "Surefire test" - org.apache.brooklyn.core.config.BrooklynPropertiesTest.testGetAndPutConfig()
2018-04-29 23:08:00,403 INFO  - TESTNG PASSED: "Surefire test" - org.apache.brooklyn.core.config.BrooklynPropertiesTest.testGetAndPutConfig() finished in 0 ms
2018-04-29 23:08:00,404 INFO  - TESTNG INVOKING: "Surefire test" - org.apache.brooklyn.core.config.BrooklynPropertiesTest.testGetFirst()
2018-04-29 23:08:00,404 INFO  - TESTNG PASSED: "Surefire test" - org.apache.brooklyn.core.config.BrooklynPropertiesTest.testGetFirst() finished in 0 ms
2018-04-29 23:08:00,404 INFO  - TESTNG INVOKING: "Surefire test" - org.apache.brooklyn.core.config.BrooklynPropertiesTest.testGetFirstUsingDefaultIfNone()
2018-04-29 23:08:00,404 INFO  - TESTNG PASSED: "Surefire test" - org.apache.brooklyn.core.config.BrooklynPropertiesTest.testGetFirstUsingDefaultIfNone() finished in 0 ms
2018-04-29 23:08:00,404 INFO  - TESTNG INVOKING: "Surefire test" - org.apache.brooklyn.core.config.BrooklynPropertiesTest.testGetFirstUsingFailIfNone()
2018-04-29 23:08:00,405 INFO  - TESTNG PASSED: "Surefire test" - org.apache.brooklyn.core.config.BrooklynPropertiesTest.testGetFirstUsingFailIfNone() finished in 0 ms
2018-04-29 23:08:00,405 INFO  - TESTNG INVOKING: "Surefire test" - org.apache.brooklyn.core.config.BrooklynPropertiesTest.testGetFirstUsingFailIfNoneFalse()
2018-04-29 23:08:00,405 INFO  - TESTNG PASSED: "Surefire test" - org.apache.brooklyn.core.config.BrooklynPropertiesTest.testGetFirstUsingFailIfNoneFalse() finished in 0 ms
2018-04-29 23:08:00,405 INFO  - TESTNG INVOKING: "Surefire test" - org.apache.brooklyn.core.config.BrooklynPropertiesTest.testGetSubMap()
2018-04-29 23:08:00,405 INFO  - TESTNG PASSED: "Surefire test" - org.apache.brooklyn.core.config.BrooklynPropertiesTest.testGetSubMap() finished in 0 ms
2018-04-29 23:08:00,405 INFO  - TESTNG INVOKING: "Surefire test" - org.apache.brooklyn.core.config.BrooklynPropertiesTest.testTrickyAddMultipleFromUrl()
2018-04-29 23:08:00,406 INFO  - TESTNG PASSED: "Surefire test" - org.apache.brooklyn.core.config.BrooklynPropertiesTest.testTrickyAddMultipleFromUrl() finished in 1 ms
2018-04-29 23:08:00,406 INFO  - TESTNG INVOKING: "Surefire test" - org.apache.brooklyn.core.config.BrooklynPropertiesFromGroovyTest.testGetFirstMultiArgUsingFailIfNoneWithClosure()
2018-04-29 23:08:00,436 WARN  - Use of groovy.lang.Closure is deprecated as value for 'failIfNone', in BrooklynProperties.getFirst()
2018-04-29 23:08:00,446 INFO  - TESTNG PASSED: "Surefire test" - org.apache.brooklyn.core.config.BrooklynPropertiesFromGroovyTest.testGetFirstMultiArgUsingFailIfNoneWithClosure() finished in 40 ms
2018-04-29 23:08:00,446 INFO  - TESTNG INVOKING: "Surefire test" - org.apache.brooklyn.core.config.BrooklynPropertiesFromGroovyTest.testGetFirstUsingFailIfNoneWithClosure()
2018-04-29 23:08:00,447 WARN  - Use of groovy.lang.Closure is deprecated as value for 'failIfNone', in BrooklynProperties.getFirst()
2018-04-29 23:08:00,448 INFO  - TESTNG PASSED: "Surefire test" - org.apache.brooklyn.core.config.BrooklynPropertiesFromGroovyTest.testGetFirstUsingFailIfNoneWithClosure() finished in 2 ms
2018-04-29 23:08:00,448 INFO  - TESTNG INVOKING: "Surefire test" - org.apache.brooklyn.core.config.external.InPlaceExternalConfigSupplierTest.testInPlace()
2018-04-29 23:08:00,448 INFO  - Added external config supplier named 'brooklyn-demo-sample': org.apache.brooklyn.core.config.external.InPlaceExternalConfigSupplier@2cefa457
2018-04-29 23:08:00,449 INFO  - Added external config supplier named 'foo': org.apache.brooklyn.core.config.external.InPlaceExternalConfigSupplier@4e3de68b
2018-04-29 23:08:00,449 INFO  - TESTNG PASSED: "Surefire test" - org.apache.brooklyn.core.config.external.InPlaceExternalConfigSupplierTest.testInPlace() finished in 1 ms
2018-04-29 23:08:00,449 INFO  - TESTNG INVOKING CONFIGURATION: "Surefire test" - @AfterMethod org.apache.brooklyn.core.config.external.InPlaceExternalConfigSupplierTest.tearDown()
2018-04-29 23:08:00,450 INFO  - TESTNG PASSED CONFIGURATION: "Surefire test" - @AfterMethod org.apache.brooklyn.core.config.external.InPlaceExternalConfigSupplierTest.tearDown() finished in 1 ms
2018-04-29 23:08:00,450 INFO  - TESTNG INVOKING CONFIGURATION: "Surefire test" - @BeforeMethod org.apache.brooklyn.core.config.external.PropertiesFileExternalConfigSupplierTest.setUp()
2018-04-29 23:08:00,450 INFO  - TESTNG PASSED CONFIGURATION: "Surefire test" - @BeforeMethod org.apache.brooklyn.core.config.external.PropertiesFileExternalConfigSupplierTest.setUp() finished in 0 ms
2018-04-29 23:08:00,450 INFO  - TESTNG INVOKING: "Surefire test" - org.apache.brooklyn.core.config.external.PropertiesFileExternalConfigSupplierTest.testFromProperties()
2018-04-29 23:08:00,451 INFO  - Added external config supplier named 'brooklyn-demo-sample': org.apache.brooklyn.core.config.external.InPlaceExternalConfigSupplier@1679551
2018-04-29 23:08:00,452 INFO  - Added external config supplier named 'foo': org.apache.brooklyn.core.config.external.PropertiesFileExternalConfigSupplier@6768cc1
2018-04-29 23:08:00,452 INFO  - TESTNG PASSED: "Surefire test" - org.apache.brooklyn.core.config.external.PropertiesFileExternalConfigSupplierTest.testFromProperties() finished in 2 ms
2018-04-29 23:08:00,452 INFO  - TESTNG INVOKING CONFIGURATION: "Surefire test" - @AfterMethod org.apache.brooklyn.core.config.external.PropertiesFileExternalConfigSupplierTest.tearDown()
2018-04-29 23:08:00,454 INFO  - TESTNG PASSED CONFIGURATION: "Surefire test" - @AfterMethod org.apache.brooklyn.core.config.external.PropertiesFileExternalConfigSupplierTest.tearDown() finished in 2 ms
2018-04-29 23:08:00,648 INFO  - TESTNG 
===============================================
    Surefire test
    Tests run: 2316, Failures: 1, Skips: 0
===============================================
[GC (Allocation Failure)  465408K->260544K(756736K), 0.0268001 secs]
[GC (Allocation Failure)  463808K->260224K(758272K), 0.0325349 secs]
[GC (Allocation Failure)  465536K->260232K(757760K), 0.0102119 secs]
[GC (Allocation Failure)  465544K->260064K(759808K), 0.0097003 secs]
[GC (Allocation Failure)  468448K->260456K(759296K), 0.0067122 secs]
[GC (Allocation Failure)  468840K->261592K(761856K), 0.0126371 secs]
Tests run: 2316, Failures: 1, Errors: 0, Skipped: 0, Time elapsed: 144.801 sec <<< FAILURE! - in TestSuite
testCommandExecutedWithEnvironment(org.apache.brooklyn.entity.group.SshCommandMembershipTrackingPolicyTest)  Time elapsed: 0.033 sec  <<< FAILURE!
java.lang.AssertionError: Lists differ at element [0]: echo ignored != mkdir -p '/path/to/myexecutiondir' && cd '/path/to/myexecutiondir' && echo 'myval' expected [echo ignored] but found [mkdir -p '/path/to/myexecutiondir' && cd '/path/to/myexecutiondir' && echo 'myval']
	at org.apache.brooklyn.entity.group.SshCommandMembershipTrackingPolicyTest.testCommandExecutedWithEnvironment(SshCommandMembershipTrackingPolicyTest.java:90)

2018-04-29 23:08:03,386 INFO  - Brooklyn shutdown: stopping entities [TestEntityImpl{id=fxg2los284}, TestEntityImpl{id=n03fm6glvp}, BlockingEntityImpl{id=ow9ouzgfaq}]

Results :

Failed tests: 
  SshCommandMembershipTrackingPolicyTest.testCommandExecutedWithEnvironment:90 Lists differ at element [0]: echo ignored != mkdir -p '/path/to/myexecutiondir' && cd '/path/to/myexecutiondir' && echo 'myval' expected [echo ignored] but found [mkdir -p '/path/to/myexecutiondir' && cd '/path/to/myexecutiondir' && echo 'myval']

Tests run: 2316, Failures: 1, Errors: 0, Skipped: 0

[INFO] ------------------------------------------------------------------------
[INFO] Reactor Summary:
[INFO] 
[INFO] Brooklyn REST JavaScript Web GUI ................... SUCCESS [ 31.075 s]
[INFO] Brooklyn Server Root ............................... SUCCESS [  0.137 s]
[INFO] Brooklyn Parent Project ............................ SUCCESS [  1.994 s]
[INFO] Brooklyn Test Support Utilities .................... SUCCESS [  3.006 s]
[INFO] Brooklyn Logback Includable Configuration .......... SUCCESS [  0.315 s]
[INFO] Brooklyn Common Utilities .......................... SUCCESS [ 18.932 s]
[INFO] Brooklyn API ....................................... SUCCESS [  1.318 s]
[INFO] CAMP Server Parent Project ......................... SUCCESS [  0.244 s]
[INFO] CAMP Base .......................................... SUCCESS [  2.320 s]
[INFO] Brooklyn Test Support .............................. SUCCESS [  0.888 s]
[INFO] Brooklyn REST Swagger Apidoc Utilities ............. SUCCESS [  0.635 s]
[INFO] Brooklyn Logback Configuration ..................... SUCCESS [  0.152 s]
[INFO] CAMP Server ........................................ SUCCESS [  3.867 s]
[INFO] Brooklyn Felix Runtime ............................. SUCCESS [  2.485 s]
[INFO] Brooklyn Groovy Utilities .......................... SUCCESS [  1.936 s]
[INFO] Brooklyn Core ...................................... FAILURE [03:00 min]
[INFO] Brooklyn Policies .................................. SKIPPED
[INFO] Brooklyn WinRM Software Entities ................... SKIPPED
[INFO] Brooklyn Secure JMXMP Agent ........................ SKIPPED
[INFO] Brooklyn JMX RMI Agent ............................. SKIPPED
[INFO] Brooklyn Jclouds Location Targets .................. SKIPPED
[INFO] Brooklyn Software Base ............................. SKIPPED
[INFO] Brooklyn CAMP ...................................... SKIPPED
[INFO] Brooklyn Launcher Common ........................... SKIPPED
[INFO] Brooklyn REST API .................................. SKIPPED
[INFO] Brooklyn REST Resources ............................ SKIPPED
[INFO] Brooklyn REST Server ............................... SKIPPED
[INFO] Brooklyn Launcher .................................. SKIPPED
[INFO] Brooklyn Container Location Targets ................ SKIPPED
[INFO] Brooklyn Command Line Interface .................... SKIPPED
[INFO] Brooklyn Test Framework ............................ SKIPPED
[INFO] Brooklyn OSGi init ................................. SKIPPED
[INFO] Brooklyn OSGi start ................................ SKIPPED
[INFO] Brooklyn Karaf ..................................... SKIPPED
[INFO] Jetty config fragment .............................. SKIPPED
[INFO] Apache Http Component extension .................... SKIPPED
[INFO] Brooklyn Karaf Features ............................ SKIPPED
[INFO] Brooklyn Karaf Shell Commands ...................... SKIPPED
[INFO] Brooklyn Library Root .............................. SKIPPED
[INFO] Brooklyn CM Chef ................................... SKIPPED
[INFO] Brooklyn CM SaltStack .............................. SKIPPED
[INFO] Brooklyn CM Ansible ................................ SKIPPED
[INFO] Brooklyn CM Integration Root ....................... SKIPPED
[INFO] Brooklyn Network Software Entities ................. SKIPPED
[INFO] Brooklyn OSGi Software Entities .................... SKIPPED
[INFO] Brooklyn Database Software Entities ................ SKIPPED
[INFO] Brooklyn Web App Software Entities ................. SKIPPED
[INFO] Brooklyn Messaging Software Entities ............... SKIPPED
[INFO] Brooklyn NoSQL Data Store Software Entities ........ SKIPPED
[INFO] Brooklyn Monitoring Software Entities .............. SKIPPED
[INFO] Brooklyn Web App Software Entities ................. SKIPPED
[INFO] Brooklyn QA ........................................ SKIPPED
[INFO] Brooklyn Examples Aggregator Project ............... SKIPPED
[INFO] Brooklyn Examples Aggregator Project - Webapps ..... SKIPPED
[INFO] hello-world-webapp Maven Webapp .................... SKIPPED
[INFO] hello-world-sql-webapp Maven Webapp ................ SKIPPED
[INFO] Brooklyn Simple Web Cluster Example ................ SKIPPED
[INFO] Brooklyn Library Karaf integration ................. SKIPPED
[INFO] Brooklyn Library Catalog ........................... SKIPPED
[INFO] Brooklyn Library Karaf Features .................... SKIPPED
[INFO] Brooklyn Client .................................... SKIPPED
[INFO] Brooklyn Client Command Line Interface ............. SKIPPED
[INFO] Brooklyn REST java Client .......................... SKIPPED
[INFO] Brooklyn Downstream Project Parent ................. SKIPPED
[INFO] Brooklyn Dist Root ................................. SKIPPED
[INFO] Brooklyn All Things ................................ SKIPPED
[INFO] Brooklyn Distribution .............................. SKIPPED
[INFO] Brooklyn Karaf Distribution Parent ................. SKIPPED
[INFO] Brooklyn Karaf Server Configuration ................ SKIPPED
[INFO] Brooklyn Dist Karaf Features ....................... SKIPPED
[INFO] Brooklyn Karaf Distribution ........................ SKIPPED
[INFO] Brooklyn Karaf pax-exam itest ...................... SKIPPED
[INFO] Brooklyn Vagrant Getting Started Environment ....... SKIPPED
[INFO] Brooklyn Quick-Start Project Archetype ............. SKIPPED
[INFO] Brooklyn Shared Package Files ...................... SKIPPED
[INFO] Brooklyn RPM Package ............................... SKIPPED
[INFO] Brooklyn DEB Package ............................... SKIPPED
[INFO] Brooklyn Root ...................................... SKIPPED
[INFO] ------------------------------------------------------------------------
[INFO] BUILD FAILURE
[INFO] ------------------------------------------------------------------------
[INFO] Total time: 04:12 min
[INFO] Finished at: 2018-04-29T23:08:03Z
[INFO] Final Memory: 92M/771M
[INFO] ------------------------------------------------------------------------
[ERROR] Failed to execute goal org.apache.maven.plugins:maven-surefire-plugin:2.19.1:test (default-test) on project brooklyn-core: There are test failures.
[ERROR] 
[ERROR] Please refer to /usr/build/brooklyn-server/core/target/surefire-reports for the individual test results.
[ERROR] -> [Help 1]
[ERROR] 
[ERROR] To see the full stack trace of the errors, re-run Maven with the -e switch.
[ERROR] Re-run Maven using the -X switch to enable full debug logging.
[ERROR] 
[ERROR] For more information about the errors and possible solutions, please read the following articles:
[ERROR] [Help 1] http://cwiki.apache.org/confluence/display/MAVEN/MojoFailureException
[ERROR] 
[ERROR] After correcting the problems, you can resume the build with the command
[ERROR]   mvn <goals> -rf :brooklyn-core
Build step 'Execute shell' marked build as failure
Recording test results
TestNG Reports Processing: START
Looking for TestNG results report in workspace using pattern: **/testng-results.xml
testng-results.xml was last modified before this build started. Ignoring it.
testng-results.xml was last modified before this build started. Ignoring it.
testng-results.xml was last modified before this build started. Ignoring it.
testng-results.xml was last modified before this build started. Ignoring it.
testng-results.xml was last modified before this build started. Ignoring it.
testng-results.xml was last modified before this build started. Ignoring it.
testng-results.xml was last modified before this build started. Ignoring it.
testng-results.xml was last modified before this build started. Ignoring it.
testng-results.xml was last modified before this build started. Ignoring it.
testng-results.xml was last modified before this build started. Ignoring it.
testng-results.xml was last modified before this build started. Ignoring it.
testng-results.xml was last modified before this build started. Ignoring it.
testng-results.xml was last modified before this build started. Ignoring it.
testng-results.xml was last modified before this build started. Ignoring it.
testng-results.xml was last modified before this build started. Ignoring it.
testng-results.xml was last modified before this build started. Ignoring it.
testng-results.xml was last modified before this build started. Ignoring it.
testng-results.xml was last modified before this build started. Ignoring it.
testng-results.xml was last modified before this build started. Ignoring it.
testng-results.xml was last modified before this build started. Ignoring it.
testng-results.xml was last modified before this build started. Ignoring it.
testng-results.xml was last modified before this build started. Ignoring it.
testng-results.xml was last modified before this build started. Ignoring it.
testng-results.xml was last modified before this build started. Ignoring it.
testng-results.xml was last modified before this build started. Ignoring it.
testng-results.xml was last modified before this build started. Ignoring it.
testng-results.xml was last modified before this build started. Ignoring it.
testng-results.xml was last modified before this build started. Ignoring it.
testng-results.xml was last modified before this build started. Ignoring it.
Saving reports...
Processing '/x1/jenkins/jenkins-home/jobs/brooklyn-master-build-docker/builds/388/testng/testng-results-1.xml'
Processing '/x1/jenkins/jenkins-home/jobs/brooklyn-master-build-docker/builds/388/testng/testng-results-2.xml'
Processing '/x1/jenkins/jenkins-home/jobs/brooklyn-master-build-docker/builds/388/testng/testng-results-3.xml'
Processing '/x1/jenkins/jenkins-home/jobs/brooklyn-master-build-docker/builds/388/testng/testng-results-4.xml'
Processing '/x1/jenkins/jenkins-home/jobs/brooklyn-master-build-docker/builds/388/testng/testng-results-5.xml'
Processing '/x1/jenkins/jenkins-home/jobs/brooklyn-master-build-docker/builds/388/testng/testng-results.xml'
0.034223% of tests failed, which exceeded threshold of 0%. Marking build as UNSTABLE
TestNG Reports Processing: FINISH