OSDir

[Date Prev][Date Next][Thread Prev][Thread Next][Date Index][Thread Index]

Build failed in Jenkins: brooklyn-master-build-docker #387


See <https://builds.apache.org/job/brooklyn-master-build-docker/387/display/redirect>

------------------------------------------
[...truncated 3.51 MB...]
2018-04-28 23:08:33,244 INFO  - TESTNG PASSED CONFIGURATION: "Surefire test" - @BeforeMethod org.apache.brooklyn.core.test.BrooklynAppUnitTestSupport.setUp() finished in 12 ms
2018-04-28 23:08:33,244 INFO  - TESTNG INVOKING: "Surefire test" - org.apache.brooklyn.core.config.MapConfigKeyAndFriendsDeprecationTest.testMergesDeprecatedKeyFromRuntimeParentWithOwn()
2018-04-28 23:08:33,252 WARN  - Unsupported flags when configuring TestEntityImpl{id=keceq1iwz4}; storing: {oldConfMapDeepMerge={mykey=myval}}
2018-04-28 23:08:33,262 WARN  - Retrieving value with deprecated config key name 'oldConfMapDeepMerge' for key confMapDeepMerge[MapConfigKey:java.util.Map]
2018-04-28 23:08:33,262 WARN  - Retrieving value with deprecated config key name 'oldConfMapDeepMerge' for key confMapDeepMerge[MapConfigKey:java.util.Map]
2018-04-28 23:08:33,264 WARN  - Retrieving value with deprecated config key name 'oldConfMapDeepMerge' for key confMapDeepMerge[MapConfigKey:java.util.Map]
2018-04-28 23:08:33,264 WARN  - Retrieving value with deprecated config key name 'oldConfMapDeepMerge' for key confMapDeepMerge[MapConfigKey:java.util.Map]
2018-04-28 23:08:33,264 INFO  - TESTNG PASSED: "Surefire test" - org.apache.brooklyn.core.config.MapConfigKeyAndFriendsDeprecationTest.testMergesDeprecatedKeyFromRuntimeParentWithOwn() finished in 20 ms
2018-04-28 23:08:33,264 INFO  - TESTNG INVOKING CONFIGURATION: "Surefire test" - @AfterMethod org.apache.brooklyn.core.test.BrooklynMgmtUnitTestSupport.tearDown()
2018-04-28 23:08:33,269 INFO  - TESTNG PASSED CONFIGURATION: "Surefire test" - @AfterMethod org.apache.brooklyn.core.test.BrooklynMgmtUnitTestSupport.tearDown() finished in 5 ms
2018-04-28 23:08:33,269 INFO  - TESTNG INVOKING CONFIGURATION: "Surefire test" - @BeforeMethod org.apache.brooklyn.core.test.BrooklynAppUnitTestSupport.setUp()
2018-04-28 23:08:33,269 INFO  - Added external config supplier named 'brooklyn-demo-sample': org.apache.brooklyn.core.config.external.InPlaceExternalConfigSupplier@2ab38d1e
2018-04-28 23:08:33,280 INFO  - TESTNG PASSED CONFIGURATION: "Surefire test" - @BeforeMethod org.apache.brooklyn.core.test.BrooklynAppUnitTestSupport.setUp() finished in 11 ms
2018-04-28 23:08:33,280 INFO  - TESTNG INVOKING: "Surefire test" - org.apache.brooklyn.core.config.MapConfigKeyAndFriendsDeprecationTest.testMergesKeyFromRuntimeParentWithOwnDeprecated()
2018-04-28 23:08:33,288 WARN  - Unsupported flags when configuring TestEntityImpl{id=aheupgjlkx}; storing: {confMapDeepMerge={mykey=myval}}
2018-04-28 23:08:33,300 INFO  - TESTNG PASSED: "Surefire test" - org.apache.brooklyn.core.config.MapConfigKeyAndFriendsDeprecationTest.testMergesKeyFromRuntimeParentWithOwnDeprecated() finished in 20 ms
2018-04-28 23:08:33,300 INFO  - TESTNG INVOKING CONFIGURATION: "Surefire test" - @AfterMethod org.apache.brooklyn.core.test.BrooklynMgmtUnitTestSupport.tearDown()
2018-04-28 23:08:33,305 INFO  - TESTNG PASSED CONFIGURATION: "Surefire test" - @AfterMethod org.apache.brooklyn.core.test.BrooklynMgmtUnitTestSupport.tearDown() finished in 5 ms
2018-04-28 23:08:33,305 INFO  - TESTNG INVOKING CONFIGURATION: "Surefire test" - @BeforeMethod org.apache.brooklyn.core.test.BrooklynAppUnitTestSupport.setUp()
2018-04-28 23:08:33,306 INFO  - Added external config supplier named 'brooklyn-demo-sample': org.apache.brooklyn.core.config.external.InPlaceExternalConfigSupplier@1a7559b1
2018-04-28 23:08:33,317 INFO  - TESTNG PASSED CONFIGURATION: "Surefire test" - @BeforeMethod org.apache.brooklyn.core.test.BrooklynAppUnitTestSupport.setUp() finished in 12 ms
2018-04-28 23:08:33,317 INFO  - TESTNG INVOKING: "Surefire test" - org.apache.brooklyn.core.config.MapConfigKeyAndFriendsDeprecationTest.testPrefersNonDeprecatedName()
2018-04-28 23:08:33,326 INFO  - TESTNG PASSED: "Surefire test" - org.apache.brooklyn.core.config.MapConfigKeyAndFriendsDeprecationTest.testPrefersNonDeprecatedName() finished in 9 ms
2018-04-28 23:08:33,326 INFO  - TESTNG INVOKING CONFIGURATION: "Surefire test" - @AfterMethod org.apache.brooklyn.core.test.BrooklynMgmtUnitTestSupport.tearDown()
2018-04-28 23:08:33,329 INFO  - TESTNG PASSED CONFIGURATION: "Surefire test" - @AfterMethod org.apache.brooklyn.core.test.BrooklynMgmtUnitTestSupport.tearDown() finished in 3 ms
2018-04-28 23:08:33,329 INFO  - TESTNG INVOKING CONFIGURATION: "Surefire test" - @BeforeMethod org.apache.brooklyn.core.test.BrooklynAppUnitTestSupport.setUp()
2018-04-28 23:08:33,329 INFO  - Added external config supplier named 'brooklyn-demo-sample': org.apache.brooklyn.core.config.external.InPlaceExternalConfigSupplier@7fbe621d
2018-04-28 23:08:33,340 INFO  - TESTNG PASSED CONFIGURATION: "Surefire test" - @BeforeMethod org.apache.brooklyn.core.test.BrooklynAppUnitTestSupport.setUp() finished in 11 ms
2018-04-28 23:08:33,340 INFO  - TESTNG INVOKING: "Surefire test" - org.apache.brooklyn.core.config.MapConfigKeyAndFriendsDeprecationTest.testUsingDeprecatedName()
2018-04-28 23:08:33,348 INFO  - TESTNG PASSED: "Surefire test" - org.apache.brooklyn.core.config.MapConfigKeyAndFriendsDeprecationTest.testUsingDeprecatedName() finished in 8 ms
2018-04-28 23:08:33,348 INFO  - TESTNG INVOKING CONFIGURATION: "Surefire test" - @AfterMethod org.apache.brooklyn.core.test.BrooklynMgmtUnitTestSupport.tearDown()
2018-04-28 23:08:33,352 INFO  - TESTNG PASSED CONFIGURATION: "Surefire test" - @AfterMethod org.apache.brooklyn.core.test.BrooklynMgmtUnitTestSupport.tearDown() finished in 4 ms
2018-04-28 23:08:33,352 INFO  - TESTNG INVOKING CONFIGURATION: "Surefire test" - @BeforeMethod org.apache.brooklyn.core.test.BrooklynAppUnitTestSupport.setUp()
2018-04-28 23:08:33,352 INFO  - Added external config supplier named 'brooklyn-demo-sample': org.apache.brooklyn.core.config.external.InPlaceExternalConfigSupplier@183d7ee3
2018-04-28 23:08:33,363 INFO  - TESTNG PASSED CONFIGURATION: "Surefire test" - @BeforeMethod org.apache.brooklyn.core.test.BrooklynAppUnitTestSupport.setUp() finished in 11 ms
2018-04-28 23:08:33,363 INFO  - TESTNG INVOKING: "Surefire test" - org.apache.brooklyn.core.config.MapConfigKeyAndFriendsDeprecationTest.testUsingDeprecatedNameSubkey()
2018-04-28 23:08:33,369 WARN  - Unsupported flags when configuring MyEntityImpl{id=zy20lkspsd}; storing: {confMapDeepMerge.mykey=myval}
2018-04-28 23:08:33,371 INFO  - TESTNG PASSED: "Surefire test" - org.apache.brooklyn.core.config.MapConfigKeyAndFriendsDeprecationTest.testUsingDeprecatedNameSubkey() finished in 8 ms
2018-04-28 23:08:33,371 INFO  - TESTNG INVOKING CONFIGURATION: "Surefire test" - @AfterMethod org.apache.brooklyn.core.test.BrooklynMgmtUnitTestSupport.tearDown()
2018-04-28 23:08:33,374 INFO  - TESTNG PASSED CONFIGURATION: "Surefire test" - @AfterMethod org.apache.brooklyn.core.test.BrooklynMgmtUnitTestSupport.tearDown() finished in 3 ms
2018-04-28 23:08:33,374 INFO  - TESTNG INVOKING: "Surefire test" - org.apache.brooklyn.core.config.BrooklynPropertiesTest.testAddFromUrlClasspath()
2018-04-28 23:08:33,375 INFO  - TESTNG PASSED: "Surefire test" - org.apache.brooklyn.core.config.BrooklynPropertiesTest.testAddFromUrlClasspath() finished in 1 ms
2018-04-28 23:08:33,375 INFO  - TESTNG INVOKING: "Surefire test" - org.apache.brooklyn.core.config.BrooklynPropertiesTest.testAddFromUrlSimple()
2018-04-28 23:08:33,375 INFO  - TESTNG PASSED: "Surefire test" - org.apache.brooklyn.core.config.BrooklynPropertiesTest.testAddFromUrlSimple() finished in 0 ms
2018-04-28 23:08:33,376 INFO  - TESTNG INVOKING: "Surefire test" - org.apache.brooklyn.core.config.BrooklynPropertiesTest.testAddMultipleFromUrl()
2018-04-28 23:08:33,376 INFO  - TESTNG PASSED: "Surefire test" - org.apache.brooklyn.core.config.BrooklynPropertiesTest.testAddMultipleFromUrl() finished in 0 ms
2018-04-28 23:08:33,376 INFO  - TESTNG INVOKING: "Surefire test" - org.apache.brooklyn.core.config.BrooklynPropertiesTest.testGetAndPutConfig()
2018-04-28 23:08:33,377 INFO  - TESTNG PASSED: "Surefire test" - org.apache.brooklyn.core.config.BrooklynPropertiesTest.testGetAndPutConfig() finished in 1 ms
2018-04-28 23:08:33,377 INFO  - TESTNG INVOKING: "Surefire test" - org.apache.brooklyn.core.config.BrooklynPropertiesTest.testGetFirst()
2018-04-28 23:08:33,377 INFO  - TESTNG PASSED: "Surefire test" - org.apache.brooklyn.core.config.BrooklynPropertiesTest.testGetFirst() finished in 0 ms
2018-04-28 23:08:33,377 INFO  - TESTNG INVOKING: "Surefire test" - org.apache.brooklyn.core.config.BrooklynPropertiesTest.testGetFirstUsingDefaultIfNone()
2018-04-28 23:08:33,377 INFO  - TESTNG PASSED: "Surefire test" - org.apache.brooklyn.core.config.BrooklynPropertiesTest.testGetFirstUsingDefaultIfNone() finished in 0 ms
2018-04-28 23:08:33,377 INFO  - TESTNG INVOKING: "Surefire test" - org.apache.brooklyn.core.config.BrooklynPropertiesTest.testGetFirstUsingFailIfNone()
2018-04-28 23:08:33,377 INFO  - TESTNG PASSED: "Surefire test" - org.apache.brooklyn.core.config.BrooklynPropertiesTest.testGetFirstUsingFailIfNone() finished in 0 ms
2018-04-28 23:08:33,377 INFO  - TESTNG INVOKING: "Surefire test" - org.apache.brooklyn.core.config.BrooklynPropertiesTest.testGetFirstUsingFailIfNoneFalse()
2018-04-28 23:08:33,378 INFO  - TESTNG PASSED: "Surefire test" - org.apache.brooklyn.core.config.BrooklynPropertiesTest.testGetFirstUsingFailIfNoneFalse() finished in 1 ms
2018-04-28 23:08:33,378 INFO  - TESTNG INVOKING: "Surefire test" - org.apache.brooklyn.core.config.BrooklynPropertiesTest.testGetSubMap()
2018-04-28 23:08:33,378 INFO  - TESTNG PASSED: "Surefire test" - org.apache.brooklyn.core.config.BrooklynPropertiesTest.testGetSubMap() finished in 0 ms
2018-04-28 23:08:33,378 INFO  - TESTNG INVOKING: "Surefire test" - org.apache.brooklyn.core.config.BrooklynPropertiesTest.testTrickyAddMultipleFromUrl()
2018-04-28 23:08:33,378 INFO  - TESTNG PASSED: "Surefire test" - org.apache.brooklyn.core.config.BrooklynPropertiesTest.testTrickyAddMultipleFromUrl() finished in 0 ms
2018-04-28 23:08:33,379 INFO  - TESTNG INVOKING: "Surefire test" - org.apache.brooklyn.core.config.BrooklynPropertiesFromGroovyTest.testGetFirstMultiArgUsingFailIfNoneWithClosure()
2018-04-28 23:08:33,408 WARN  - Use of groovy.lang.Closure is deprecated as value for 'failIfNone', in BrooklynProperties.getFirst()
2018-04-28 23:08:33,418 INFO  - TESTNG PASSED: "Surefire test" - org.apache.brooklyn.core.config.BrooklynPropertiesFromGroovyTest.testGetFirstMultiArgUsingFailIfNoneWithClosure() finished in 39 ms
2018-04-28 23:08:33,418 INFO  - TESTNG INVOKING: "Surefire test" - org.apache.brooklyn.core.config.BrooklynPropertiesFromGroovyTest.testGetFirstUsingFailIfNoneWithClosure()
2018-04-28 23:08:33,419 WARN  - Use of groovy.lang.Closure is deprecated as value for 'failIfNone', in BrooklynProperties.getFirst()
2018-04-28 23:08:33,419 INFO  - TESTNG PASSED: "Surefire test" - org.apache.brooklyn.core.config.BrooklynPropertiesFromGroovyTest.testGetFirstUsingFailIfNoneWithClosure() finished in 1 ms
2018-04-28 23:08:33,420 INFO  - TESTNG INVOKING: "Surefire test" - org.apache.brooklyn.core.config.external.InPlaceExternalConfigSupplierTest.testInPlace()
2018-04-28 23:08:33,420 INFO  - Added external config supplier named 'brooklyn-demo-sample': org.apache.brooklyn.core.config.external.InPlaceExternalConfigSupplier@34aa4b40
2018-04-28 23:08:33,421 INFO  - Added external config supplier named 'foo': org.apache.brooklyn.core.config.external.InPlaceExternalConfigSupplier@5208c800
2018-04-28 23:08:33,421 INFO  - TESTNG PASSED: "Surefire test" - org.apache.brooklyn.core.config.external.InPlaceExternalConfigSupplierTest.testInPlace() finished in 1 ms
2018-04-28 23:08:33,421 INFO  - TESTNG INVOKING CONFIGURATION: "Surefire test" - @AfterMethod org.apache.brooklyn.core.config.external.InPlaceExternalConfigSupplierTest.tearDown()
2018-04-28 23:08:33,421 INFO  - TESTNG PASSED CONFIGURATION: "Surefire test" - @AfterMethod org.apache.brooklyn.core.config.external.InPlaceExternalConfigSupplierTest.tearDown() finished in 0 ms
2018-04-28 23:08:33,421 INFO  - TESTNG INVOKING CONFIGURATION: "Surefire test" - @BeforeMethod org.apache.brooklyn.core.config.external.PropertiesFileExternalConfigSupplierTest.setUp()
2018-04-28 23:08:33,422 INFO  - TESTNG PASSED CONFIGURATION: "Surefire test" - @BeforeMethod org.apache.brooklyn.core.config.external.PropertiesFileExternalConfigSupplierTest.setUp() finished in 1 ms
2018-04-28 23:08:33,422 INFO  - TESTNG INVOKING: "Surefire test" - org.apache.brooklyn.core.config.external.PropertiesFileExternalConfigSupplierTest.testFromProperties()
2018-04-28 23:08:33,423 INFO  - Added external config supplier named 'brooklyn-demo-sample': org.apache.brooklyn.core.config.external.InPlaceExternalConfigSupplier@5cca8100
2018-04-28 23:08:33,423 INFO  - Added external config supplier named 'foo': org.apache.brooklyn.core.config.external.PropertiesFileExternalConfigSupplier@7cdc3101
2018-04-28 23:08:33,424 INFO  - TESTNG PASSED: "Surefire test" - org.apache.brooklyn.core.config.external.PropertiesFileExternalConfigSupplierTest.testFromProperties() finished in 2 ms
2018-04-28 23:08:33,424 INFO  - TESTNG INVOKING CONFIGURATION: "Surefire test" - @AfterMethod org.apache.brooklyn.core.config.external.PropertiesFileExternalConfigSupplierTest.tearDown()
2018-04-28 23:08:33,426 INFO  - TESTNG PASSED CONFIGURATION: "Surefire test" - @AfterMethod org.apache.brooklyn.core.config.external.PropertiesFileExternalConfigSupplierTest.tearDown() finished in 2 ms
[GC (Allocation Failure)  460887K->267689K(758272K), 0.0232919 secs]
2018-04-28 23:08:33,647 INFO  - TESTNG 
===============================================
    Surefire test
    Tests run: 2316, Failures: 1, Skips: 0
===============================================
[GC (Allocation Failure)  471465K->264425K(756224K), 0.0067197 secs]
[GC (Allocation Failure)  468201K->264688K(759808K), 0.0169938 secs]
[GC (Allocation Failure)  472560K->264441K(758784K), 0.0234466 secs]
[GC (Allocation Failure)  472313K->264537K(761856K), 0.0178628 secs]
[GC (Allocation Failure)  476505K->264425K(760832K), 0.0059057 secs]
[GC (Allocation Failure)  476393K->265885K(764416K), 0.0312644 secs]
Tests run: 2316, Failures: 1, Errors: 0, Skipped: 0, Time elapsed: 143.094 sec <<< FAILURE! - in TestSuite
testCommandExecutedWithEnvironment(org.apache.brooklyn.entity.group.SshCommandMembershipTrackingPolicyTest)  Time elapsed: 0.03 sec  <<< FAILURE!
java.lang.AssertionError: Lists differ at element [0]: echo ignored != mkdir -p '/path/to/myexecutiondir' && cd '/path/to/myexecutiondir' && echo 'myval' expected [echo ignored] but found [mkdir -p '/path/to/myexecutiondir' && cd '/path/to/myexecutiondir' && echo 'myval']
	at org.apache.brooklyn.entity.group.SshCommandMembershipTrackingPolicyTest.testCommandExecutedWithEnvironment(SshCommandMembershipTrackingPolicyTest.java:90)

2018-04-28 23:08:36,328 INFO  - Brooklyn shutdown: stopping entities [TestEntityImpl{id=xpt96gi7zl}, TestEntityImpl{id=w0zfkxhovk}, BlockingEntityImpl{id=vdhwdjlc7p}]

Results :

Failed tests: 
  SshCommandMembershipTrackingPolicyTest.testCommandExecutedWithEnvironment:90 Lists differ at element [0]: echo ignored != mkdir -p '/path/to/myexecutiondir' && cd '/path/to/myexecutiondir' && echo 'myval' expected [echo ignored] but found [mkdir -p '/path/to/myexecutiondir' && cd '/path/to/myexecutiondir' && echo 'myval']

Tests run: 2316, Failures: 1, Errors: 0, Skipped: 0

[INFO] ------------------------------------------------------------------------
[INFO] Reactor Summary:
[INFO] 
[INFO] Brooklyn REST JavaScript Web GUI ................... SUCCESS [ 34.937 s]
[INFO] Brooklyn Server Root ............................... SUCCESS [  0.253 s]
[INFO] Brooklyn Parent Project ............................ SUCCESS [  2.458 s]
[INFO] Brooklyn Test Support Utilities .................... SUCCESS [  3.849 s]
[INFO] Brooklyn Logback Includable Configuration .......... SUCCESS [  0.411 s]
[INFO] Brooklyn Common Utilities .......................... SUCCESS [ 20.918 s]
[INFO] Brooklyn API ....................................... SUCCESS [  1.652 s]
[INFO] CAMP Server Parent Project ......................... SUCCESS [  0.660 s]
[INFO] CAMP Base .......................................... SUCCESS [  2.452 s]
[INFO] Brooklyn Test Support .............................. SUCCESS [  1.036 s]
[INFO] Brooklyn REST Swagger Apidoc Utilities ............. SUCCESS [  1.498 s]
[INFO] Brooklyn Logback Configuration ..................... SUCCESS [  0.222 s]
[INFO] CAMP Server ........................................ SUCCESS [  6.348 s]
[INFO] Brooklyn Felix Runtime ............................. SUCCESS [  2.735 s]
[INFO] Brooklyn Groovy Utilities .......................... SUCCESS [  2.138 s]
[INFO] Brooklyn Core ...................................... FAILURE [03:01 min]
[INFO] Brooklyn Policies .................................. SKIPPED
[INFO] Brooklyn WinRM Software Entities ................... SKIPPED
[INFO] Brooklyn Secure JMXMP Agent ........................ SKIPPED
[INFO] Brooklyn JMX RMI Agent ............................. SKIPPED
[INFO] Brooklyn Jclouds Location Targets .................. SKIPPED
[INFO] Brooklyn Software Base ............................. SKIPPED
[INFO] Brooklyn CAMP ...................................... SKIPPED
[INFO] Brooklyn Launcher Common ........................... SKIPPED
[INFO] Brooklyn REST API .................................. SKIPPED
[INFO] Brooklyn REST Resources ............................ SKIPPED
[INFO] Brooklyn REST Server ............................... SKIPPED
[INFO] Brooklyn Launcher .................................. SKIPPED
[INFO] Brooklyn Container Location Targets ................ SKIPPED
[INFO] Brooklyn Command Line Interface .................... SKIPPED
[INFO] Brooklyn Test Framework ............................ SKIPPED
[INFO] Brooklyn OSGi init ................................. SKIPPED
[INFO] Brooklyn OSGi start ................................ SKIPPED
[INFO] Brooklyn Karaf ..................................... SKIPPED
[INFO] Jetty config fragment .............................. SKIPPED
[INFO] Apache Http Component extension .................... SKIPPED
[INFO] Brooklyn Karaf Features ............................ SKIPPED
[INFO] Brooklyn Karaf Shell Commands ...................... SKIPPED
[INFO] Brooklyn Library Root .............................. SKIPPED
[INFO] Brooklyn CM Chef ................................... SKIPPED
[INFO] Brooklyn CM SaltStack .............................. SKIPPED
[INFO] Brooklyn CM Ansible ................................ SKIPPED
[INFO] Brooklyn CM Integration Root ....................... SKIPPED
[INFO] Brooklyn Network Software Entities ................. SKIPPED
[INFO] Brooklyn OSGi Software Entities .................... SKIPPED
[INFO] Brooklyn Database Software Entities ................ SKIPPED
[INFO] Brooklyn Web App Software Entities ................. SKIPPED
[INFO] Brooklyn Messaging Software Entities ............... SKIPPED
[INFO] Brooklyn NoSQL Data Store Software Entities ........ SKIPPED
[INFO] Brooklyn Monitoring Software Entities .............. SKIPPED
[INFO] Brooklyn Web App Software Entities ................. SKIPPED
[INFO] Brooklyn QA ........................................ SKIPPED
[INFO] Brooklyn Examples Aggregator Project ............... SKIPPED
[INFO] Brooklyn Examples Aggregator Project - Webapps ..... SKIPPED
[INFO] hello-world-webapp Maven Webapp .................... SKIPPED
[INFO] hello-world-sql-webapp Maven Webapp ................ SKIPPED
[INFO] Brooklyn Simple Web Cluster Example ................ SKIPPED
[INFO] Brooklyn Library Karaf integration ................. SKIPPED
[INFO] Brooklyn Library Catalog ........................... SKIPPED
[INFO] Brooklyn Library Karaf Features .................... SKIPPED
[INFO] Brooklyn Client .................................... SKIPPED
[INFO] Brooklyn Client Command Line Interface ............. SKIPPED
[INFO] Brooklyn REST java Client .......................... SKIPPED
[INFO] Brooklyn Downstream Project Parent ................. SKIPPED
[INFO] Brooklyn Dist Root ................................. SKIPPED
[INFO] Brooklyn All Things ................................ SKIPPED
[INFO] Brooklyn Distribution .............................. SKIPPED
[INFO] Brooklyn Karaf Distribution Parent ................. SKIPPED
[INFO] Brooklyn Karaf Server Configuration ................ SKIPPED
[INFO] Brooklyn Dist Karaf Features ....................... SKIPPED
[INFO] Brooklyn Karaf Distribution ........................ SKIPPED
[INFO] Brooklyn Karaf pax-exam itest ...................... SKIPPED
[INFO] Brooklyn Vagrant Getting Started Environment ....... SKIPPED
[INFO] Brooklyn Quick-Start Project Archetype ............. SKIPPED
[INFO] Brooklyn Shared Package Files ...................... SKIPPED
[INFO] Brooklyn RPM Package ............................... SKIPPED
[INFO] Brooklyn DEB Package ............................... SKIPPED
[INFO] Brooklyn Root ...................................... SKIPPED
[INFO] ------------------------------------------------------------------------
[INFO] BUILD FAILURE
[INFO] ------------------------------------------------------------------------
[INFO] Total time: 04:42 min
[INFO] Finished at: 2018-04-28T23:08:36Z
[INFO] Final Memory: 92M/757M
[INFO] ------------------------------------------------------------------------
[ERROR] Failed to execute goal org.apache.maven.plugins:maven-surefire-plugin:2.19.1:test (default-test) on project brooklyn-core: There are test failures.
[ERROR] 
[ERROR] Please refer to /usr/build/brooklyn-server/core/target/surefire-reports for the individual test results.
[ERROR] -> [Help 1]
[ERROR] 
[ERROR] To see the full stack trace of the errors, re-run Maven with the -e switch.
[ERROR] Re-run Maven using the -X switch to enable full debug logging.
[ERROR] 
[ERROR] For more information about the errors and possible solutions, please read the following articles:
[ERROR] [Help 1] http://cwiki.apache.org/confluence/display/MAVEN/MojoFailureException
[ERROR] 
[ERROR] After correcting the problems, you can resume the build with the command
[ERROR]   mvn <goals> -rf :brooklyn-core
Build step 'Execute shell' marked build as failure
Recording test results
TestNG Reports Processing: START
Looking for TestNG results report in workspace using pattern: **/testng-results.xml
testng-results.xml was last modified before this build started. Ignoring it.
testng-results.xml was last modified before this build started. Ignoring it.
testng-results.xml was last modified before this build started. Ignoring it.
testng-results.xml was last modified before this build started. Ignoring it.
testng-results.xml was last modified before this build started. Ignoring it.
testng-results.xml was last modified before this build started. Ignoring it.
testng-results.xml was last modified before this build started. Ignoring it.
testng-results.xml was last modified before this build started. Ignoring it.
testng-results.xml was last modified before this build started. Ignoring it.
testng-results.xml was last modified before this build started. Ignoring it.
testng-results.xml was last modified before this build started. Ignoring it.
testng-results.xml was last modified before this build started. Ignoring it.
testng-results.xml was last modified before this build started. Ignoring it.
testng-results.xml was last modified before this build started. Ignoring it.
testng-results.xml was last modified before this build started. Ignoring it.
testng-results.xml was last modified before this build started. Ignoring it.
testng-results.xml was last modified before this build started. Ignoring it.
testng-results.xml was last modified before this build started. Ignoring it.
testng-results.xml was last modified before this build started. Ignoring it.
testng-results.xml was last modified before this build started. Ignoring it.
testng-results.xml was last modified before this build started. Ignoring it.
testng-results.xml was last modified before this build started. Ignoring it.
testng-results.xml was last modified before this build started. Ignoring it.
testng-results.xml was last modified before this build started. Ignoring it.
testng-results.xml was last modified before this build started. Ignoring it.
testng-results.xml was last modified before this build started. Ignoring it.
testng-results.xml was last modified before this build started. Ignoring it.
testng-results.xml was last modified before this build started. Ignoring it.
testng-results.xml was last modified before this build started. Ignoring it.
Saving reports...
Processing '/x1/jenkins/jenkins-home/jobs/brooklyn-master-build-docker/builds/387/testng/testng-results-1.xml'
Processing '/x1/jenkins/jenkins-home/jobs/brooklyn-master-build-docker/builds/387/testng/testng-results-2.xml'
Processing '/x1/jenkins/jenkins-home/jobs/brooklyn-master-build-docker/builds/387/testng/testng-results-3.xml'
Processing '/x1/jenkins/jenkins-home/jobs/brooklyn-master-build-docker/builds/387/testng/testng-results-4.xml'
Processing '/x1/jenkins/jenkins-home/jobs/brooklyn-master-build-docker/builds/387/testng/testng-results-5.xml'
Processing '/x1/jenkins/jenkins-home/jobs/brooklyn-master-build-docker/builds/387/testng/testng-results.xml'
0.034223% of tests failed, which exceeded threshold of 0%. Marking build as UNSTABLE
TestNG Reports Processing: FINISH