osdir.com

[Date Prev][Date Next][Thread Prev][Thread Next][Date Index][Thread Index]

Build failed in Jenkins: brooklyn-master-build-docker #333


See <https://builds.apache.org/job/brooklyn-master-build-docker/333/display/redirect>

------------------------------------------
[...truncated 3.51 MB...]
2018-04-06 23:08:35,628 INFO  - in-mem-test-AxE6 writing enrichers/qtjw1za4ca -->1787; totals: out=3.92 kB in=30 B
2018-04-06 23:08:35,628 INFO  - in-mem-test-AxE6 writing enrichers/zc5t9i5drk -->3303; totals: out=7.23 kB in=30 B
2018-04-06 23:08:35,628 INFO  - in-mem-test-AxE6 writing entities/ol3d84n8i5 -->3075; totals: out=10.3 kB in=30 B
2018-04-06 23:08:35,628 INFO  - in-mem-test-AxE6 writing enrichers/z404492vzw -->698; totals: out=11.0 kB in=30 B
2018-04-06 23:08:35,629 INFO  - in-mem-test-AxE6 writing enrichers/e8cdsrq04o -->3303; totals: out=14.3 kB in=30 B
2018-04-06 23:08:35,629 INFO  - in-mem-test-AxE6 writing enrichers/gos27chinr -->553; totals: out=14.9 kB in=30 B
2018-04-06 23:08:35,629 INFO  - in-mem-test-AxE6 writing enrichers/kkox7obgt7 -->553; totals: out=15.4 kB in=30 B
2018-04-06 23:08:35,629 INFO  - in-mem-test-AxE6 requesting list entities -->9; totals: out=15.4 kB in=30 B
2018-04-06 23:08:35,630 INFO  - in-mem-test-AxE6 receiving list entities <--42; totals: out=15.4 kB in=72 B
2018-04-06 23:08:35,630 INFO  - in-mem-test-AxE6 requesting list locations -->10; totals: out=15.4 kB in=72 B
2018-04-06 23:08:35,630 INFO  - in-mem-test-AxE6 receiving list locations <--22; totals: out=15.4 kB in=94 B
2018-04-06 23:08:35,630 INFO  - in-mem-test-AxE6 requesting list policies -->9; totals: out=15.4 kB in=94 B
2018-04-06 23:08:35,630 INFO  - in-mem-test-AxE6 receiving list policies <--21; totals: out=15.4 kB in=115 B
2018-04-06 23:08:35,630 INFO  - in-mem-test-AxE6 requesting list enrichers -->10; totals: out=15.4 kB in=115 B
2018-04-06 23:08:35,630 INFO  - in-mem-test-AxE6 receiving list enrichers <--132; totals: out=15.4 kB in=247 B
2018-04-06 23:08:35,630 INFO  - in-mem-test-AxE6 requesting list feeds -->6; totals: out=15.5 kB in=247 B
2018-04-06 23:08:35,630 INFO  - in-mem-test-AxE6 receiving list feeds <--2; totals: out=15.5 kB in=249 B
2018-04-06 23:08:35,630 INFO  - in-mem-test-AxE6 requesting list catalog -->8; totals: out=15.5 kB in=249 B
2018-04-06 23:08:35,630 INFO  - in-mem-test-AxE6 receiving list catalog <--2; totals: out=15.5 kB in=251 B
2018-04-06 23:08:35,630 INFO  - in-mem-test-AxE6 requesting list bundles -->8; totals: out=15.5 kB in=251 B
2018-04-06 23:08:35,630 INFO  - in-mem-test-AxE6 receiving list bundles <--2; totals: out=15.5 kB in=253 B
2018-04-06 23:08:35,631 INFO  - in-mem-test-AxE6 requesting planeId -->7; totals: out=15.5 kB in=253 B
2018-04-06 23:08:35,631 INFO  - in-mem-test-AxE6 reading planeId <--8; totals: out=15.5 kB in=261 B
2018-04-06 23:08:35,631 INFO  - in-mem-test-AxE6 requesting entities/o46ahbckob -->19; totals: out=15.5 kB in=261 B
2018-04-06 23:08:35,631 INFO  - in-mem-test-AxE6 requesting locations/wl7x6ipd3y -->20; totals: out=15.5 kB in=261 B
2018-04-06 23:08:35,631 INFO  - in-mem-test-AxE6 requesting policies/u78y2m0z24 -->19; totals: out=15.6 kB in=261 B
2018-04-06 23:08:35,631 INFO  - in-mem-test-AxE6 reading entities/o46ahbckob <--532; totals: out=15.6 kB in=1781 B
2018-04-06 23:08:35,631 INFO  - in-mem-test-AxE6 reading locations/wl7x6ipd3y <--988; totals: out=15.6 kB in=2.16 kB
2018-04-06 23:08:35,631 INFO  - in-mem-test-AxE6 reading policies/u78y2m0z24 <--377; totals: out=15.6 kB in=2.16 kB
2018-04-06 23:08:35,631 INFO  - in-mem-test-AxE6 requesting enrichers/e8cdsrq04o -->20; totals: out=15.6 kB in=2.16 kB
2018-04-06 23:08:35,631 INFO  - in-mem-test-AxE6 reading enrichers/e8cdsrq04o <--3303; totals: out=15.6 kB in=5.46 kB
2018-04-06 23:08:35,632 INFO  - in-mem-test-AxE6 requesting enrichers/zc5t9i5drk -->20; totals: out=15.6 kB in=5.46 kB
2018-04-06 23:08:35,632 INFO  - in-mem-test-AxE6 reading enrichers/zc5t9i5drk <--3303; totals: out=15.6 kB in=8.76 kB
2018-04-06 23:08:35,632 INFO  - in-mem-test-AxE6 requesting enrichers/gos27chinr -->20; totals: out=15.6 kB in=8.76 kB
2018-04-06 23:08:35,632 INFO  - in-mem-test-AxE6 reading enrichers/gos27chinr <--553; totals: out=15.6 kB in=9.32 kB
2018-04-06 23:08:35,632 INFO  - in-mem-test-AxE6 requesting enrichers/kkox7obgt7 -->20; totals: out=15.6 kB in=9.32 kB
2018-04-06 23:08:35,632 INFO  - in-mem-test-AxE6 requesting enrichers/qtjw1za4ca -->20; totals: out=15.7 kB in=9.32 kB
2018-04-06 23:08:35,632 INFO  - in-mem-test-AxE6 reading enrichers/kkox7obgt7 <--553; totals: out=15.7 kB in=9.87 kB
2018-04-06 23:08:35,632 INFO  - in-mem-test-AxE6 reading enrichers/qtjw1za4ca <--1787; totals: out=15.7 kB in=11.7 kB
2018-04-06 23:08:35,633 INFO  - in-mem-test-AxE6 requesting enrichers/z404492vzw -->20; totals: out=15.7 kB in=11.7 kB
2018-04-06 23:08:35,633 INFO  - in-mem-test-AxE6 reading enrichers/z404492vzw <--698; totals: out=15.7 kB in=12.4 kB
2018-04-06 23:08:35,633 INFO  - in-mem-test-AxE6 requesting entities/ol3d84n8i5 -->19; totals: out=15.5 kB in=12.4 kB
2018-04-06 23:08:35,633 INFO  - in-mem-test-AxE6 reading entities/ol3d84n8i5 <--3075; totals: out=15.7 kB in=15.4 kB
2018-04-06 23:08:35,635 INFO  - in-mem-test-AxE6 requesting planeId -->7; totals: out=15.7 kB in=15.4 kB
2018-04-06 23:08:35,635 INFO  - in-mem-test-AxE6 writing entities/ol3d84n8i5 -->3075; totals: out=18.8 kB in=15.4 kB
2018-04-06 23:08:35,635 INFO  - in-mem-test-AxE6 writing entities/o46ahbckob -->532; totals: out=19.3 kB in=15.4 kB
2018-04-06 23:08:35,635 INFO  - in-mem-test-AxE6 reading planeId <--8; totals: out=19.3 kB in=15.4 kB
2018-04-06 23:08:35,635 INFO  - in-mem-test-AxE6 writing locations/wl7x6ipd3y -->988; totals: out=20.3 kB in=15.4 kB
2018-04-06 23:08:35,635 INFO  - in-mem-test-AxE6 writing enrichers/zc5t9i5drk -->3303; totals: out=27.3 kB in=15.4 kB
2018-04-06 23:08:35,635 INFO  - in-mem-test-AxE6 writing enrichers/e8cdsrq04o -->3303; totals: out=24.0 kB in=15.4 kB
2018-04-06 23:08:35,635 INFO  - in-mem-test-AxE6 writing enrichers/gos27chinr -->553; totals: out=27.8 kB in=15.4 kB
2018-04-06 23:08:35,635 INFO  - in-mem-test-AxE6 writing enrichers/kkox7obgt7 -->553; totals: out=28.4 kB in=15.4 kB
2018-04-06 23:08:35,635 INFO  - in-mem-test-AxE6 writing enrichers/qtjw1za4ca -->1787; totals: out=30.1 kB in=15.4 kB
2018-04-06 23:08:35,636 INFO  - in-mem-test-AxE6 writing enrichers/z404492vzw -->698; totals: out=30.8 kB in=15.4 kB
2018-04-06 23:08:35,637 INFO  - in-mem-test-AxE6 writing policies/u78y2m0z24 -->377; totals: out=20.7 kB in=15.4 kB
2018-04-06 23:08:35,637 INFO  - TESTNG PASSED: "Surefire test" - org.apache.brooklyn.core.mgmt.persist.BrooklynMementoPersisterTestFixture.testLoadAndCheckpointRawMemento() finished in 13 ms
2018-04-06 23:08:35,637 INFO  - TESTNG INVOKING CONFIGURATION: "Surefire test" - @AfterMethod org.apache.brooklyn.core.mgmt.persist.BrooklynMementoPersisterTestFixture.tearDown()
2018-04-06 23:08:35,649 INFO  - in-mem-test-AxE6 deleting entities/ol3d84n8i5 -->19; totals: out=30.9 kB in=15.4 kB
2018-04-06 23:08:35,649 INFO  - in-mem-test-AxE6 deleting policies/u78y2m0z24 -->19; totals: out=30.9 kB in=15.4 kB
2018-04-06 23:08:35,649 INFO  - in-mem-test-AxE6 deleting locations/wl7x6ipd3y -->20; totals: out=30.9 kB in=15.4 kB
2018-04-06 23:08:35,649 INFO  - in-mem-test-AxE6 deleting enrichers/zc5t9i5drk -->20; totals: out=30.9 kB in=15.4 kB
2018-04-06 23:08:35,649 INFO  - in-mem-test-AxE6 deleting enrichers/kkox7obgt7 -->20; totals: out=31.0 kB in=15.4 kB
2018-04-06 23:08:35,650 INFO  - in-mem-test-AxE6 deleting enrichers/e8cdsrq04o -->20; totals: out=31.0 kB in=15.4 kB
2018-04-06 23:08:35,650 INFO  - in-mem-test-AxE6 deleting enrichers/gos27chinr -->20; totals: out=31.0 kB in=15.4 kB
2018-04-06 23:08:35,649 INFO  - in-mem-test-AxE6 deleting entities/o46ahbckob -->19; totals: out=30.9 kB in=15.4 kB
2018-04-06 23:08:35,649 INFO  - in-mem-test-AxE6 deleting enrichers/z404492vzw -->20; totals: out=31.0 kB in=15.4 kB
2018-04-06 23:08:35,649 INFO  - in-mem-test-AxE6 deleting enrichers/qtjw1za4ca -->20; totals: out=31.0 kB in=15.4 kB
2018-04-06 23:08:35,651 WARN  - Entities.destroyAll invoked on non-deployment NonDeploymentManagementContext{entity=ol3d84n8i5, mode=MANAGEMENT_STOPPED} - not likely to have much effect! (This usually means the mgmt context has been taken from an entity that has been destroyed. To destroy other things on the management context ensure you keep a handle to the context before the entity is destroyed, such as by creating the management context first.)
2018-04-06 23:08:35,651 INFO  - in-mem-test-FYXt deleting completely -->1; totals: out=42.2 kB in=30 B
2018-04-06 23:08:35,651 INFO  - TESTNG PASSED CONFIGURATION: "Surefire test" - @AfterMethod org.apache.brooklyn.core.mgmt.persist.BrooklynMementoPersisterTestFixture.tearDown() finished in 14 ms
2018-04-06 23:08:35,652 INFO  - TESTNG INVOKING: "Surefire test" - org.apache.brooklyn.core.mgmt.persist.DeserializingClassRenamesProviderTest.testRename()
2018-04-06 23:08:35,652 INFO  - TESTNG PASSED: "Surefire test" - org.apache.brooklyn.core.mgmt.persist.DeserializingClassRenamesProviderTest.testRename() finished in 1 ms
2018-04-06 23:08:35,652 INFO  - TESTNG INVOKING: "Surefire test" - org.apache.brooklyn.core.mgmt.persist.DeserializingClassRenamesProviderTest.testRenameInnerClass()
2018-04-06 23:08:35,653 INFO  - TESTNG PASSED: "Surefire test" - org.apache.brooklyn.core.mgmt.persist.DeserializingClassRenamesProviderTest.testRenameInnerClass() finished in 1 ms
2018-04-06 23:08:35,653 INFO  - TESTNG INVOKING: "Surefire test" - org.apache.brooklyn.core.mgmt.persist.DeserializingClassRenamesProviderTest.testRenameNoopIfNotInProperties()
2018-04-06 23:08:35,653 INFO  - TESTNG PASSED: "Surefire test" - org.apache.brooklyn.core.mgmt.persist.DeserializingClassRenamesProviderTest.testRenameNoopIfNotInProperties() finished in 0 ms
2018-04-06 23:08:35,868 INFO  - TESTNG 
===============================================
    Surefire test
    Tests run: 2314, Failures: 1, Skips: 0
===============================================
[GC (Allocation Failure)  468370K->281805K(748032K), 0.0123065 secs]
[GC (Allocation Failure)  468173K->280565K(751616K), 0.0062084 secs]
[GC (Allocation Failure)  472053K->280541K(750592K), 0.0054762 secs]
[GC (Allocation Failure)  472029K->280485K(753664K), 0.0072567 secs]
[GC (Allocation Failure)  476069K->280629K(752640K), 0.0088523 secs]
[GC (Allocation Failure)  476213K->280683K(756224K), 0.0092767 secs]
[GC (Allocation Failure)  480875K->281494K(754688K), 0.0056466 secs]
Tests run: 2314, Failures: 1, Errors: 0, Skipped: 0, Time elapsed: 164.892 sec <<< FAILURE! - in TestSuite
testManuallySettingIndicatorsOnApplications(org.apache.brooklyn.core.entity.lifecycle.ServiceStateLogicTest)  Time elapsed: 30.553 sec  <<< FAILURE!
java.lang.AssertionError: failed succeeds-eventually, 75 attempts, 30000ms elapsed: AssertionError: entity=Application[o8998pp0]; attribute=Sensor: service.state (org.apache.brooklyn.core.entity.lifecycle.Lifecycle) expected [running] but found [on-fire]
	at org.apache.brooklyn.core.entity.lifecycle.ServiceStateLogicTest.assertAttributeEqualsEventually(ServiceStateLogicTest.java:339)
	at org.apache.brooklyn.core.entity.lifecycle.ServiceStateLogicTest.testManuallySettingIndicatorsOnApplications(ServiceStateLogicTest.java:270)
Caused by: java.lang.AssertionError: entity=Application[o8998pp0]; attribute=Sensor: service.state (org.apache.brooklyn.core.entity.lifecycle.Lifecycle) expected [running] but found [on-fire]
	at org.apache.brooklyn.core.entity.lifecycle.ServiceStateLogicTest.assertAttributeEqualsEventually(ServiceStateLogicTest.java:339)
	at org.apache.brooklyn.core.entity.lifecycle.ServiceStateLogicTest.testManuallySettingIndicatorsOnApplications(ServiceStateLogicTest.java:270)

2018-04-06 23:08:37,903 INFO  - Brooklyn shutdown: stopping entities [TestEntityImpl{id=g36982pwug}, TestEntityImpl{id=vxgkg1nhu7}, BlockingEntityImpl{id=jfpm13fdu6}]

Results :

Failed tests: 
  ServiceStateLogicTest.testManuallySettingIndicatorsOnApplications:270->assertAttributeEqualsEventually:339 failed succeeds-eventually, 75 attempts, 30000ms elapsed: AssertionError: entity=Application[o8998pp0]; attribute=Sensor: service.state (org.apache.brooklyn.core.entity.lifecycle.Lifecycle) expected [running] but found [on-fire]

Tests run: 2314, Failures: 1, Errors: 0, Skipped: 0

[INFO] ------------------------------------------------------------------------
[INFO] Reactor Summary:
[INFO] 
[INFO] Brooklyn REST JavaScript Web GUI ................... SUCCESS [ 31.600 s]
[INFO] Brooklyn Server Root ............................... SUCCESS [  0.163 s]
[INFO] Brooklyn Parent Project ............................ SUCCESS [  2.925 s]
[INFO] Brooklyn Test Support Utilities .................... SUCCESS [  3.061 s]
[INFO] Brooklyn Logback Includable Configuration .......... SUCCESS [  0.288 s]
[INFO] Brooklyn Common Utilities .......................... SUCCESS [ 19.007 s]
[INFO] Brooklyn API ....................................... SUCCESS [  1.328 s]
[INFO] CAMP Server Parent Project ......................... SUCCESS [  0.446 s]
[INFO] CAMP Base .......................................... SUCCESS [  2.318 s]
[INFO] Brooklyn Test Support .............................. SUCCESS [  0.843 s]
[INFO] Brooklyn REST Swagger Apidoc Utilities ............. SUCCESS [  1.108 s]
[INFO] Brooklyn Logback Configuration ..................... SUCCESS [  0.160 s]
[INFO] CAMP Server ........................................ SUCCESS [  4.820 s]
[INFO] Brooklyn Felix Runtime ............................. SUCCESS [  2.128 s]
[INFO] Brooklyn Groovy Utilities .......................... SUCCESS [  1.787 s]
[INFO] Brooklyn Core ...................................... FAILURE [03:20 min]
[INFO] Brooklyn Policies .................................. SKIPPED
[INFO] Brooklyn WinRM Software Entities ................... SKIPPED
[INFO] Brooklyn Secure JMXMP Agent ........................ SKIPPED
[INFO] Brooklyn JMX RMI Agent ............................. SKIPPED
[INFO] Brooklyn Jclouds Location Targets .................. SKIPPED
[INFO] Brooklyn Software Base ............................. SKIPPED
[INFO] Brooklyn CAMP ...................................... SKIPPED
[INFO] Brooklyn Launcher Common ........................... SKIPPED
[INFO] Brooklyn REST API .................................. SKIPPED
[INFO] Brooklyn REST Resources ............................ SKIPPED
[INFO] Brooklyn REST Server ............................... SKIPPED
[INFO] Brooklyn Launcher .................................. SKIPPED
[INFO] Brooklyn Container Location Targets ................ SKIPPED
[INFO] Brooklyn Command Line Interface .................... SKIPPED
[INFO] Brooklyn Test Framework ............................ SKIPPED
[INFO] Brooklyn OSGi init ................................. SKIPPED
[INFO] Brooklyn OSGi start ................................ SKIPPED
[INFO] Brooklyn Karaf ..................................... SKIPPED
[INFO] Jetty config fragment .............................. SKIPPED
[INFO] Apache Http Component extension .................... SKIPPED
[INFO] Brooklyn Karaf Features ............................ SKIPPED
[INFO] Brooklyn Karaf Shell Commands ...................... SKIPPED
[INFO] Brooklyn Library Root .............................. SKIPPED
[INFO] Brooklyn CM Chef ................................... SKIPPED
[INFO] Brooklyn CM SaltStack .............................. SKIPPED
[INFO] Brooklyn CM Ansible ................................ SKIPPED
[INFO] Brooklyn CM Integration Root ....................... SKIPPED
[INFO] Brooklyn Network Software Entities ................. SKIPPED
[INFO] Brooklyn OSGi Software Entities .................... SKIPPED
[INFO] Brooklyn Database Software Entities ................ SKIPPED
[INFO] Brooklyn Web App Software Entities ................. SKIPPED
[INFO] Brooklyn Messaging Software Entities ............... SKIPPED
[INFO] Brooklyn NoSQL Data Store Software Entities ........ SKIPPED
[INFO] Brooklyn Monitoring Software Entities .............. SKIPPED
[INFO] Brooklyn Web App Software Entities ................. SKIPPED
[INFO] Brooklyn QA ........................................ SKIPPED
[INFO] Brooklyn Examples Aggregator Project ............... SKIPPED
[INFO] Brooklyn Examples Aggregator Project - Webapps ..... SKIPPED
[INFO] hello-world-webapp Maven Webapp .................... SKIPPED
[INFO] hello-world-sql-webapp Maven Webapp ................ SKIPPED
[INFO] Brooklyn Simple Web Cluster Example ................ SKIPPED
[INFO] Brooklyn Library Karaf integration ................. SKIPPED
[INFO] Brooklyn Library Catalog ........................... SKIPPED
[INFO] Brooklyn Library Karaf Features .................... SKIPPED
[INFO] Brooklyn Client .................................... SKIPPED
[INFO] Brooklyn Client Command Line Interface ............. SKIPPED
[INFO] Brooklyn REST java Client .......................... SKIPPED
[INFO] Brooklyn Downstream Project Parent ................. SKIPPED
[INFO] Brooklyn Dist Root ................................. SKIPPED
[INFO] Brooklyn All Things ................................ SKIPPED
[INFO] Brooklyn Distribution .............................. SKIPPED
[INFO] Brooklyn Karaf Distribution Parent ................. SKIPPED
[INFO] Brooklyn Karaf Server Configuration ................ SKIPPED
[INFO] Brooklyn Dist Karaf Features ....................... SKIPPED
[INFO] Brooklyn Karaf Distribution ........................ SKIPPED
[INFO] Brooklyn Karaf pax-exam itest ...................... SKIPPED
[INFO] Brooklyn Vagrant Getting Started Environment ....... SKIPPED
[INFO] Brooklyn Quick-Start Project Archetype ............. SKIPPED
[INFO] Brooklyn Shared Package Files ...................... SKIPPED
[INFO] Brooklyn RPM Package ............................... SKIPPED
[INFO] Brooklyn DEB Package ............................... SKIPPED
[INFO] Brooklyn Root ...................................... SKIPPED
[INFO] ------------------------------------------------------------------------
[INFO] BUILD FAILURE
[INFO] ------------------------------------------------------------------------
[INFO] Total time: 04:39 min
[INFO] Finished at: 2018-04-06T23:08:38Z
[INFO] Final Memory: 92M/821M
[INFO] ------------------------------------------------------------------------
[ERROR] Failed to execute goal org.apache.maven.plugins:maven-surefire-plugin:2.19.1:test (default-test) on project brooklyn-core: There are test failures.
[ERROR] 
[ERROR] Please refer to /usr/build/brooklyn-server/core/target/surefire-reports for the individual test results.
[ERROR] -> [Help 1]
[ERROR] 
[ERROR] To see the full stack trace of the errors, re-run Maven with the -e switch.
[ERROR] Re-run Maven using the -X switch to enable full debug logging.
[ERROR] 
[ERROR] For more information about the errors and possible solutions, please read the following articles:
[ERROR] [Help 1] http://cwiki.apache.org/confluence/display/MAVEN/MojoFailureException
[ERROR] 
[ERROR] After correcting the problems, you can resume the build with the command
[ERROR]   mvn <goals> -rf :brooklyn-core
Build step 'Execute shell' marked build as failure
Recording test results
TestNG Reports Processing: START
Looking for TestNG results report in workspace using pattern: **/testng-results.xml
testng-results.xml was last modified before this build started. Ignoring it.
testng-results.xml was last modified before this build started. Ignoring it.
testng-results.xml was last modified before this build started. Ignoring it.
testng-results.xml was last modified before this build started. Ignoring it.
testng-results.xml was last modified before this build started. Ignoring it.
testng-results.xml was last modified before this build started. Ignoring it.
testng-results.xml was last modified before this build started. Ignoring it.
testng-results.xml was last modified before this build started. Ignoring it.
testng-results.xml was last modified before this build started. Ignoring it.
testng-results.xml was last modified before this build started. Ignoring it.
testng-results.xml was last modified before this build started. Ignoring it.
testng-results.xml was last modified before this build started. Ignoring it.
testng-results.xml was last modified before this build started. Ignoring it.
testng-results.xml was last modified before this build started. Ignoring it.
testng-results.xml was last modified before this build started. Ignoring it.
testng-results.xml was last modified before this build started. Ignoring it.
testng-results.xml was last modified before this build started. Ignoring it.
testng-results.xml was last modified before this build started. Ignoring it.
testng-results.xml was last modified before this build started. Ignoring it.
testng-results.xml was last modified before this build started. Ignoring it.
testng-results.xml was last modified before this build started. Ignoring it.
testng-results.xml was last modified before this build started. Ignoring it.
testng-results.xml was last modified before this build started. Ignoring it.
testng-results.xml was last modified before this build started. Ignoring it.
testng-results.xml was last modified before this build started. Ignoring it.
testng-results.xml was last modified before this build started. Ignoring it.
testng-results.xml was last modified before this build started. Ignoring it.
testng-results.xml was last modified before this build started. Ignoring it.
testng-results.xml was last modified before this build started. Ignoring it.
Saving reports...
Processing '/x1/jenkins/jenkins-home/jobs/brooklyn-master-build-docker/builds/333/testng/testng-results-1.xml'
Processing '/x1/jenkins/jenkins-home/jobs/brooklyn-master-build-docker/builds/333/testng/testng-results-2.xml'
Processing '/x1/jenkins/jenkins-home/jobs/brooklyn-master-build-docker/builds/333/testng/testng-results-3.xml'
Processing '/x1/jenkins/jenkins-home/jobs/brooklyn-master-build-docker/builds/333/testng/testng-results-4.xml'
Processing '/x1/jenkins/jenkins-home/jobs/brooklyn-master-build-docker/builds/333/testng/testng-results-5.xml'
Processing '/x1/jenkins/jenkins-home/jobs/brooklyn-master-build-docker/builds/333/testng/testng-results.xml'
0.034247% of tests failed, which exceeded threshold of 0%. Marking build as UNSTABLE
TestNG Reports Processing: FINISH