OSDir

[Date Prev][Date Next][Thread Prev][Thread Next][Date Index][Thread Index]

Build failed in Jenkins: brooklyn-master-build-docker #386


See <https://builds.apache.org/job/brooklyn-master-build-docker/386/display/redirect>

------------------------------------------
[...truncated 3.52 MB...]
2018-04-27 23:09:58,274 INFO  - TESTNG INVOKING: "Surefire test" - org.apache.brooklyn.core.location.AbstractLocationTest.testFieldSetFromFlagUsesDefault()
2018-04-27 23:09:58,275 INFO  - TESTNG PASSED: "Surefire test" - org.apache.brooklyn.core.location.AbstractLocationTest.testFieldSetFromFlagUsesDefault() finished in 1 ms
2018-04-27 23:09:58,275 INFO  - TESTNG INVOKING CONFIGURATION: "Surefire test" - @AfterMethod org.apache.brooklyn.core.location.AbstractLocationTest.tearDown()
2018-04-27 23:09:58,275 INFO  - TESTNG PASSED CONFIGURATION: "Surefire test" - @AfterMethod org.apache.brooklyn.core.location.AbstractLocationTest.tearDown() finished in 0 ms
2018-04-27 23:09:58,276 INFO  - TESTNG INVOKING CONFIGURATION: "Surefire test" - @BeforeMethod org.apache.brooklyn.core.location.AbstractLocationTest.setUp()
2018-04-27 23:09:58,276 INFO  - Added external config supplier named 'brooklyn-demo-sample': org.apache.brooklyn.core.config.external.InPlaceExternalConfigSupplier@46a88033
2018-04-27 23:09:58,276 INFO  - TESTNG PASSED CONFIGURATION: "Surefire test" - @BeforeMethod org.apache.brooklyn.core.location.AbstractLocationTest.setUp() finished in 1 ms
2018-04-27 23:09:58,276 INFO  - TESTNG INVOKING: "Surefire test" - org.apache.brooklyn.core.location.AbstractLocationTest.testLocationTags()
2018-04-27 23:09:58,277 INFO  - TESTNG PASSED: "Surefire test" - org.apache.brooklyn.core.location.AbstractLocationTest.testLocationTags() finished in 1 ms
2018-04-27 23:09:58,277 INFO  - TESTNG INVOKING CONFIGURATION: "Surefire test" - @AfterMethod org.apache.brooklyn.core.location.AbstractLocationTest.tearDown()
2018-04-27 23:09:58,277 INFO  - TESTNG PASSED CONFIGURATION: "Surefire test" - @AfterMethod org.apache.brooklyn.core.location.AbstractLocationTest.tearDown() finished in 0 ms
2018-04-27 23:09:58,278 INFO  - TESTNG INVOKING CONFIGURATION: "Surefire test" - @BeforeMethod org.apache.brooklyn.core.location.AbstractLocationTest.setUp()
2018-04-27 23:09:58,278 INFO  - Added external config supplier named 'brooklyn-demo-sample': org.apache.brooklyn.core.config.external.InPlaceExternalConfigSupplier@6b47a1aa
2018-04-27 23:09:58,278 INFO  - TESTNG PASSED CONFIGURATION: "Surefire test" - @BeforeMethod org.apache.brooklyn.core.location.AbstractLocationTest.setUp() finished in 0 ms
2018-04-27 23:09:58,278 INFO  - TESTNG INVOKING: "Surefire test" - org.apache.brooklyn.core.location.AbstractLocationTest.testSettingParentLocation()
2018-04-27 23:09:58,280 INFO  - TESTNG PASSED: "Surefire test" - org.apache.brooklyn.core.location.AbstractLocationTest.testSettingParentLocation() finished in 2 ms
2018-04-27 23:09:58,280 INFO  - TESTNG INVOKING CONFIGURATION: "Surefire test" - @AfterMethod org.apache.brooklyn.core.location.AbstractLocationTest.tearDown()
2018-04-27 23:09:58,280 INFO  - TESTNG PASSED CONFIGURATION: "Surefire test" - @AfterMethod org.apache.brooklyn.core.location.AbstractLocationTest.tearDown() finished in 0 ms
2018-04-27 23:09:58,281 INFO  - TESTNG INVOKING CONFIGURATION: "Surefire test" - @BeforeMethod org.apache.brooklyn.core.location.LocationConfigTest.setUp()
2018-04-27 23:09:58,281 INFO  - Added external config supplier named 'brooklyn-demo-sample': org.apache.brooklyn.core.config.external.InPlaceExternalConfigSupplier@3d78ece5
2018-04-27 23:09:58,282 INFO  - TESTNG PASSED CONFIGURATION: "Surefire test" - @BeforeMethod org.apache.brooklyn.core.location.LocationConfigTest.setUp() finished in 0 ms
2018-04-27 23:09:58,282 INFO  - TESTNG INVOKING: "Surefire test" - org.apache.brooklyn.core.location.LocationConfigTest.testChildCanOverrideConfigUsingFlagName()
2018-04-27 23:09:58,283 WARN  - Deprecated use of unmanaged location (MyChildLocation{id=vhs5gd9qi7, name=MyChildLocation:vhs5}); will be managed automatically now but not supported in future versions
2018-04-27 23:09:58,284 INFO  - local=ConfigBag[{mychildconfigflagname=overrideMyval, mychildlocation.myconfigwithflagname=overrideMyval}]
2018-04-27 23:09:58,285 INFO  - all=ConfigBag[{mychildconfigflagname=overrideMyval, mychildlocation.myconfigwithflagname=overrideMyval}]
2018-04-27 23:09:58,285 INFO  - TESTNG PASSED: "Surefire test" - org.apache.brooklyn.core.location.LocationConfigTest.testChildCanOverrideConfigUsingFlagName() finished in 3 ms
2018-04-27 23:09:58,285 INFO  - TESTNG INVOKING CONFIGURATION: "Surefire test" - @AfterMethod org.apache.brooklyn.core.location.LocationConfigTest.tearDown()
2018-04-27 23:09:58,285 INFO  - TESTNG PASSED CONFIGURATION: "Surefire test" - @AfterMethod org.apache.brooklyn.core.location.LocationConfigTest.tearDown() finished in 0 ms
2018-04-27 23:09:58,286 INFO  - TESTNG INVOKING CONFIGURATION: "Surefire test" - @BeforeMethod org.apache.brooklyn.core.location.LocationConfigTest.setUp()
2018-04-27 23:09:58,286 INFO  - Added external config supplier named 'brooklyn-demo-sample': org.apache.brooklyn.core.config.external.InPlaceExternalConfigSupplier@6b0e892a
2018-04-27 23:09:58,286 INFO  - TESTNG PASSED CONFIGURATION: "Surefire test" - @BeforeMethod org.apache.brooklyn.core.location.LocationConfigTest.setUp() finished in 0 ms
2018-04-27 23:09:58,286 INFO  - TESTNG INVOKING: "Surefire test" - org.apache.brooklyn.core.location.LocationConfigTest.testChildCanOverrideConfigUsingKeyName()
2018-04-27 23:09:58,287 WARN  - Deprecated use of unmanaged location (MyChildLocation{id=ejujbmpch3, name=MyChildLocation:ejuj}); will be managed automatically now but not supported in future versions
2018-04-27 23:09:58,288 INFO  - TESTNG PASSED: "Surefire test" - org.apache.brooklyn.core.location.LocationConfigTest.testChildCanOverrideConfigUsingKeyName() finished in 2 ms
2018-04-27 23:09:58,288 INFO  - TESTNG INVOKING CONFIGURATION: "Surefire test" - @AfterMethod org.apache.brooklyn.core.location.LocationConfigTest.tearDown()
2018-04-27 23:09:58,289 INFO  - TESTNG PASSED CONFIGURATION: "Surefire test" - @AfterMethod org.apache.brooklyn.core.location.LocationConfigTest.tearDown() finished in 1 ms
2018-04-27 23:09:58,289 INFO  - TESTNG INVOKING CONFIGURATION: "Surefire test" - @BeforeMethod org.apache.brooklyn.core.location.LocationConfigTest.setUp()
2018-04-27 23:09:58,289 INFO  - Added external config supplier named 'brooklyn-demo-sample': org.apache.brooklyn.core.config.external.InPlaceExternalConfigSupplier@68726734
2018-04-27 23:09:58,289 INFO  - TESTNG PASSED CONFIGURATION: "Surefire test" - @BeforeMethod org.apache.brooklyn.core.location.LocationConfigTest.setUp() finished in 0 ms
2018-04-27 23:09:58,289 INFO  - TESTNG INVOKING: "Surefire test" - org.apache.brooklyn.core.location.LocationConfigTest.testChildConfigBagInheritsUnmatchedAtParent()
2018-04-27 23:09:58,290 WARN  - Deprecated use of unmanaged location (MyChildLocation{id=mdguxhrgew, name=MyChildLocation:mdgu}); will be managed automatically now but not supported in future versions
2018-04-27 23:09:58,291 INFO  - TESTNG PASSED: "Surefire test" - org.apache.brooklyn.core.location.LocationConfigTest.testChildConfigBagInheritsUnmatchedAtParent() finished in 2 ms
2018-04-27 23:09:58,292 INFO  - TESTNG INVOKING CONFIGURATION: "Surefire test" - @AfterMethod org.apache.brooklyn.core.location.LocationConfigTest.tearDown()
2018-04-27 23:09:58,292 INFO  - TESTNG PASSED CONFIGURATION: "Surefire test" - @AfterMethod org.apache.brooklyn.core.location.LocationConfigTest.tearDown() finished in 1 ms
2018-04-27 23:09:58,292 INFO  - TESTNG INVOKING CONFIGURATION: "Surefire test" - @BeforeMethod org.apache.brooklyn.core.location.LocationConfigTest.setUp()
2018-04-27 23:09:58,292 INFO  - Added external config supplier named 'brooklyn-demo-sample': org.apache.brooklyn.core.config.external.InPlaceExternalConfigSupplier@4b4ee6d8
2018-04-27 23:09:58,292 INFO  - TESTNG PASSED CONFIGURATION: "Surefire test" - @BeforeMethod org.apache.brooklyn.core.location.LocationConfigTest.setUp() finished in 0 ms
2018-04-27 23:09:58,293 INFO  - TESTNG INVOKING: "Surefire test" - org.apache.brooklyn.core.location.LocationConfigTest.testChildInheritsFromParent()
2018-04-27 23:09:58,293 WARN  - Deprecated use of unmanaged location (MyChildLocation{id=kd4q6rzt0q, name=MyChildLocation:kd4q}); will be managed automatically now but not supported in future versions
2018-04-27 23:09:58,294 INFO  - TESTNG PASSED: "Surefire test" - org.apache.brooklyn.core.location.LocationConfigTest.testChildInheritsFromParent() finished in 1 ms
2018-04-27 23:09:58,294 INFO  - TESTNG INVOKING CONFIGURATION: "Surefire test" - @AfterMethod org.apache.brooklyn.core.location.LocationConfigTest.tearDown()
2018-04-27 23:09:58,295 INFO  - TESTNG PASSED CONFIGURATION: "Surefire test" - @AfterMethod org.apache.brooklyn.core.location.LocationConfigTest.tearDown() finished in 1 ms
2018-04-27 23:09:58,295 INFO  - TESTNG INVOKING CONFIGURATION: "Surefire test" - @BeforeMethod org.apache.brooklyn.core.location.LocationConfigTest.setUp()
2018-04-27 23:09:58,295 INFO  - Added external config supplier named 'brooklyn-demo-sample': org.apache.brooklyn.core.config.external.InPlaceExternalConfigSupplier@4143f171
2018-04-27 23:09:58,295 INFO  - TESTNG PASSED CONFIGURATION: "Surefire test" - @BeforeMethod org.apache.brooklyn.core.location.LocationConfigTest.setUp() finished in 0 ms
2018-04-27 23:09:58,295 INFO  - TESTNG INVOKING: "Surefire test" - org.apache.brooklyn.core.location.LocationConfigTest.testConfigBagContainsMatchesForConfigKeyName()
2018-04-27 23:09:58,296 INFO  - TESTNG PASSED: "Surefire test" - org.apache.brooklyn.core.location.LocationConfigTest.testConfigBagContainsMatchesForConfigKeyName() finished in 1 ms
2018-04-27 23:09:58,296 INFO  - TESTNG INVOKING CONFIGURATION: "Surefire test" - @AfterMethod org.apache.brooklyn.core.location.LocationConfigTest.tearDown()
2018-04-27 23:09:58,296 INFO  - TESTNG PASSED CONFIGURATION: "Surefire test" - @AfterMethod org.apache.brooklyn.core.location.LocationConfigTest.tearDown() finished in 0 ms
2018-04-27 23:09:58,297 INFO  - TESTNG INVOKING CONFIGURATION: "Surefire test" - @BeforeMethod org.apache.brooklyn.core.location.LocationConfigTest.setUp()
2018-04-27 23:09:58,297 INFO  - Added external config supplier named 'brooklyn-demo-sample': org.apache.brooklyn.core.config.external.InPlaceExternalConfigSupplier@7f428a0d
2018-04-27 23:09:58,297 INFO  - TESTNG PASSED CONFIGURATION: "Surefire test" - @BeforeMethod org.apache.brooklyn.core.location.LocationConfigTest.setUp() finished in 0 ms
2018-04-27 23:09:58,297 INFO  - TESTNG INVOKING: "Surefire test" - org.apache.brooklyn.core.location.LocationConfigTest.testConfigBagContainsMatchesForFlagName()
2018-04-27 23:09:58,298 INFO  - TESTNG PASSED: "Surefire test" - org.apache.brooklyn.core.location.LocationConfigTest.testConfigBagContainsMatchesForFlagName() finished in 1 ms
2018-04-27 23:09:58,298 INFO  - TESTNG INVOKING CONFIGURATION: "Surefire test" - @AfterMethod org.apache.brooklyn.core.location.LocationConfigTest.tearDown()
2018-04-27 23:09:58,298 INFO  - TESTNG PASSED CONFIGURATION: "Surefire test" - @AfterMethod org.apache.brooklyn.core.location.LocationConfigTest.tearDown() finished in 0 ms
2018-04-27 23:09:58,299 INFO  - TESTNG INVOKING CONFIGURATION: "Surefire test" - @BeforeMethod org.apache.brooklyn.core.location.LocationConfigTest.setUp()
2018-04-27 23:09:58,299 INFO  - Added external config supplier named 'brooklyn-demo-sample': org.apache.brooklyn.core.config.external.InPlaceExternalConfigSupplier@38985760
2018-04-27 23:09:58,299 INFO  - TESTNG PASSED CONFIGURATION: "Surefire test" - @BeforeMethod org.apache.brooklyn.core.location.LocationConfigTest.setUp() finished in 0 ms
2018-04-27 23:09:58,299 INFO  - TESTNG INVOKING: "Surefire test" - org.apache.brooklyn.core.location.LocationConfigTest.testConfigBagContainsUnmatched()
2018-04-27 23:09:58,300 INFO  - TESTNG PASSED: "Surefire test" - org.apache.brooklyn.core.location.LocationConfigTest.testConfigBagContainsUnmatched() finished in 1 ms
2018-04-27 23:09:58,300 INFO  - TESTNG INVOKING CONFIGURATION: "Surefire test" - @AfterMethod org.apache.brooklyn.core.location.LocationConfigTest.tearDown()
2018-04-27 23:09:58,300 INFO  - TESTNG PASSED CONFIGURATION: "Surefire test" - @AfterMethod org.apache.brooklyn.core.location.LocationConfigTest.tearDown() finished in 0 ms
2018-04-27 23:09:58,301 INFO  - TESTNG INVOKING CONFIGURATION: "Surefire test" - @BeforeMethod org.apache.brooklyn.core.location.LocationConfigTest.setUp()
2018-04-27 23:09:58,301 INFO  - Added external config supplier named 'brooklyn-demo-sample': org.apache.brooklyn.core.config.external.InPlaceExternalConfigSupplier@31888cc8
2018-04-27 23:09:58,301 INFO  - TESTNG PASSED CONFIGURATION: "Surefire test" - @BeforeMethod org.apache.brooklyn.core.location.LocationConfigTest.setUp() finished in 0 ms
2018-04-27 23:09:58,301 INFO  - TESTNG INVOKING: "Surefire test" - org.apache.brooklyn.core.location.LocationConfigTest.testLocationCanOverrideConfigDefaultValue()
2018-04-27 23:09:58,303 INFO  - TESTNG PASSED: "Surefire test" - org.apache.brooklyn.core.location.LocationConfigTest.testLocationCanOverrideConfigDefaultValue() finished in 2 ms
2018-04-27 23:09:58,303 INFO  - TESTNG INVOKING CONFIGURATION: "Surefire test" - @AfterMethod org.apache.brooklyn.core.location.LocationConfigTest.tearDown()
2018-04-27 23:09:58,303 INFO  - TESTNG PASSED CONFIGURATION: "Surefire test" - @AfterMethod org.apache.brooklyn.core.location.LocationConfigTest.tearDown() finished in 0 ms
2018-04-27 23:09:58,304 INFO  - TESTNG INVOKING CONFIGURATION: "Surefire test" - @BeforeMethod org.apache.brooklyn.core.location.TestPortSupplierLocation.setUp()
2018-04-27 23:09:58,304 INFO  - Added external config supplier named 'brooklyn-demo-sample': org.apache.brooklyn.core.config.external.InPlaceExternalConfigSupplier@63455c3a
2018-04-27 23:09:58,350 INFO  - TESTNG PASSED CONFIGURATION: "Surefire test" - @BeforeMethod org.apache.brooklyn.core.location.TestPortSupplierLocation.setUp() finished in 46 ms
2018-04-27 23:09:58,351 INFO  - TESTNG INVOKING: "Surefire test" - org.apache.brooklyn.core.location.TestPortSupplierLocation.testNullBeforeSetting()
2018-04-27 23:09:58,351 INFO  - TESTNG PASSED: "Surefire test" - org.apache.brooklyn.core.location.TestPortSupplierLocation.testNullBeforeSetting() finished in 1 ms
2018-04-27 23:09:58,351 INFO  - TESTNG INVOKING CONFIGURATION: "Surefire test" - @AfterMethod org.apache.brooklyn.core.test.BrooklynMgmtUnitTestSupport.tearDown()
2018-04-27 23:09:58,355 INFO  - TESTNG PASSED CONFIGURATION: "Surefire test" - @AfterMethod org.apache.brooklyn.core.test.BrooklynMgmtUnitTestSupport.tearDown() finished in 4 ms
2018-04-27 23:09:58,355 INFO  - TESTNG INVOKING CONFIGURATION: "Surefire test" - @BeforeMethod org.apache.brooklyn.core.location.TestPortSupplierLocation.setUp()
2018-04-27 23:09:58,356 INFO  - Added external config supplier named 'brooklyn-demo-sample': org.apache.brooklyn.core.config.external.InPlaceExternalConfigSupplier@72f1ea3c
2018-04-27 23:09:58,400 INFO  - TESTNG PASSED CONFIGURATION: "Surefire test" - @BeforeMethod org.apache.brooklyn.core.location.TestPortSupplierLocation.setUp() finished in 45 ms
2018-04-27 23:09:58,400 INFO  - TESTNG INVOKING: "Surefire test" - org.apache.brooklyn.core.location.TestPortSupplierLocation.testObtainsPort()
2018-04-27 23:09:58,403 INFO  - TESTNG PASSED: "Surefire test" - org.apache.brooklyn.core.location.TestPortSupplierLocation.testObtainsPort() finished in 2 ms
2018-04-27 23:09:58,403 INFO  - TESTNG INVOKING CONFIGURATION: "Surefire test" - @AfterMethod org.apache.brooklyn.core.test.BrooklynMgmtUnitTestSupport.tearDown()
2018-04-27 23:09:58,407 INFO  - TESTNG PASSED CONFIGURATION: "Surefire test" - @AfterMethod org.apache.brooklyn.core.test.BrooklynMgmtUnitTestSupport.tearDown() finished in 4 ms
2018-04-27 23:09:58,408 INFO  - TESTNG INVOKING CONFIGURATION: "Surefire test" - @BeforeMethod org.apache.brooklyn.core.location.TestPortSupplierLocation.setUp()
2018-04-27 23:09:58,408 INFO  - Added external config supplier named 'brooklyn-demo-sample': org.apache.brooklyn.core.config.external.InPlaceExternalConfigSupplier@b9bbfce
[GC (Allocation Failure)  462369K->289394K(750592K), 0.0986105 secs]
2018-04-27 23:09:58,557 INFO  - TESTNG PASSED CONFIGURATION: "Surefire test" - @BeforeMethod org.apache.brooklyn.core.location.TestPortSupplierLocation.setUp() finished in 149 ms
2018-04-27 23:09:58,558 INFO  - TESTNG INVOKING: "Surefire test" - org.apache.brooklyn.core.location.TestPortSupplierLocation.testRepeatedConvertAccessIncrements()
2018-04-27 23:09:58,560 INFO  - TESTNG PASSED: "Surefire test" - org.apache.brooklyn.core.location.TestPortSupplierLocation.testRepeatedConvertAccessIncrements() finished in 3 ms
2018-04-27 23:09:58,560 INFO  - TESTNG INVOKING CONFIGURATION: "Surefire test" - @AfterMethod org.apache.brooklyn.core.test.BrooklynMgmtUnitTestSupport.tearDown()
2018-04-27 23:09:58,565 INFO  - TESTNG PASSED CONFIGURATION: "Surefire test" - @AfterMethod org.apache.brooklyn.core.test.BrooklynMgmtUnitTestSupport.tearDown() finished in 5 ms
2018-04-27 23:09:58,566 INFO  - TESTNG INVOKING CONFIGURATION: "Surefire test" - @BeforeMethod org.apache.brooklyn.core.location.TestPortSupplierLocation.setUp()
2018-04-27 23:09:58,566 INFO  - Added external config supplier named 'brooklyn-demo-sample': org.apache.brooklyn.core.config.external.InPlaceExternalConfigSupplier@1fff3cb1
2018-04-27 23:09:58,612 INFO  - TESTNG PASSED CONFIGURATION: "Surefire test" - @BeforeMethod org.apache.brooklyn.core.location.TestPortSupplierLocation.setUp() finished in 46 ms
2018-04-27 23:09:58,612 INFO  - TESTNG INVOKING: "Surefire test" - org.apache.brooklyn.core.location.TestPortSupplierLocation.testSimulatedRestrictedPermitted()
2018-04-27 23:09:58,675 INFO  - TESTNG PASSED: "Surefire test" - org.apache.brooklyn.core.location.TestPortSupplierLocation.testSimulatedRestrictedPermitted() finished in 63 ms
2018-04-27 23:09:58,675 INFO  - TESTNG INVOKING CONFIGURATION: "Surefire test" - @AfterMethod org.apache.brooklyn.core.test.BrooklynMgmtUnitTestSupport.tearDown()
2018-04-27 23:09:58,680 INFO  - TESTNG PASSED CONFIGURATION: "Surefire test" - @AfterMethod org.apache.brooklyn.core.test.BrooklynMgmtUnitTestSupport.tearDown() finished in 5 ms
2018-04-27 23:09:58,920 INFO  - TESTNG 
===============================================
    Surefire test
    Tests run: 2316, Failures: 1, Skips: 0
===============================================
[GC (Allocation Failure)  479858K->257306K(739328K), 0.0151995 secs]
[GC (Allocation Failure)  436506K->257162K(744960K), 0.0183128 secs]
[GC (Allocation Failure)  436362K->257186K(745472K), 0.0253683 secs]
[GC (Allocation Failure)  436898K->257331K(744960K), 0.0076954 secs]
[GC (Allocation Failure)  437043K->257402K(747520K), 0.0086180 secs]
[GC (Allocation Failure)  440698K->257570K(746496K), 0.0076185 secs]
[GC (Allocation Failure)  440866K->258955K(750080K), 0.0117040 secs]
Tests run: 2316, Failures: 1, Errors: 0, Skipped: 0, Time elapsed: 203.749 sec <<< FAILURE! - in TestSuite
testCommandExecutedWithEnvironment(org.apache.brooklyn.entity.group.SshCommandMembershipTrackingPolicyTest)  Time elapsed: 0.038 sec  <<< FAILURE!
java.lang.AssertionError: Lists differ at element [0]: echo ignored != mkdir -p '/path/to/myexecutiondir' && cd '/path/to/myexecutiondir' && echo 'myval' expected [echo ignored] but found [mkdir -p '/path/to/myexecutiondir' && cd '/path/to/myexecutiondir' && echo 'myval']
	at org.apache.brooklyn.entity.group.SshCommandMembershipTrackingPolicyTest.testCommandExecutedWithEnvironment(SshCommandMembershipTrackingPolicyTest.java:90)

2018-04-27 23:10:02,170 INFO  - Brooklyn shutdown: stopping entities [TestEntityImpl{id=esu41cpods}, TestEntityImpl{id=cjl4rmzpgp}, BlockingEntityImpl{id=bx0axxmmsl}]

Results :

Failed tests: 
  SshCommandMembershipTrackingPolicyTest.testCommandExecutedWithEnvironment:90 Lists differ at element [0]: echo ignored != mkdir -p '/path/to/myexecutiondir' && cd '/path/to/myexecutiondir' && echo 'myval' expected [echo ignored] but found [mkdir -p '/path/to/myexecutiondir' && cd '/path/to/myexecutiondir' && echo 'myval']

Tests run: 2316, Failures: 1, Errors: 0, Skipped: 0

[INFO] ------------------------------------------------------------------------
[INFO] Reactor Summary:
[INFO] 
[INFO] Brooklyn REST JavaScript Web GUI ................... SUCCESS [ 38.632 s]
[INFO] Brooklyn Server Root ............................... SUCCESS [  0.886 s]
[INFO] Brooklyn Parent Project ............................ SUCCESS [  2.235 s]
[INFO] Brooklyn Test Support Utilities .................... SUCCESS [  4.410 s]
[INFO] Brooklyn Logback Includable Configuration .......... SUCCESS [  0.451 s]
[INFO] Brooklyn Common Utilities .......................... SUCCESS [ 24.835 s]
[INFO] Brooklyn API ....................................... SUCCESS [  2.023 s]
[INFO] CAMP Server Parent Project ......................... SUCCESS [  0.168 s]
[INFO] CAMP Base .......................................... SUCCESS [  2.959 s]
[INFO] Brooklyn Test Support .............................. SUCCESS [  1.329 s]
[INFO] Brooklyn REST Swagger Apidoc Utilities ............. SUCCESS [  1.342 s]
[INFO] Brooklyn Logback Configuration ..................... SUCCESS [  0.268 s]
[INFO] CAMP Server ........................................ SUCCESS [  5.792 s]
[INFO] Brooklyn Felix Runtime ............................. SUCCESS [  3.018 s]
[INFO] Brooklyn Groovy Utilities .......................... SUCCESS [  2.309 s]
[INFO] Brooklyn Core ...................................... FAILURE [04:13 min]
[INFO] Brooklyn Policies .................................. SKIPPED
[INFO] Brooklyn WinRM Software Entities ................... SKIPPED
[INFO] Brooklyn Secure JMXMP Agent ........................ SKIPPED
[INFO] Brooklyn JMX RMI Agent ............................. SKIPPED
[INFO] Brooklyn Jclouds Location Targets .................. SKIPPED
[INFO] Brooklyn Software Base ............................. SKIPPED
[INFO] Brooklyn CAMP ...................................... SKIPPED
[INFO] Brooklyn Launcher Common ........................... SKIPPED
[INFO] Brooklyn REST API .................................. SKIPPED
[INFO] Brooklyn REST Resources ............................ SKIPPED
[INFO] Brooklyn REST Server ............................... SKIPPED
[INFO] Brooklyn Launcher .................................. SKIPPED
[INFO] Brooklyn Container Location Targets ................ SKIPPED
[INFO] Brooklyn Command Line Interface .................... SKIPPED
[INFO] Brooklyn Test Framework ............................ SKIPPED
[INFO] Brooklyn OSGi init ................................. SKIPPED
[INFO] Brooklyn OSGi start ................................ SKIPPED
[INFO] Brooklyn Karaf ..................................... SKIPPED
[INFO] Jetty config fragment .............................. SKIPPED
[INFO] Apache Http Component extension .................... SKIPPED
[INFO] Brooklyn Karaf Features ............................ SKIPPED
[INFO] Brooklyn Karaf Shell Commands ...................... SKIPPED
[INFO] Brooklyn Library Root .............................. SKIPPED
[INFO] Brooklyn CM Chef ................................... SKIPPED
[INFO] Brooklyn CM SaltStack .............................. SKIPPED
[INFO] Brooklyn CM Ansible ................................ SKIPPED
[INFO] Brooklyn CM Integration Root ....................... SKIPPED
[INFO] Brooklyn Network Software Entities ................. SKIPPED
[INFO] Brooklyn OSGi Software Entities .................... SKIPPED
[INFO] Brooklyn Database Software Entities ................ SKIPPED
[INFO] Brooklyn Web App Software Entities ................. SKIPPED
[INFO] Brooklyn Messaging Software Entities ............... SKIPPED
[INFO] Brooklyn NoSQL Data Store Software Entities ........ SKIPPED
[INFO] Brooklyn Monitoring Software Entities .............. SKIPPED
[INFO] Brooklyn Web App Software Entities ................. SKIPPED
[INFO] Brooklyn QA ........................................ SKIPPED
[INFO] Brooklyn Examples Aggregator Project ............... SKIPPED
[INFO] Brooklyn Examples Aggregator Project - Webapps ..... SKIPPED
[INFO] hello-world-webapp Maven Webapp .................... SKIPPED
[INFO] hello-world-sql-webapp Maven Webapp ................ SKIPPED
[INFO] Brooklyn Simple Web Cluster Example ................ SKIPPED
[INFO] Brooklyn Library Karaf integration ................. SKIPPED
[INFO] Brooklyn Library Catalog ........................... SKIPPED
[INFO] Brooklyn Library Karaf Features .................... SKIPPED
[INFO] Brooklyn Client .................................... SKIPPED
[INFO] Brooklyn Client Command Line Interface ............. SKIPPED
[INFO] Brooklyn REST java Client .......................... SKIPPED
[INFO] Brooklyn Downstream Project Parent ................. SKIPPED
[INFO] Brooklyn Dist Root ................................. SKIPPED
[INFO] Brooklyn All Things ................................ SKIPPED
[INFO] Brooklyn Distribution .............................. SKIPPED
[INFO] Brooklyn Karaf Distribution Parent ................. SKIPPED
[INFO] Brooklyn Karaf Server Configuration ................ SKIPPED
[INFO] Brooklyn Dist Karaf Features ....................... SKIPPED
[INFO] Brooklyn Karaf Distribution ........................ SKIPPED
[INFO] Brooklyn Karaf pax-exam itest ...................... SKIPPED
[INFO] Brooklyn Vagrant Getting Started Environment ....... SKIPPED
[INFO] Brooklyn Quick-Start Project Archetype ............. SKIPPED
[INFO] Brooklyn Shared Package Files ...................... SKIPPED
[INFO] Brooklyn RPM Package ............................... SKIPPED
[INFO] Brooklyn DEB Package ............................... SKIPPED
[INFO] Brooklyn Root ...................................... SKIPPED
[INFO] ------------------------------------------------------------------------
[INFO] BUILD FAILURE
[INFO] ------------------------------------------------------------------------
[INFO] Total time: 05:49 min
[INFO] Finished at: 2018-04-27T23:10:02Z
[INFO] Final Memory: 92M/749M
[INFO] ------------------------------------------------------------------------
[ERROR] Failed to execute goal org.apache.maven.plugins:maven-surefire-plugin:2.19.1:test (default-test) on project brooklyn-core: There are test failures.
[ERROR] 
[ERROR] Please refer to /usr/build/brooklyn-server/core/target/surefire-reports for the individual test results.
[ERROR] -> [Help 1]
[ERROR] 
[ERROR] To see the full stack trace of the errors, re-run Maven with the -e switch.
[ERROR] Re-run Maven using the -X switch to enable full debug logging.
[ERROR] 
[ERROR] For more information about the errors and possible solutions, please read the following articles:
[ERROR] [Help 1] http://cwiki.apache.org/confluence/display/MAVEN/MojoFailureException
[ERROR] 
[ERROR] After correcting the problems, you can resume the build with the command
[ERROR]   mvn <goals> -rf :brooklyn-core
Build step 'Execute shell' marked build as failure
Recording test results
TestNG Reports Processing: START
Looking for TestNG results report in workspace using pattern: **/testng-results.xml
Saving reports...
Processing '/x1/jenkins/jenkins-home/jobs/brooklyn-master-build-docker/builds/386/testng/testng-results-1.xml'
Processing '/x1/jenkins/jenkins-home/jobs/brooklyn-master-build-docker/builds/386/testng/testng-results-2.xml'
Processing '/x1/jenkins/jenkins-home/jobs/brooklyn-master-build-docker/builds/386/testng/testng-results-3.xml'
Processing '/x1/jenkins/jenkins-home/jobs/brooklyn-master-build-docker/builds/386/testng/testng-results-4.xml'
Processing '/x1/jenkins/jenkins-home/jobs/brooklyn-master-build-docker/builds/386/testng/testng-results-5.xml'
Processing '/x1/jenkins/jenkins-home/jobs/brooklyn-master-build-docker/builds/386/testng/testng-results.xml'
0.034223% of tests failed, which exceeded threshold of 0%. Marking build as UNSTABLE
TestNG Reports Processing: FINISH