OSDir

[Date Prev][Date Next][Thread Prev][Thread Next][Date Index][Thread Index]

Build failed in Jenkins: brooklyn-server-master-docker #75


See <https://builds.apache.org/job/brooklyn-server-master-docker/75/display/redirect?page=changes>

Changes:

[aled.sage] Fix SshCommandSensor rebind

[aled.sage] SshCommandSensor: no anonymous inner classes

------------------------------------------
[...truncated 3.47 MB...]
2018-04-27 15:58:50,323 INFO  - TESTNG PASSED: "Surefire test" - org.apache.brooklyn.core.effector.EffectorSayHiTest.testInvocationGet() finished in 4 ms
2018-04-27 15:58:50,323 INFO  - TESTNG INVOKING CONFIGURATION: "Surefire test" - @AfterMethod org.apache.brooklyn.core.test.BrooklynMgmtUnitTestSupport.tearDown()
2018-04-27 15:58:50,328 INFO  - TESTNG PASSED CONFIGURATION: "Surefire test" - @AfterMethod org.apache.brooklyn.core.test.BrooklynMgmtUnitTestSupport.tearDown() finished in 5 ms
2018-04-27 15:58:50,328 INFO  - TESTNG INVOKING CONFIGURATION: "Surefire test" - @BeforeMethod org.apache.brooklyn.core.effector.EffectorSayHiTest.setUp()
2018-04-27 15:58:50,328 INFO  - Added external config supplier named 'brooklyn-demo-sample': org.apache.brooklyn.core.config.external.InPlaceExternalConfigSupplier@25963f
2018-04-27 15:58:50,353 INFO  - TESTNG PASSED CONFIGURATION: "Surefire test" - @BeforeMethod org.apache.brooklyn.core.effector.EffectorSayHiTest.setUp() finished in 25 ms
2018-04-27 15:58:50,354 INFO  - TESTNG INVOKING: "Surefire test" - org.apache.brooklyn.core.effector.EffectorSayHiTest.testInvocationGetImmediately()
2018-04-27 15:58:50,356 INFO  - TESTNG PASSED: "Surefire test" - org.apache.brooklyn.core.effector.EffectorSayHiTest.testInvocationGetImmediately() finished in 3 ms
2018-04-27 15:58:50,356 INFO  - TESTNG INVOKING CONFIGURATION: "Surefire test" - @AfterMethod org.apache.brooklyn.core.test.BrooklynMgmtUnitTestSupport.tearDown()
2018-04-27 15:58:50,362 INFO  - TESTNG PASSED CONFIGURATION: "Surefire test" - @AfterMethod org.apache.brooklyn.core.test.BrooklynMgmtUnitTestSupport.tearDown() finished in 6 ms
2018-04-27 15:58:50,362 INFO  - TESTNG INVOKING CONFIGURATION: "Surefire test" - @BeforeMethod org.apache.brooklyn.core.effector.EffectorSayHiTest.setUp()
2018-04-27 15:58:50,362 INFO  - Added external config supplier named 'brooklyn-demo-sample': org.apache.brooklyn.core.config.external.InPlaceExternalConfigSupplier@5128981d
2018-04-27 15:58:50,385 INFO  - TESTNG PASSED CONFIGURATION: "Surefire test" - @BeforeMethod org.apache.brooklyn.core.effector.EffectorSayHiTest.setUp() finished in 23 ms
2018-04-27 15:58:50,385 INFO  - TESTNG INVOKING: "Surefire test" - org.apache.brooklyn.core.effector.EffectorSayHiTest.testInvocationSubmission()
2018-04-27 15:58:50,389 INFO  - TESTNG PASSED: "Surefire test" - org.apache.brooklyn.core.effector.EffectorSayHiTest.testInvocationSubmission() finished in 4 ms
2018-04-27 15:58:50,389 INFO  - TESTNG INVOKING CONFIGURATION: "Surefire test" - @AfterMethod org.apache.brooklyn.core.test.BrooklynMgmtUnitTestSupport.tearDown()
2018-04-27 15:58:50,393 INFO  - TESTNG PASSED CONFIGURATION: "Surefire test" - @AfterMethod org.apache.brooklyn.core.test.BrooklynMgmtUnitTestSupport.tearDown() finished in 4 ms
2018-04-27 15:58:50,393 INFO  - TESTNG INVOKING CONFIGURATION: "Surefire test" - @BeforeMethod org.apache.brooklyn.core.effector.EffectorSayHiTest.setUp()
2018-04-27 15:58:50,394 INFO  - Added external config supplier named 'brooklyn-demo-sample': org.apache.brooklyn.core.config.external.InPlaceExternalConfigSupplier@11b6223b
2018-04-27 15:58:50,414 INFO  - TESTNG PASSED CONFIGURATION: "Surefire test" - @BeforeMethod org.apache.brooklyn.core.effector.EffectorSayHiTest.setUp() finished in 21 ms
2018-04-27 15:58:50,415 INFO  - TESTNG INVOKING: "Surefire test" - org.apache.brooklyn.core.effector.EffectorSayHiTest.testInvokeEffectors1()
2018-04-27 15:58:50,418 INFO  - TESTNG PASSED: "Surefire test" - org.apache.brooklyn.core.effector.EffectorSayHiTest.testInvokeEffectors1() finished in 3 ms
2018-04-27 15:58:50,418 INFO  - TESTNG INVOKING CONFIGURATION: "Surefire test" - @AfterMethod org.apache.brooklyn.core.test.BrooklynMgmtUnitTestSupport.tearDown()
2018-04-27 15:58:50,423 INFO  - TESTNG PASSED CONFIGURATION: "Surefire test" - @AfterMethod org.apache.brooklyn.core.test.BrooklynMgmtUnitTestSupport.tearDown() finished in 5 ms
2018-04-27 15:58:50,423 INFO  - TESTNG INVOKING CONFIGURATION: "Surefire test" - @BeforeMethod org.apache.brooklyn.core.test.BrooklynAppUnitTestSupport.setUp()
2018-04-27 15:58:50,423 INFO  - Added external config supplier named 'brooklyn-demo-sample': org.apache.brooklyn.core.config.external.InPlaceExternalConfigSupplier@6fcebba4
2018-04-27 15:58:50,434 INFO  - TESTNG PASSED CONFIGURATION: "Surefire test" - @BeforeMethod org.apache.brooklyn.core.test.BrooklynAppUnitTestSupport.setUp() finished in 11 ms
2018-04-27 15:58:50,434 INFO  - TESTNG INVOKING: "Surefire test" - org.apache.brooklyn.core.effector.EffectorTaskTest.testComposedEffector()
2018-04-27 15:58:50,447 INFO  - TESTNG PASSED: "Surefire test" - org.apache.brooklyn.core.effector.EffectorTaskTest.testComposedEffector() finished in 13 ms
2018-04-27 15:58:50,447 INFO  - TESTNG INVOKING CONFIGURATION: "Surefire test" - @AfterMethod org.apache.brooklyn.core.test.BrooklynMgmtUnitTestSupport.tearDown()
2018-04-27 15:58:50,450 INFO  - TESTNG PASSED CONFIGURATION: "Surefire test" - @AfterMethod org.apache.brooklyn.core.test.BrooklynMgmtUnitTestSupport.tearDown() finished in 3 ms
2018-04-27 15:58:50,450 INFO  - TESTNG INVOKING CONFIGURATION: "Surefire test" - @BeforeMethod org.apache.brooklyn.core.test.BrooklynAppUnitTestSupport.setUp()
2018-04-27 15:58:50,451 INFO  - Added external config supplier named 'brooklyn-demo-sample': org.apache.brooklyn.core.config.external.InPlaceExternalConfigSupplier@7849a361
2018-04-27 15:58:50,461 INFO  - TESTNG PASSED CONFIGURATION: "Surefire test" - @BeforeMethod org.apache.brooklyn.core.test.BrooklynAppUnitTestSupport.setUp() finished in 11 ms
2018-04-27 15:58:50,461 INFO  - TESTNG INVOKING: "Surefire test" - org.apache.brooklyn.core.effector.EffectorTaskTest.testComposedEffectorBasic()
2018-04-27 15:58:50,470 INFO  - TESTNG PASSED: "Surefire test" - org.apache.brooklyn.core.effector.EffectorTaskTest.testComposedEffectorBasic() finished in 9 ms
2018-04-27 15:58:50,470 INFO  - TESTNG INVOKING CONFIGURATION: "Surefire test" - @AfterMethod org.apache.brooklyn.core.test.BrooklynMgmtUnitTestSupport.tearDown()
2018-04-27 15:58:50,473 INFO  - TESTNG PASSED CONFIGURATION: "Surefire test" - @AfterMethod org.apache.brooklyn.core.test.BrooklynMgmtUnitTestSupport.tearDown() finished in 3 ms
2018-04-27 15:58:50,473 INFO  - TESTNG INVOKING CONFIGURATION: "Surefire test" - @BeforeMethod org.apache.brooklyn.core.test.BrooklynAppUnitTestSupport.setUp()
2018-04-27 15:58:50,474 INFO  - Added external config supplier named 'brooklyn-demo-sample': org.apache.brooklyn.core.config.external.InPlaceExternalConfigSupplier@5dd9b38
2018-04-27 15:58:50,483 INFO  - TESTNG PASSED CONFIGURATION: "Surefire test" - @BeforeMethod org.apache.brooklyn.core.test.BrooklynAppUnitTestSupport.setUp() finished in 10 ms
2018-04-27 15:58:50,483 INFO  - TESTNG INVOKING: "Surefire test" - org.apache.brooklyn.core.effector.EffectorTaskTest.testEffectorBodyAdded()
2018-04-27 15:58:50,495 INFO  - TESTNG PASSED: "Surefire test" - org.apache.brooklyn.core.effector.EffectorTaskTest.testEffectorBodyAdded() finished in 12 ms
2018-04-27 15:58:50,495 INFO  - TESTNG INVOKING CONFIGURATION: "Surefire test" - @AfterMethod org.apache.brooklyn.core.test.BrooklynMgmtUnitTestSupport.tearDown()
2018-04-27 15:58:50,501 INFO  - TESTNG PASSED CONFIGURATION: "Surefire test" - @AfterMethod org.apache.brooklyn.core.test.BrooklynMgmtUnitTestSupport.tearDown() finished in 6 ms
2018-04-27 15:58:50,502 INFO  - TESTNG INVOKING CONFIGURATION: "Surefire test" - @BeforeMethod org.apache.brooklyn.core.test.BrooklynAppUnitTestSupport.setUp()
2018-04-27 15:58:50,502 INFO  - Added external config supplier named 'brooklyn-demo-sample': org.apache.brooklyn.core.config.external.InPlaceExternalConfigSupplier@58d9c0b1
2018-04-27 15:58:50,512 INFO  - TESTNG PASSED CONFIGURATION: "Surefire test" - @BeforeMethod org.apache.brooklyn.core.test.BrooklynAppUnitTestSupport.setUp() finished in 10 ms
2018-04-27 15:58:50,512 INFO  - TESTNG INVOKING: "Surefire test" - org.apache.brooklyn.core.effector.EffectorTaskTest.testEffectorBodyAddedImplicitlyButBodylessSignatureInvoked()
2018-04-27 15:58:50,521 INFO  - TESTNG PASSED: "Surefire test" - org.apache.brooklyn.core.effector.EffectorTaskTest.testEffectorBodyAddedImplicitlyButBodylessSignatureInvoked() finished in 9 ms
2018-04-27 15:58:50,522 INFO  - TESTNG INVOKING CONFIGURATION: "Surefire test" - @AfterMethod org.apache.brooklyn.core.test.BrooklynMgmtUnitTestSupport.tearDown()
2018-04-27 15:58:50,527 INFO  - TESTNG PASSED CONFIGURATION: "Surefire test" - @AfterMethod org.apache.brooklyn.core.test.BrooklynMgmtUnitTestSupport.tearDown() finished in 6 ms
2018-04-27 15:58:50,527 INFO  - TESTNG INVOKING CONFIGURATION: "Surefire test" - @BeforeMethod org.apache.brooklyn.core.test.BrooklynAppUnitTestSupport.setUp()
2018-04-27 15:58:50,527 INFO  - Added external config supplier named 'brooklyn-demo-sample': org.apache.brooklyn.core.config.external.InPlaceExternalConfigSupplier@6aa6fa92
2018-04-27 15:58:50,536 INFO  - TESTNG PASSED CONFIGURATION: "Surefire test" - @BeforeMethod org.apache.brooklyn.core.test.BrooklynAppUnitTestSupport.setUp() finished in 9 ms
2018-04-27 15:58:50,536 INFO  - TESTNG INVOKING: "Surefire test" - org.apache.brooklyn.core.effector.EffectorTaskTest.testEffectorImplTaggedCorrectly()
2018-04-27 15:58:50,541 INFO  - TESTNG PASSED: "Surefire test" - org.apache.brooklyn.core.effector.EffectorTaskTest.testEffectorImplTaggedCorrectly() finished in 5 ms
2018-04-27 15:58:50,541 INFO  - TESTNG INVOKING CONFIGURATION: "Surefire test" - @AfterMethod org.apache.brooklyn.core.test.BrooklynMgmtUnitTestSupport.tearDown()
2018-04-27 15:58:50,543 INFO  - TESTNG PASSED CONFIGURATION: "Surefire test" - @AfterMethod org.apache.brooklyn.core.test.BrooklynMgmtUnitTestSupport.tearDown() finished in 2 ms
2018-04-27 15:58:50,543 INFO  - TESTNG INVOKING CONFIGURATION: "Surefire test" - @BeforeMethod org.apache.brooklyn.core.test.BrooklynAppUnitTestSupport.setUp()
2018-04-27 15:58:50,544 INFO  - Added external config supplier named 'brooklyn-demo-sample': org.apache.brooklyn.core.config.external.InPlaceExternalConfigSupplier@7f8d2846
2018-04-27 15:58:50,553 INFO  - TESTNG PASSED CONFIGURATION: "Surefire test" - @BeforeMethod org.apache.brooklyn.core.test.BrooklynAppUnitTestSupport.setUp() finished in 10 ms
2018-04-27 15:58:50,553 INFO  - TESTNG INVOKING: "Surefire test" - org.apache.brooklyn.core.effector.EffectorTaskTest.testEffectorWithBodyWorksEvenIfNotOnEntity()
2018-04-27 15:58:50,562 INFO  - TESTNG PASSED: "Surefire test" - org.apache.brooklyn.core.effector.EffectorTaskTest.testEffectorWithBodyWorksEvenIfNotOnEntity() finished in 9 ms
2018-04-27 15:58:50,563 INFO  - TESTNG INVOKING CONFIGURATION: "Surefire test" - @AfterMethod org.apache.brooklyn.core.test.BrooklynMgmtUnitTestSupport.tearDown()
2018-04-27 15:58:50,567 INFO  - TESTNG PASSED CONFIGURATION: "Surefire test" - @AfterMethod org.apache.brooklyn.core.test.BrooklynMgmtUnitTestSupport.tearDown() finished in 5 ms
2018-04-27 15:58:50,567 INFO  - TESTNG INVOKING CONFIGURATION: "Surefire test" - @BeforeMethod org.apache.brooklyn.core.test.BrooklynAppUnitTestSupport.setUp()
2018-04-27 15:58:50,567 INFO  - Added external config supplier named 'brooklyn-demo-sample': org.apache.brooklyn.core.config.external.InPlaceExternalConfigSupplier@443e2c5e
2018-04-27 15:58:50,575 INFO  - TESTNG PASSED CONFIGURATION: "Surefire test" - @BeforeMethod org.apache.brooklyn.core.test.BrooklynAppUnitTestSupport.setUp() finished in 8 ms
2018-04-27 15:58:50,575 INFO  - TESTNG INVOKING: "Surefire test" - org.apache.brooklyn.core.effector.EffectorTaskTest.testEffectorWithoutBodyFails()
2018-04-27 15:58:50,586 INFO  - TESTNG PASSED: "Surefire test" - org.apache.brooklyn.core.effector.EffectorTaskTest.testEffectorWithoutBodyFails() finished in 11 ms
2018-04-27 15:58:50,586 INFO  - TESTNG INVOKING CONFIGURATION: "Surefire test" - @AfterMethod org.apache.brooklyn.core.test.BrooklynMgmtUnitTestSupport.tearDown()
2018-04-27 15:58:50,592 INFO  - TESTNG PASSED CONFIGURATION: "Surefire test" - @AfterMethod org.apache.brooklyn.core.test.BrooklynMgmtUnitTestSupport.tearDown() finished in 6 ms
2018-04-27 15:58:50,592 INFO  - TESTNG INVOKING CONFIGURATION: "Surefire test" - @BeforeMethod org.apache.brooklyn.core.test.BrooklynAppUnitTestSupport.setUp()
2018-04-27 15:58:50,592 INFO  - Added external config supplier named 'brooklyn-demo-sample': org.apache.brooklyn.core.config.external.InPlaceExternalConfigSupplier@5adfd644
2018-04-27 15:58:50,601 INFO  - TESTNG PASSED CONFIGURATION: "Surefire test" - @BeforeMethod org.apache.brooklyn.core.test.BrooklynAppUnitTestSupport.setUp() finished in 9 ms
2018-04-27 15:58:50,601 INFO  - TESTNG INVOKING: "Surefire test" - org.apache.brooklyn.core.effector.EffectorTaskTest.testNestedEffectorExecutedAsSecondaryTask()
2018-04-27 15:58:50,614 INFO  - TESTNG PASSED: "Surefire test" - org.apache.brooklyn.core.effector.EffectorTaskTest.testNestedEffectorExecutedAsSecondaryTask() finished in 13 ms
2018-04-27 15:58:50,614 INFO  - TESTNG INVOKING CONFIGURATION: "Surefire test" - @AfterMethod org.apache.brooklyn.core.test.BrooklynMgmtUnitTestSupport.tearDown()
2018-04-27 15:58:50,616 INFO  - TESTNG PASSED CONFIGURATION: "Surefire test" - @AfterMethod org.apache.brooklyn.core.test.BrooklynMgmtUnitTestSupport.tearDown() finished in 2 ms
2018-04-27 15:58:50,617 INFO  - TESTNG INVOKING CONFIGURATION: "Surefire test" - @BeforeMethod org.apache.brooklyn.core.test.BrooklynAppUnitTestSupport.setUp()
2018-04-27 15:58:50,617 INFO  - Added external config supplier named 'brooklyn-demo-sample': org.apache.brooklyn.core.config.external.InPlaceExternalConfigSupplier@5b447765
2018-04-27 15:58:50,625 INFO  - TESTNG PASSED CONFIGURATION: "Surefire test" - @BeforeMethod org.apache.brooklyn.core.test.BrooklynAppUnitTestSupport.setUp() finished in 8 ms
2018-04-27 15:58:50,625 INFO  - TESTNG INVOKING: "Surefire test" - org.apache.brooklyn.core.effector.EffectorTaskTest.testNestedEffectorTag()
2018-04-27 15:58:50,642 INFO  - TESTNG PASSED: "Surefire test" - org.apache.brooklyn.core.effector.EffectorTaskTest.testNestedEffectorTag() finished in 17 ms
2018-04-27 15:58:50,642 INFO  - TESTNG INVOKING CONFIGURATION: "Surefire test" - @AfterMethod org.apache.brooklyn.core.test.BrooklynMgmtUnitTestSupport.tearDown()
2018-04-27 15:58:50,646 INFO  - TESTNG PASSED CONFIGURATION: "Surefire test" - @AfterMethod org.apache.brooklyn.core.test.BrooklynMgmtUnitTestSupport.tearDown() finished in 4 ms
2018-04-27 15:58:50,647 INFO  - TESTNG INVOKING CONFIGURATION: "Surefire test" - @BeforeMethod org.apache.brooklyn.core.test.BrooklynAppUnitTestSupport.setUp()
2018-04-27 15:58:50,647 INFO  - Added external config supplier named 'brooklyn-demo-sample': org.apache.brooklyn.core.config.external.InPlaceExternalConfigSupplier@7962e2d2
2018-04-27 15:58:50,660 INFO  - TESTNG PASSED CONFIGURATION: "Surefire test" - @BeforeMethod org.apache.brooklyn.core.test.BrooklynAppUnitTestSupport.setUp() finished in 13 ms
2018-04-27 15:58:50,660 INFO  - TESTNG INVOKING: "Surefire test" - org.apache.brooklyn.core.effector.EffectorTaskTest.testOverriddenEffectorOnEntity()
2018-04-27 15:58:50,674 INFO  - TESTNG PASSED: "Surefire test" - org.apache.brooklyn.core.effector.EffectorTaskTest.testOverriddenEffectorOnEntity() finished in 14 ms
2018-04-27 15:58:50,674 INFO  - TESTNG INVOKING CONFIGURATION: "Surefire test" - @AfterMethod org.apache.brooklyn.core.test.BrooklynMgmtUnitTestSupport.tearDown()
2018-04-27 15:58:50,686 INFO  - TESTNG PASSED CONFIGURATION: "Surefire test" - @AfterMethod org.apache.brooklyn.core.test.BrooklynMgmtUnitTestSupport.tearDown() finished in 12 ms
2018-04-27 15:58:50,686 INFO  - TESTNG INVOKING CONFIGURATION: "Surefire test" - @BeforeMethod org.apache.brooklyn.core.test.BrooklynAppUnitTestSupport.setUp()
2018-04-27 15:58:50,686 INFO  - Added external config supplier named 'brooklyn-demo-sample': org.apache.brooklyn.core.config.external.InPlaceExternalConfigSupplier@9e1f2a7
2018-04-27 15:58:50,698 INFO  - TESTNG PASSED CONFIGURATION: "Surefire test" - @BeforeMethod org.apache.brooklyn.core.test.BrooklynAppUnitTestSupport.setUp() finished in 12 ms
2018-04-27 15:58:50,699 INFO  - TESTNG INVOKING: "Surefire test" - org.apache.brooklyn.core.effector.EffectorTaskTest.testSimpleEffectorNameMatching()
2018-04-27 15:58:50,707 INFO  - TESTNG PASSED: "Surefire test" - org.apache.brooklyn.core.effector.EffectorTaskTest.testSimpleEffectorNameMatching() finished in 8 ms
2018-04-27 15:58:50,707 INFO  - TESTNG INVOKING CONFIGURATION: "Surefire test" - @AfterMethod org.apache.brooklyn.core.test.BrooklynMgmtUnitTestSupport.tearDown()
2018-04-27 15:58:50,712 INFO  - TESTNG PASSED CONFIGURATION: "Surefire test" - @AfterMethod org.apache.brooklyn.core.test.BrooklynMgmtUnitTestSupport.tearDown() finished in 5 ms
2018-04-27 15:58:50,712 INFO  - TESTNG INVOKING CONFIGURATION: "Surefire test" - @BeforeMethod org.apache.brooklyn.core.test.BrooklynAppUnitTestSupport.setUp()
2018-04-27 15:58:50,713 INFO  - Added external config supplier named 'brooklyn-demo-sample': org.apache.brooklyn.core.config.external.InPlaceExternalConfigSupplier@2e6bf28a
2018-04-27 15:58:50,723 INFO  - TESTNG PASSED CONFIGURATION: "Surefire test" - @BeforeMethod org.apache.brooklyn.core.test.BrooklynAppUnitTestSupport.setUp() finished in 11 ms
2018-04-27 15:58:50,723 INFO  - TESTNG INVOKING: "Surefire test" - org.apache.brooklyn.core.effector.EffectorTaskTest.testSimpleEffectorOnEntity()
2018-04-27 15:58:50,732 INFO  - TESTNG PASSED: "Surefire test" - org.apache.brooklyn.core.effector.EffectorTaskTest.testSimpleEffectorOnEntity() finished in 9 ms
2018-04-27 15:58:50,732 INFO  - TESTNG INVOKING CONFIGURATION: "Surefire test" - @AfterMethod org.apache.brooklyn.core.test.BrooklynMgmtUnitTestSupport.tearDown()
2018-04-27 15:58:50,736 INFO  - TESTNG PASSED CONFIGURATION: "Surefire test" - @AfterMethod org.apache.brooklyn.core.test.BrooklynMgmtUnitTestSupport.tearDown() finished in 4 ms
2018-04-27 15:58:50,737 INFO  - TESTNG INVOKING CONFIGURATION: "Surefire test" - @BeforeMethod org.apache.brooklyn.core.test.BrooklynAppUnitTestSupport.setUp()
2018-04-27 15:58:50,737 INFO  - Added external config supplier named 'brooklyn-demo-sample': org.apache.brooklyn.core.config.external.InPlaceExternalConfigSupplier@77bed1be
2018-04-27 15:58:50,747 INFO  - TESTNG PASSED CONFIGURATION: "Surefire test" - @BeforeMethod org.apache.brooklyn.core.test.BrooklynAppUnitTestSupport.setUp() finished in 10 ms
2018-04-27 15:58:50,747 INFO  - TESTNG INVOKING: "Surefire test" - org.apache.brooklyn.core.effector.EffectorTaskTest.testSyntaxOneDouble1()
2018-04-27 15:58:50,748 INFO  - TESTNG PASSED: "Surefire test" - org.apache.brooklyn.core.effector.EffectorTaskTest.testSyntaxOneDouble1() finished in 1 ms
2018-04-27 15:58:50,748 INFO  - TESTNG INVOKING CONFIGURATION: "Surefire test" - @AfterMethod org.apache.brooklyn.core.test.BrooklynMgmtUnitTestSupport.tearDown()
2018-04-27 15:58:50,751 INFO  - TESTNG PASSED CONFIGURATION: "Surefire test" - @AfterMethod org.apache.brooklyn.core.test.BrooklynMgmtUnitTestSupport.tearDown() finished in 3 ms
2018-04-27 15:58:50,751 INFO  - TESTNG INVOKING CONFIGURATION: "Surefire test" - @BeforeMethod org.apache.brooklyn.core.test.BrooklynAppUnitTestSupport.setUp()
2018-04-27 15:58:50,751 INFO  - Added external config supplier named 'brooklyn-demo-sample': org.apache.brooklyn.core.config.external.InPlaceExternalConfigSupplier@278133f6
2018-04-27 15:58:50,761 INFO  - TESTNG PASSED CONFIGURATION: "Surefire test" - @BeforeMethod org.apache.brooklyn.core.test.BrooklynAppUnitTestSupport.setUp() finished in 10 ms
2018-04-27 15:58:50,761 INFO  - TESTNG INVOKING: "Surefire test" - org.apache.brooklyn.core.effector.EffectorTaskTest.testSyntaxOneTaggedCorrectly()
2018-04-27 15:58:50,762 INFO  - TESTNG PASSED: "Surefire test" - org.apache.brooklyn.core.effector.EffectorTaskTest.testSyntaxOneTaggedCorrectly() finished in 1 ms
2018-04-27 15:58:50,762 INFO  - TESTNG INVOKING CONFIGURATION: "Surefire test" - @AfterMethod org.apache.brooklyn.core.test.BrooklynMgmtUnitTestSupport.tearDown()
2018-04-27 15:58:50,765 INFO  - TESTNG PASSED CONFIGURATION: "Surefire test" - @AfterMethod org.apache.brooklyn.core.test.BrooklynMgmtUnitTestSupport.tearDown() finished in 3 ms
2018-04-27 15:58:50,765 INFO  - TESTNG INVOKING CONFIGURATION: "Surefire test" - @BeforeMethod org.apache.brooklyn.core.test.BrooklynAppUnitTestSupport.setUp()
2018-04-27 15:58:50,765 INFO  - Added external config supplier named 'brooklyn-demo-sample': org.apache.brooklyn.core.config.external.InPlaceExternalConfigSupplier@36d45aba
2018-04-27 15:58:50,775 INFO  - TESTNG PASSED CONFIGURATION: "Surefire test" - @BeforeMethod org.apache.brooklyn.core.test.BrooklynAppUnitTestSupport.setUp() finished in 10 ms
2018-04-27 15:58:50,775 INFO  - TESTNG INVOKING: "Surefire test" - org.apache.brooklyn.core.effector.EffectorTaskTest.testSyntaxTwoDouble2()
2018-04-27 15:58:50,784 INFO  - TESTNG PASSED: "Surefire test" - org.apache.brooklyn.core.effector.EffectorTaskTest.testSyntaxTwoDouble2() finished in 9 ms
2018-04-27 15:58:50,784 INFO  - TESTNG INVOKING CONFIGURATION: "Surefire test" - @AfterMethod org.apache.brooklyn.core.test.BrooklynMgmtUnitTestSupport.tearDown()
2018-04-27 15:58:50,796 INFO  - TESTNG PASSED CONFIGURATION: "Surefire test" - @AfterMethod org.apache.brooklyn.core.test.BrooklynMgmtUnitTestSupport.tearDown() finished in 11 ms
2018-04-27 15:58:50,799 INFO  - TESTNG INVOKING CONFIGURATION: "Surefire test" - @BeforeMethod org.apache.brooklyn.core.test.BrooklynAppUnitTestSupport.setUp()
2018-04-27 15:58:50,799 INFO  - Added external config supplier named 'brooklyn-demo-sample': org.apache.brooklyn.core.config.external.InPlaceExternalConfigSupplier@5343c732
2018-04-27 15:58:50,814 INFO  - TESTNG PASSED CONFIGURATION: "Surefire test" - @BeforeMethod org.apache.brooklyn.core.test.BrooklynAppUnitTestSupport.setUp() finished in 14 ms
2018-04-27 15:58:50,814 INFO  - TESTNG INVOKING: "Surefire test" - org.apache.brooklyn.core.effector.EffectorTaskTest.testEntityNotPermanentlyChanged()
2018-04-27 15:58:50,826 INFO  - TESTNG PASSED: "Surefire test" - org.apache.brooklyn.core.effector.EffectorTaskTest.testEntityNotPermanentlyChanged() finished in 12 ms
2018-04-27 15:58:50,826 INFO  - TESTNG INVOKING CONFIGURATION: "Surefire test" - @AfterMethod org.apache.brooklyn.core.test.BrooklynMgmtUnitTestSupport.tearDown()
2018-04-27 15:58:50,845 INFO  - TESTNG PASSED CONFIGURATION: "Surefire test" - @AfterMethod org.apache.brooklyn.core.test.BrooklynMgmtUnitTestSupport.tearDown() finished in 19 ms
2018-04-27 15:58:51,031 INFO  - TESTNG 
===============================================
    Surefire test
    Tests run: 2316, Failures: 1, Skips: 0
===============================================
[GC (Allocation Failure)  354217K->171158K(744960K), 0.0317022 secs]
[GC (Allocation Failure)  352918K->168257K(749056K), 0.0105674 secs]
[GC (Allocation Failure)  355137K->167986K(748544K), 0.0225832 secs]
[GC (Allocation Failure)  354866K->167993K(750080K), 0.0110888 secs]
[GC (Allocation Failure)  356921K->167898K(749568K), 0.0116948 secs]
[GC (Allocation Failure)  356826K->168506K(752640K), 0.0178750 secs]
[GC (Allocation Failure)  359797K->170338K(751104K), 0.0106398 secs]
Tests run: 2316, Failures: 1, Errors: 0, Skipped: 0, Time elapsed: 160.915 sec <<< FAILURE! - in TestSuite
testCommandExecutedWithEnvironment(org.apache.brooklyn.entity.group.SshCommandMembershipTrackingPolicyTest)  Time elapsed: 0.023 sec  <<< FAILURE!
java.lang.AssertionError: Lists differ at element [0]: echo ignored != mkdir -p '/path/to/myexecutiondir' && cd '/path/to/myexecutiondir' && echo 'myval' expected [echo ignored] but found [mkdir -p '/path/to/myexecutiondir' && cd '/path/to/myexecutiondir' && echo 'myval']
	at org.apache.brooklyn.entity.group.SshCommandMembershipTrackingPolicyTest.testCommandExecutedWithEnvironment(SshCommandMembershipTrackingPolicyTest.java:90)

2018-04-27 15:58:53,201 INFO  - Brooklyn shutdown: stopping entities [TestEntityImpl{id=mx16oults9}, TestEntityImpl{id=v8m93aztz5}, BlockingEntityImpl{id=ejwq1mmkme}]

Results :

Failed tests: 
  SshCommandMembershipTrackingPolicyTest.testCommandExecutedWithEnvironment:90 Lists differ at element [0]: echo ignored != mkdir -p '/path/to/myexecutiondir' && cd '/path/to/myexecutiondir' && echo 'myval' expected [echo ignored] but found [mkdir -p '/path/to/myexecutiondir' && cd '/path/to/myexecutiondir' && echo 'myval']

Tests run: 2316, Failures: 1, Errors: 0, Skipped: 0

[INFO] ------------------------------------------------------------------------
[INFO] Reactor Summary:
[INFO] 
[INFO] Brooklyn Server Root ............................... SUCCESS [  1.165 s]
[INFO] Brooklyn Parent Project ............................ SUCCESS [  3.233 s]
[INFO] Brooklyn Test Support Utilities .................... SUCCESS [  4.473 s]
[INFO] Brooklyn Logback Includable Configuration .......... SUCCESS [  0.343 s]
[INFO] Brooklyn Common Utilities .......................... SUCCESS [ 23.727 s]
[INFO] Brooklyn API ....................................... SUCCESS [  2.062 s]
[INFO] CAMP Server Parent Project ......................... SUCCESS [  0.296 s]
[INFO] CAMP Base .......................................... SUCCESS [  3.003 s]
[INFO] Brooklyn Test Support .............................. SUCCESS [  1.318 s]
[INFO] Brooklyn REST Swagger Apidoc Utilities ............. SUCCESS [  1.042 s]
[INFO] Brooklyn Logback Configuration ..................... SUCCESS [  0.169 s]
[INFO] CAMP Server ........................................ SUCCESS [  5.028 s]
[INFO] Brooklyn Felix Runtime ............................. SUCCESS [  2.468 s]
[INFO] Brooklyn Groovy Utilities .......................... SUCCESS [  2.175 s]
[INFO] Brooklyn Core ...................................... FAILURE [03:35 min]
[INFO] Brooklyn Policies .................................. SKIPPED
[INFO] Brooklyn WinRM Software Entities ................... SKIPPED
[INFO] Brooklyn Secure JMXMP Agent ........................ SKIPPED
[INFO] Brooklyn JMX RMI Agent ............................. SKIPPED
[INFO] Brooklyn Jclouds Location Targets .................. SKIPPED
[INFO] Brooklyn Software Base ............................. SKIPPED
[INFO] Brooklyn CAMP ...................................... SKIPPED
[INFO] Brooklyn Launcher Common ........................... SKIPPED
[INFO] Brooklyn REST API .................................. SKIPPED
[INFO] Brooklyn REST Resources ............................ SKIPPED
[INFO] Brooklyn REST Server ............................... SKIPPED
[INFO] Brooklyn Launcher .................................. SKIPPED
[INFO] Brooklyn Container Location Targets ................ SKIPPED
[INFO] Brooklyn Command Line Interface .................... SKIPPED
[INFO] Brooklyn Test Framework ............................ SKIPPED
[INFO] Brooklyn OSGi init ................................. SKIPPED
[INFO] Brooklyn OSGi start ................................ SKIPPED
[INFO] Brooklyn Karaf ..................................... SKIPPED
[INFO] Jetty config fragment .............................. SKIPPED
[INFO] Apache Http Component extension .................... SKIPPED
[INFO] Brooklyn Karaf Features ............................ SKIPPED
[INFO] Brooklyn Karaf Shell Commands ...................... SKIPPED
[INFO] ------------------------------------------------------------------------
[INFO] BUILD FAILURE
[INFO] ------------------------------------------------------------------------
[INFO] Total time: 04:30 min
[INFO] Finished at: 2018-04-27T15:58:53Z
[INFO] Final Memory: 70M/780M
[INFO] ------------------------------------------------------------------------
[ERROR] Failed to execute goal org.apache.maven.plugins:maven-surefire-plugin:2.19.1:test (default-test) on project brooklyn-core: There are test failures.
[ERROR] 
[ERROR] Please refer to /usr/build/core/target/surefire-reports for the individual test results.
[ERROR] -> [Help 1]
[ERROR] 
[ERROR] To see the full stack trace of the errors, re-run Maven with the -e switch.
[ERROR] Re-run Maven using the -X switch to enable full debug logging.
[ERROR] 
[ERROR] For more information about the errors and possible solutions, please read the following articles:
[ERROR] [Help 1] http://cwiki.apache.org/confluence/display/MAVEN/MojoFailureException
[ERROR] 
[ERROR] After correcting the problems, you can resume the build with the command
[ERROR]   mvn <goals> -rf :brooklyn-core
Build step 'Execute shell' marked build as failure
Recording test results
TestNG Reports Processing: START
Looking for TestNG results report in workspace using pattern: **/testng-results.xml
testng-results.xml was last modified before this build started. Ignoring it.
testng-results.xml was last modified before this build started. Ignoring it.
testng-results.xml was last modified before this build started. Ignoring it.
testng-results.xml was last modified before this build started. Ignoring it.
testng-results.xml was last modified before this build started. Ignoring it.
testng-results.xml was last modified before this build started. Ignoring it.
testng-results.xml was last modified before this build started. Ignoring it.
testng-results.xml was last modified before this build started. Ignoring it.
testng-results.xml was last modified before this build started. Ignoring it.
testng-results.xml was last modified before this build started. Ignoring it.
testng-results.xml was last modified before this build started. Ignoring it.
testng-results.xml was last modified before this build started. Ignoring it.
testng-results.xml was last modified before this build started. Ignoring it.
testng-results.xml was last modified before this build started. Ignoring it.
Saving reports...
Processing '/x1/jenkins/jenkins-home/jobs/brooklyn-server-master-docker/builds/75/testng/testng-results-1.xml'
Processing '/x1/jenkins/jenkins-home/jobs/brooklyn-server-master-docker/builds/75/testng/testng-results-2.xml'
Processing '/x1/jenkins/jenkins-home/jobs/brooklyn-server-master-docker/builds/75/testng/testng-results-3.xml'
Processing '/x1/jenkins/jenkins-home/jobs/brooklyn-server-master-docker/builds/75/testng/testng-results-4.xml'
Processing '/x1/jenkins/jenkins-home/jobs/brooklyn-server-master-docker/builds/75/testng/testng-results-5.xml'
Processing '/x1/jenkins/jenkins-home/jobs/brooklyn-server-master-docker/builds/75/testng/testng-results.xml'
0.034223% of tests failed, which exceeded threshold of 0%. Marking build as UNSTABLE
TestNG Reports Processing: FINISH