OSDir

[Date Prev][Date Next][Thread Prev][Thread Next][Date Index][Thread Index]

Build failed in Jenkins: brooklyn-master-build-docker #382


See <https://builds.apache.org/job/brooklyn-master-build-docker/382/display/redirect>

------------------------------------------
[...truncated 7.66 MB...]
2018-04-25 09:00:48,847 INFO  - TESTNG PASSED CONFIGURATION: "Surefire test" - @BeforeMethod org.apache.brooklyn.rest.testing.BrooklynRestApiTest.setUpMethod() finished in 0 ms
2018-04-25 09:00:48,847 INFO  - TESTNG INVOKING: "Surefire test" - org.apache.brooklyn.rest.resources.ApplicationResourceTest.testTriggerSampleEffectorWithFormData()
2018-04-25 09:00:48,848 INFO  GvL5nRHw-[myidtestdeploymentuidisset] Started application BasicApplicationImpl{id=myidtestdeploymentuidisset}
2018-04-25 09:00:48,851 INFO  - REST invocation of RestMockSimpleEntity{id=apraoqrp4x}.sampleEffector[param1,param2] {param1=foo, param2=4} (no user info available)
2018-04-25 09:00:48,852 INFO  UVYt40v9-[f5cj1lhymf,apraoqrp4x] Invoked sampleEffector(foo,4)
2018-04-25 09:00:48,853 INFO  - TESTNG PASSED: "Surefire test" - org.apache.brooklyn.rest.resources.ApplicationResourceTest.testTriggerSampleEffectorWithFormData() finished in 6 ms
2018-04-25 09:00:48,854 INFO  - TESTNG INVOKING CONFIGURATION: "Surefire test" - @AfterMethod org.apache.brooklyn.rest.testing.BrooklynRestApiTest.tearDownMethod()
2018-04-25 09:00:48,854 INFO  - TESTNG PASSED CONFIGURATION: "Surefire test" - @AfterMethod org.apache.brooklyn.rest.testing.BrooklynRestApiTest.tearDownMethod() finished in 1 ms
2018-04-25 09:00:48,854 INFO  - TESTNG INVOKING CONFIGURATION: "Surefire test" - @BeforeMethod org.apache.brooklyn.rest.testing.BrooklynRestApiTest.setUpMethod()
2018-04-25 09:00:48,855 INFO  - TESTNG PASSED CONFIGURATION: "Surefire test" - @BeforeMethod org.apache.brooklyn.rest.testing.BrooklynRestApiTest.setUpMethod() finished in 1 ms
2018-04-25 09:00:48,855 INFO  - TESTNG INVOKING: "Surefire test" - org.apache.brooklyn.rest.resources.ApplicationResourceTest.testBatchSensorValues()
2018-04-25 09:00:48,861 INFO  - TESTNG PASSED: "Surefire test" - org.apache.brooklyn.rest.resources.ApplicationResourceTest.testBatchSensorValues() finished in 6 ms
2018-04-25 09:00:48,861 INFO  - TESTNG INVOKING CONFIGURATION: "Surefire test" - @AfterMethod org.apache.brooklyn.rest.testing.BrooklynRestApiTest.tearDownMethod()
2018-04-25 09:00:48,861 INFO  - TESTNG PASSED CONFIGURATION: "Surefire test" - @AfterMethod org.apache.brooklyn.rest.testing.BrooklynRestApiTest.tearDownMethod() finished in 0 ms
2018-04-25 09:00:48,861 INFO  - TESTNG INVOKING CONFIGURATION: "Surefire test" - @BeforeMethod org.apache.brooklyn.rest.testing.BrooklynRestApiTest.setUpMethod()
2018-04-25 09:00:48,861 INFO  - TESTNG PASSED CONFIGURATION: "Surefire test" - @BeforeMethod org.apache.brooklyn.rest.testing.BrooklynRestApiTest.setUpMethod() finished in 0 ms
2018-04-25 09:00:48,861 INFO  - TESTNG INVOKING: "Surefire test" - org.apache.brooklyn.rest.resources.ApplicationResourceTest.testPolicyWhichCapitalizes()
2018-04-25 09:00:48,876 INFO  - POLICY CREATED: wz6chg1jh7
2018-04-25 09:00:48,888 INFO  - POLICY STATUS: running
[GC (Allocation Failure)  237806K->49496K(748032K), 0.0146509 secs]
2018-04-25 09:00:48,927 INFO  - POLICY STATUS RESPONSE AFTER DESTROY: 404
2018-04-25 09:00:48,932 INFO  - TESTNG PASSED: "Surefire test" - org.apache.brooklyn.rest.resources.ApplicationResourceTest.testPolicyWhichCapitalizes() finished in 71 ms
2018-04-25 09:00:48,932 INFO  - TESTNG INVOKING CONFIGURATION: "Surefire test" - @AfterMethod org.apache.brooklyn.rest.testing.BrooklynRestApiTest.tearDownMethod()
2018-04-25 09:00:48,932 INFO  - TESTNG PASSED CONFIGURATION: "Surefire test" - @AfterMethod org.apache.brooklyn.rest.testing.BrooklynRestApiTest.tearDownMethod() finished in 0 ms
2018-04-25 09:00:48,933 INFO  - TESTNG INVOKING CONFIGURATION: "Surefire test" - @BeforeMethod org.apache.brooklyn.rest.testing.BrooklynRestApiTest.setUpMethod()
2018-04-25 09:00:48,933 INFO  - TESTNG PASSED CONFIGURATION: "Surefire test" - @BeforeMethod org.apache.brooklyn.rest.testing.BrooklynRestApiTest.setUpMethod() finished in 0 ms
2018-04-25 09:00:48,933 INFO  - TESTNG INVOKING: "Surefire test" - org.apache.brooklyn.rest.resources.ApplicationResourceTest.testReadEachSensor()
2018-04-25 09:00:49,033 INFO  - TESTNG PASSED: "Surefire test" - org.apache.brooklyn.rest.resources.ApplicationResourceTest.testReadEachSensor() finished in 100 ms
2018-04-25 09:00:49,033 INFO  - TESTNG INVOKING CONFIGURATION: "Surefire test" - @AfterMethod org.apache.brooklyn.rest.testing.BrooklynRestApiTest.tearDownMethod()
2018-04-25 09:00:49,033 INFO  - TESTNG PASSED CONFIGURATION: "Surefire test" - @AfterMethod org.apache.brooklyn.rest.testing.BrooklynRestApiTest.tearDownMethod() finished in 0 ms
2018-04-25 09:00:49,034 INFO  - TESTNG INVOKING CONFIGURATION: "Surefire test" - @BeforeMethod org.apache.brooklyn.rest.testing.BrooklynRestApiTest.setUpMethod()
2018-04-25 09:00:49,034 INFO  - TESTNG PASSED CONFIGURATION: "Surefire test" - @BeforeMethod org.apache.brooklyn.rest.testing.BrooklynRestApiTest.setUpMethod() finished in 0 ms
2018-04-25 09:00:49,034 INFO  - TESTNG INVOKING: "Surefire test" - org.apache.brooklyn.rest.resources.ApplicationResourceTest.testDeleteApplication()
2018-04-25 09:00:49,039 INFO  - Deleting simple-app from [BasicApplicationImpl{id=qoaxrwq8ie}, BasicApplicationImpl{id=1234567890}, BasicApplicationImpl{id=myuiddifferent}, BasicApplicationImpl{id=aaaaaaaaaaaaaaaaaaaaaaaaaaaaaaaaaaaaaaaaaaaaaaaaaaaaaaaaaaaaaaa}, BasicApplicationImpl{id=abcdefghijkl}, BasicApplicationImpl{id=myidtestdeploymentuidisset}, BasicApplicationImpl{id=f5cj1lhymf}, BasicApplicationImpl{id=n5bpmn18oc}, BasicApplicationImpl{id=myuidtestdeploymentuidfailsonduplicate}]
2018-04-25 09:00:49,051 INFO  - App appears gone, apps are: [BasicApplicationImpl{id=qoaxrwq8ie}, BasicApplicationImpl{id=1234567890}, BasicApplicationImpl{id=myuiddifferent}, BasicApplicationImpl{id=aaaaaaaaaaaaaaaaaaaaaaaaaaaaaaaaaaaaaaaaaaaaaaaaaaaaaaaaaaaaaaa}, BasicApplicationImpl{id=abcdefghijkl}, BasicApplicationImpl{id=myidtestdeploymentuidisset}, BasicApplicationImpl{id=n5bpmn18oc}, BasicApplicationImpl{id=myuidtestdeploymentuidfailsonduplicate}]
2018-04-25 09:00:49,052 INFO  - TESTNG PASSED: "Surefire test" - org.apache.brooklyn.rest.resources.ApplicationResourceTest.testDeleteApplication() finished in 18 ms
2018-04-25 09:00:49,052 INFO  - TESTNG INVOKING CONFIGURATION: "Surefire test" - @AfterMethod org.apache.brooklyn.rest.testing.BrooklynRestApiTest.tearDownMethod()
2018-04-25 09:00:49,052 INFO  - TESTNG PASSED CONFIGURATION: "Surefire test" - @AfterMethod org.apache.brooklyn.rest.testing.BrooklynRestApiTest.tearDownMethod() finished in 0 ms
2018-04-25 09:00:49,053 INFO  - TESTNG INVOKING CONFIGURATION: "Surefire test" - @BeforeMethod org.apache.brooklyn.rest.testing.BrooklynRestApiTest.setUpMethod()
2018-04-25 09:00:49,053 INFO  - TESTNG PASSED CONFIGURATION: "Surefire test" - @BeforeMethod org.apache.brooklyn.rest.testing.BrooklynRestApiTest.setUpMethod() finished in 0 ms
2018-04-25 09:00:49,053 INFO  - TESTNG INVOKING: "Surefire test" - org.apache.brooklyn.rest.resources.ApplicationResourceTest.testDeployApplicationImpl()
2018-04-25 09:00:49,059 INFO  - Entity type 'org.apache.brooklyn.rest.testing.mocks.RestMockApp' not defined in catalog but is on classpath; continuing
2018-04-25 09:00:49,060 WARN  - Using deprecated functionality (as of 0.9.0), ApplicationSpec style (pre CAMP plans). Transition to actively supported spec plans.
2018-04-25 09:00:49,060 INFO  - Catalog does not contain item for type org.apache.brooklyn.rest.testing.mocks.RestMockApp; loaded class directly instead
2018-04-25 09:00:49,060 INFO  - REST placing 'simple-app-impl' under management
2018-04-25 09:00:49,080 INFO  undKHLeP-[q87vrz6wku] Started application RestMockApp{id=q87vrz6wku}
2018-04-25 09:00:49,099 INFO  - TESTNG PASSED: "Surefire test" - org.apache.brooklyn.rest.resources.ApplicationResourceTest.testDeployApplicationImpl() finished in 46 ms
2018-04-25 09:00:49,099 INFO  - TESTNG INVOKING CONFIGURATION: "Surefire test" - @AfterMethod org.apache.brooklyn.rest.testing.BrooklynRestApiTest.tearDownMethod()
2018-04-25 09:00:49,100 INFO  - TESTNG PASSED CONFIGURATION: "Surefire test" - @AfterMethod org.apache.brooklyn.rest.testing.BrooklynRestApiTest.tearDownMethod() finished in 1 ms
2018-04-25 09:00:49,100 INFO  - TESTNG INVOKING CONFIGURATION: "Surefire test" - @AfterClass org.apache.brooklyn.rest.testing.BrooklynRestApiTest.tearDownClass()
2018-04-25 09:00:49,101 INFO  GL1uCGEx-[1234567890] Stopping application BasicApplicationImpl{id=1234567890}
2018-04-25 09:00:49,101 INFO  TLmKybqe-[qoaxrwq8ie] Stopping application BasicApplicationImpl{id=qoaxrwq8ie}
2018-04-25 09:00:49,101 INFO  GL1uCGEx-[1234567890] Stopped application BasicApplicationImpl{id=1234567890}
2018-04-25 09:00:49,104 INFO  TLmKybqe-[qoaxrwq8ie] Stopped application BasicApplicationImpl{id=qoaxrwq8ie}
2018-04-25 09:00:49,105 INFO  Ub5jaTln-[myuiddifferent] Stopping application BasicApplicationImpl{id=myuiddifferent}
2018-04-25 09:00:49,105 INFO  HSERKmhm-[q87vrz6wku] Stopping application RestMockApp{id=q87vrz6wku}
2018-04-25 09:00:49,105 INFO  HSERKmhm-[q87vrz6wku] Stopped application RestMockApp{id=q87vrz6wku}
2018-04-25 09:00:49,106 INFO  jZXChIsH-[aaaaaaaaaaaaaaaaaaaaaaaaaaaaaaaaaaaaaaaaaaaaaaaaaaaaaaaaaaaaaaa] Stopping application BasicApplicationImpl{id=aaaaaaaaaaaaaaaaaaaaaaaaaaaaaaaaaaaaaaaaaaaaaaaaaaaaaaaaaaaaaaa}
2018-04-25 09:00:49,107 INFO  Ub5jaTln-[myuiddifferent] Stopped application BasicApplicationImpl{id=myuiddifferent}
2018-04-25 09:00:49,107 INFO  jZXChIsH-[aaaaaaaaaaaaaaaaaaaaaaaaaaaaaaaaaaaaaaaaaaaaaaaaaaaaaaaaaaaaaaa] Stopped application BasicApplicationImpl{id=aaaaaaaaaaaaaaaaaaaaaaaaaaaaaaaaaaaaaaaaaaaaaaaaaaaaaaaaaaaaaaa}
2018-04-25 09:00:49,108 INFO  sXoelvVk-[abcdefghijkl] Stopping application BasicApplicationImpl{id=abcdefghijkl}
2018-04-25 09:00:49,109 INFO  sXoelvVk-[abcdefghijkl] Stopped application BasicApplicationImpl{id=abcdefghijkl}
2018-04-25 09:00:49,109 INFO  e8CHTnmP-[myidtestdeploymentuidisset] Stopping application BasicApplicationImpl{id=myidtestdeploymentuidisset}
2018-04-25 09:00:49,111 INFO  e8CHTnmP-[myidtestdeploymentuidisset] Stopped application BasicApplicationImpl{id=myidtestdeploymentuidisset}
2018-04-25 09:00:49,112 INFO  K3oioCLV-[n5bpmn18oc] Stopping application BasicApplicationImpl{id=n5bpmn18oc}
2018-04-25 09:00:49,112 INFO  K3oioCLV-[n5bpmn18oc] Stopped application BasicApplicationImpl{id=n5bpmn18oc}
2018-04-25 09:00:49,114 INFO  vWRtArbq-[myuidtestdeploymentuidfailsonduplicate] Stopping application BasicApplicationImpl{id=myuidtestdeploymentuidfailsonduplicate}
2018-04-25 09:00:49,115 INFO  vWRtArbq-[myuidtestdeploymentuidfailsonduplicate] Stopped application BasicApplicationImpl{id=myuidtestdeploymentuidfailsonduplicate}
2018-04-25 09:00:49,116 INFO  - TESTNG PASSED CONFIGURATION: "Surefire test" - @AfterClass org.apache.brooklyn.rest.testing.BrooklynRestApiTest.tearDownClass() finished in 16 ms
2018-04-25 09:00:49,119 INFO  - TESTNG 
===============================================
    Surefire test
    Tests run: 244, Failures: 1, Skips: 0
===============================================
2018-04-25 09:00:49,119 INFO  - TESTNG RUNNING: Suite: "Surefire test" containing "0" Tests (config: null)
2018-04-25 09:00:49,120 INFO  - TESTNG 
===============================================
    Surefire test
    Tests run: 244, Failures: 1, Skips: 0
===============================================
Tests run: 244, Failures: 1, Errors: 0, Skipped: 0, Time elapsed: 37.017 sec <<< FAILURE! - in TestSuite
testInvokeEffectorWithTimeoutTimesOut(org.apache.brooklyn.rest.resources.EffectorResourceTest)  Time elapsed: 0.122 sec  <<< FAILURE!
java.lang.AssertionError: 
responseMap={id=rooOTYUx, displayName=sleepEffector, description=Invoking effector sleepEffector on TestEntity:omhr with parameters {duration=5m}, entityId=omhrovgf09, entityDisplayName=TestEntity:omhr, tags=[EFFECTOR, {wrappingType=contextEntity, entity={type=org.apache.brooklyn.api.entity.Entity, id=omhrovgf09}}, {entityId=omhrovgf09, effectorName=sleepEffector}, {wrappingType=targetEntity, entity={type=org.apache.brooklyn.api.entity.Entity, id=omhrovgf09}}, {type=org.apache.brooklyn.api.mgmt.ManagementContext}], submitTimeUtc=1.524646822928E12, startTimeUtc=1.524646822928E12, endTimeUtc=null, currentStatus=In progress, result=null, isError=false, isCancelled=false, children=[], submittedByTask=null, detailedStatus=Task[sleepEffector]@rooOTYUx

In progress (RUNNABLE)
At: org.apache.brooklyn.util.core.config.ConfigBag.getAllConfig(ConfigBag.java:172)
    org.apache.brooklyn.core.effector.AbstractEffector$1$1.call(AbstractEffector.java:79)
    org.apache.brooklyn.util.core.task.DynamicSequentialTask$DstJob.call(DynamicSequentialTask.java:364)
    org.apache.brooklyn.util.core.task.BasicExecutionManager$SubmissionCallable.call(BasicExecutionManager.java:565), streams={}, links={self=/activities/rooOTYUx, children=/activities/rooOTYUx/children, entity=/applications/s9g1rk3usc/entities/omhrovgf09}} expected [true] but found [false]
	at org.apache.brooklyn.rest.resources.EffectorResourceTest.testInvokeEffectorWithTimeoutTimesOut(EffectorResourceTest.java:162)


Results :

Failed tests: 
  EffectorResourceTest.testInvokeEffectorWithTimeoutTimesOut:162 responseMap={id=rooOTYUx, displayName=sleepEffector, description=Invoking effector sleepEffector on TestEntity:omhr with parameters {duration=5m}, entityId=omhrovgf09, entityDisplayName=TestEntity:omhr, tags=[EFFECTOR, {wrappingType=contextEntity, entity={type=org.apache.brooklyn.api.entity.Entity, id=omhrovgf09}}, {entityId=omhrovgf09, effectorName=sleepEffector}, {wrappingType=targetEntity, entity={type=org.apache.brooklyn.api.entity.Entity, id=omhrovgf09}}, {type=org.apache.brooklyn.api.mgmt.ManagementContext}], submitTimeUtc=1.524646822928E12, startTimeUtc=1.524646822928E12, endTimeUtc=null, currentStatus=In progress, result=null, isError=false, isCancelled=false, children=[], submittedByTask=null, detailedStatus=Task[sleepEffector]@rooOTYUx

In progress (RUNNABLE)
At: org.apache.brooklyn.util.core.config.ConfigBag.getAllConfig(ConfigBag.java:172)
    org.apache.brooklyn.core.effector.AbstractEffector$1$1.call(AbstractEffector.java:79)
    org.apache.brooklyn.util.core.task.DynamicSequentialTask$DstJob.call(DynamicSequentialTask.java:364)
    org.apache.brooklyn.util.core.task.BasicExecutionManager$SubmissionCallable.call(BasicExecutionManager.java:565), streams={}, links={self=/activities/rooOTYUx, children=/activities/rooOTYUx/children, entity=/applications/s9g1rk3usc/entities/omhrovgf09}} expected [true] but found [false]

Tests run: 244, Failures: 1, Errors: 0, Skipped: 0

[INFO] ------------------------------------------------------------------------
[INFO] Reactor Summary:
[INFO] 
[INFO] Brooklyn REST JavaScript Web GUI ................... SUCCESS [ 27.153 s]
[INFO] Brooklyn Server Root ............................... SUCCESS [  0.125 s]
[INFO] Brooklyn Parent Project ............................ SUCCESS [  1.636 s]
[INFO] Brooklyn Test Support Utilities .................... SUCCESS [  2.608 s]
[INFO] Brooklyn Logback Includable Configuration .......... SUCCESS [  0.290 s]
[INFO] Brooklyn Common Utilities .......................... SUCCESS [ 17.301 s]
[INFO] Brooklyn API ....................................... SUCCESS [  1.182 s]
[INFO] CAMP Server Parent Project ......................... SUCCESS [  0.381 s]
[INFO] CAMP Base .......................................... SUCCESS [  2.055 s]
[INFO] Brooklyn Test Support .............................. SUCCESS [  0.706 s]
[INFO] Brooklyn REST Swagger Apidoc Utilities ............. SUCCESS [  0.555 s]
[INFO] Brooklyn Logback Configuration ..................... SUCCESS [  0.130 s]
[INFO] CAMP Server ........................................ SUCCESS [  3.463 s]
[INFO] Brooklyn Felix Runtime ............................. SUCCESS [  1.953 s]
[INFO] Brooklyn Groovy Utilities .......................... SUCCESS [  1.672 s]
[INFO] Brooklyn Core ...................................... SUCCESS [02:43 min]
[INFO] Brooklyn Policies .................................. SUCCESS [ 29.381 s]
[INFO] Brooklyn WinRM Software Entities ................... SUCCESS [  8.669 s]
[INFO] Brooklyn Secure JMXMP Agent ........................ SUCCESS [  7.073 s]
[INFO] Brooklyn JMX RMI Agent ............................. SUCCESS [  0.290 s]
[INFO] Brooklyn Jclouds Location Targets .................. SUCCESS [ 30.754 s]
[INFO] Brooklyn Software Base ............................. SUCCESS [01:10 min]
[INFO] Brooklyn CAMP ...................................... SUCCESS [02:04 min]
[INFO] Brooklyn Launcher Common ........................... SUCCESS [  4.670 s]
[INFO] Brooklyn REST API .................................. SUCCESS [  8.365 s]
[INFO] Brooklyn REST Resources ............................ FAILURE [ 42.875 s]
[INFO] Brooklyn REST Server ............................... SKIPPED
[INFO] Brooklyn Launcher .................................. SKIPPED
[INFO] Brooklyn Container Location Targets ................ SKIPPED
[INFO] Brooklyn Command Line Interface .................... SKIPPED
[INFO] Brooklyn Test Framework ............................ SKIPPED
[INFO] Brooklyn OSGi init ................................. SKIPPED
[INFO] Brooklyn OSGi start ................................ SKIPPED
[INFO] Brooklyn Karaf ..................................... SKIPPED
[INFO] Jetty config fragment .............................. SKIPPED
[INFO] Apache Http Component extension .................... SKIPPED
[INFO] Brooklyn Karaf Features ............................ SKIPPED
[INFO] Brooklyn Karaf Shell Commands ...................... SKIPPED
[INFO] Brooklyn Library Root .............................. SKIPPED
[INFO] Brooklyn CM Chef ................................... SKIPPED
[INFO] Brooklyn CM SaltStack .............................. SKIPPED
[INFO] Brooklyn CM Ansible ................................ SKIPPED
[INFO] Brooklyn CM Integration Root ....................... SKIPPED
[INFO] Brooklyn Network Software Entities ................. SKIPPED
[INFO] Brooklyn OSGi Software Entities .................... SKIPPED
[INFO] Brooklyn Database Software Entities ................ SKIPPED
[INFO] Brooklyn Web App Software Entities ................. SKIPPED
[INFO] Brooklyn Messaging Software Entities ............... SKIPPED
[INFO] Brooklyn NoSQL Data Store Software Entities ........ SKIPPED
[INFO] Brooklyn Monitoring Software Entities .............. SKIPPED
[INFO] Brooklyn Web App Software Entities ................. SKIPPED
[INFO] Brooklyn QA ........................................ SKIPPED
[INFO] Brooklyn Examples Aggregator Project ............... SKIPPED
[INFO] Brooklyn Examples Aggregator Project - Webapps ..... SKIPPED
[INFO] hello-world-webapp Maven Webapp .................... SKIPPED
[INFO] hello-world-sql-webapp Maven Webapp ................ SKIPPED
[INFO] Brooklyn Simple Web Cluster Example ................ SKIPPED
[INFO] Brooklyn Library Karaf integration ................. SKIPPED
[INFO] Brooklyn Library Catalog ........................... SKIPPED
[INFO] Brooklyn Library Karaf Features .................... SKIPPED
[INFO] Brooklyn Client .................................... SKIPPED
[INFO] Brooklyn Client Command Line Interface ............. SKIPPED
[INFO] Brooklyn REST java Client .......................... SKIPPED
[INFO] Brooklyn Downstream Project Parent ................. SKIPPED
[INFO] Brooklyn Dist Root ................................. SKIPPED
[INFO] Brooklyn All Things ................................ SKIPPED
[INFO] Brooklyn Distribution .............................. SKIPPED
[INFO] Brooklyn Karaf Distribution Parent ................. SKIPPED
[INFO] Brooklyn Karaf Server Configuration ................ SKIPPED
[INFO] Brooklyn Dist Karaf Features ....................... SKIPPED
[INFO] Brooklyn Karaf Distribution ........................ SKIPPED
[INFO] Brooklyn Karaf pax-exam itest ...................... SKIPPED
[INFO] Brooklyn Vagrant Getting Started Environment ....... SKIPPED
[INFO] Brooklyn Quick-Start Project Archetype ............. SKIPPED
[INFO] Brooklyn Shared Package Files ...................... SKIPPED
[INFO] Brooklyn RPM Package ............................... SKIPPED
[INFO] Brooklyn DEB Package ............................... SKIPPED
[INFO] Brooklyn Root ...................................... SKIPPED
[INFO] ------------------------------------------------------------------------
[INFO] BUILD FAILURE
[INFO] ------------------------------------------------------------------------
[INFO] Total time: 09:14 min
[INFO] Finished at: 2018-04-25T09:00:49Z
[INFO] Final Memory: 142M/911M
[INFO] ------------------------------------------------------------------------
[ERROR] Failed to execute goal org.apache.maven.plugins:maven-surefire-plugin:2.19.1:test (default-test) on project brooklyn-rest-resources: There are test failures.
[ERROR] 
[ERROR] Please refer to /usr/build/brooklyn-server/rest/rest-resources/target/surefire-reports for the individual test results.
[ERROR] -> [Help 1]
[ERROR] 
[ERROR] To see the full stack trace of the errors, re-run Maven with the -e switch.
[ERROR] Re-run Maven using the -X switch to enable full debug logging.
[ERROR] 
[ERROR] For more information about the errors and possible solutions, please read the following articles:
[ERROR] [Help 1] http://cwiki.apache.org/confluence/display/MAVEN/MojoFailureException
[ERROR] 
[ERROR] After correcting the problems, you can resume the build with the command
[ERROR]   mvn <goals> -rf :brooklyn-rest-resources
Build step 'Execute shell' marked build as failure
Recording test results
TestNG Reports Processing: START
Looking for TestNG results report in workspace using pattern: **/testng-results.xml
testng-results.xml was last modified before this build started. Ignoring it.
testng-results.xml was last modified before this build started. Ignoring it.
testng-results.xml was last modified before this build started. Ignoring it.
testng-results.xml was last modified before this build started. Ignoring it.
testng-results.xml was last modified before this build started. Ignoring it.
testng-results.xml was last modified before this build started. Ignoring it.
testng-results.xml was last modified before this build started. Ignoring it.
testng-results.xml was last modified before this build started. Ignoring it.
testng-results.xml was last modified before this build started. Ignoring it.
testng-results.xml was last modified before this build started. Ignoring it.
testng-results.xml was last modified before this build started. Ignoring it.
testng-results.xml was last modified before this build started. Ignoring it.
testng-results.xml was last modified before this build started. Ignoring it.
testng-results.xml was last modified before this build started. Ignoring it.
testng-results.xml was last modified before this build started. Ignoring it.
testng-results.xml was last modified before this build started. Ignoring it.
testng-results.xml was last modified before this build started. Ignoring it.
testng-results.xml was last modified before this build started. Ignoring it.
testng-results.xml was last modified before this build started. Ignoring it.
testng-results.xml was last modified before this build started. Ignoring it.
Saving reports...
Processing '/x1/jenkins/jenkins-home/jobs/brooklyn-master-build-docker/builds/382/testng/testng-results-1.xml'
Processing '/x1/jenkins/jenkins-home/jobs/brooklyn-master-build-docker/builds/382/testng/testng-results-10.xml'
Processing '/x1/jenkins/jenkins-home/jobs/brooklyn-master-build-docker/builds/382/testng/testng-results-11.xml'
Processing '/x1/jenkins/jenkins-home/jobs/brooklyn-master-build-docker/builds/382/testng/testng-results-12.xml'
Processing '/x1/jenkins/jenkins-home/jobs/brooklyn-master-build-docker/builds/382/testng/testng-results-13.xml'
Processing '/x1/jenkins/jenkins-home/jobs/brooklyn-master-build-docker/builds/382/testng/testng-results-14.xml'
Processing '/x1/jenkins/jenkins-home/jobs/brooklyn-master-build-docker/builds/382/testng/testng-results-2.xml'
Processing '/x1/jenkins/jenkins-home/jobs/brooklyn-master-build-docker/builds/382/testng/testng-results-3.xml'
Processing '/x1/jenkins/jenkins-home/jobs/brooklyn-master-build-docker/builds/382/testng/testng-results-4.xml'
Processing '/x1/jenkins/jenkins-home/jobs/brooklyn-master-build-docker/builds/382/testng/testng-results-5.xml'
Processing '/x1/jenkins/jenkins-home/jobs/brooklyn-master-build-docker/builds/382/testng/testng-results-6.xml'
Processing '/x1/jenkins/jenkins-home/jobs/brooklyn-master-build-docker/builds/382/testng/testng-results-7.xml'
Processing '/x1/jenkins/jenkins-home/jobs/brooklyn-master-build-docker/builds/382/testng/testng-results-8.xml'
Processing '/x1/jenkins/jenkins-home/jobs/brooklyn-master-build-docker/builds/382/testng/testng-results-9.xml'
Processing '/x1/jenkins/jenkins-home/jobs/brooklyn-master-build-docker/builds/382/testng/testng-results.xml'
0.021858% of tests failed, which exceeded threshold of 0%. Marking build as UNSTABLE
TestNG Reports Processing: FINISH