osdir.com

[Date Prev][Date Next][Thread Prev][Thread Next][Date Index][Thread Index]

Build failed in Jenkins: brooklyn-master-build-docker #317


See <https://builds.apache.org/job/brooklyn-master-build-docker/317/display/redirect>

------------------------------------------
[...truncated 8.38 MB...]
2018-03-29 23:34:14,334 INFO  - TESTNG PASSED: "Surefire test" - org.apache.brooklyn.rest.resources.PolicyResourceTest.testHighlights() finished in 11 ms
2018-03-29 23:34:14,334 INFO  - TESTNG INVOKING CONFIGURATION: "Surefire test" - @AfterMethod org.apache.brooklyn.rest.testing.BrooklynRestApiTest.tearDownMethod()
2018-03-29 23:34:14,334 INFO  - TESTNG PASSED CONFIGURATION: "Surefire test" - @AfterMethod org.apache.brooklyn.rest.testing.BrooklynRestApiTest.tearDownMethod() finished in 0 ms
2018-03-29 23:34:14,335 INFO  - TESTNG INVOKING CONFIGURATION: "Surefire test" - @BeforeMethod org.apache.brooklyn.rest.testing.BrooklynRestApiTest.setUpMethod()
2018-03-29 23:34:14,335 INFO  - TESTNG PASSED CONFIGURATION: "Surefire test" - @BeforeMethod org.apache.brooklyn.rest.testing.BrooklynRestApiTest.setUpMethod() finished in 1 ms
2018-03-29 23:34:14,335 INFO  - TESTNG INVOKING: "Surefire test" - org.apache.brooklyn.rest.resources.PolicyResourceTest.testListConfig()
2018-03-29 23:34:14,348 INFO  - TESTNG PASSED: "Surefire test" - org.apache.brooklyn.rest.resources.PolicyResourceTest.testListConfig() finished in 12 ms
2018-03-29 23:34:14,348 INFO  - TESTNG INVOKING CONFIGURATION: "Surefire test" - @AfterMethod org.apache.brooklyn.rest.testing.BrooklynRestApiTest.tearDownMethod()
2018-03-29 23:34:14,348 INFO  - TESTNG PASSED CONFIGURATION: "Surefire test" - @AfterMethod org.apache.brooklyn.rest.testing.BrooklynRestApiTest.tearDownMethod() finished in 0 ms
2018-03-29 23:34:14,348 INFO  - TESTNG INVOKING CONFIGURATION: "Surefire test" - @BeforeMethod org.apache.brooklyn.rest.testing.BrooklynRestApiTest.setUpMethod()
2018-03-29 23:34:14,348 INFO  - TESTNG PASSED CONFIGURATION: "Surefire test" - @BeforeMethod org.apache.brooklyn.rest.testing.BrooklynRestApiTest.setUpMethod() finished in 0 ms
2018-03-29 23:34:14,348 INFO  - TESTNG INVOKING: "Surefire test" - org.apache.brooklyn.rest.resources.PolicyResourceTest.testGetNonExistantConfigReturns404()
2018-03-29 23:34:14,358 INFO  - TESTNG PASSED: "Surefire test" - org.apache.brooklyn.rest.resources.PolicyResourceTest.testGetNonExistantConfigReturns404() finished in 10 ms
2018-03-29 23:34:14,359 INFO  - TESTNG INVOKING CONFIGURATION: "Surefire test" - @AfterMethod org.apache.brooklyn.rest.testing.BrooklynRestApiTest.tearDownMethod()
2018-03-29 23:34:14,359 INFO  - TESTNG PASSED CONFIGURATION: "Surefire test" - @AfterMethod org.apache.brooklyn.rest.testing.BrooklynRestApiTest.tearDownMethod() finished in 0 ms
2018-03-29 23:34:14,359 INFO  - TESTNG INVOKING CONFIGURATION: "Surefire test" - @BeforeMethod org.apache.brooklyn.rest.testing.BrooklynRestApiTest.setUpMethod()
2018-03-29 23:34:14,359 INFO  - TESTNG PASSED CONFIGURATION: "Surefire test" - @BeforeMethod org.apache.brooklyn.rest.testing.BrooklynRestApiTest.setUpMethod() finished in 0 ms
2018-03-29 23:34:14,359 INFO  - TESTNG INVOKING: "Surefire test" - org.apache.brooklyn.rest.resources.PolicyResourceTest.testReconfigureConfig()
2018-03-29 23:34:14,366 INFO  - TESTNG PASSED: "Surefire test" - org.apache.brooklyn.rest.resources.PolicyResourceTest.testReconfigureConfig() finished in 7 ms
2018-03-29 23:34:14,366 INFO  - TESTNG INVOKING CONFIGURATION: "Surefire test" - @AfterMethod org.apache.brooklyn.rest.testing.BrooklynRestApiTest.tearDownMethod()
2018-03-29 23:34:14,366 INFO  - TESTNG PASSED CONFIGURATION: "Surefire test" - @AfterMethod org.apache.brooklyn.rest.testing.BrooklynRestApiTest.tearDownMethod() finished in 0 ms
2018-03-29 23:34:14,366 INFO  - TESTNG INVOKING CONFIGURATION: "Surefire test" - @BeforeMethod org.apache.brooklyn.rest.testing.BrooklynRestApiTest.setUpMethod()
2018-03-29 23:34:14,366 INFO  - TESTNG PASSED CONFIGURATION: "Surefire test" - @BeforeMethod org.apache.brooklyn.rest.testing.BrooklynRestApiTest.setUpMethod() finished in 0 ms
2018-03-29 23:34:14,367 INFO  - TESTNG INVOKING: "Surefire test" - org.apache.brooklyn.rest.resources.PolicyResourceTest.testGetConfigValue()
2018-03-29 23:34:14,379 INFO  - TESTNG PASSED: "Surefire test" - org.apache.brooklyn.rest.resources.PolicyResourceTest.testGetConfigValue() finished in 12 ms
2018-03-29 23:34:14,380 INFO  - TESTNG INVOKING CONFIGURATION: "Surefire test" - @AfterMethod org.apache.brooklyn.rest.testing.BrooklynRestApiTest.tearDownMethod()
2018-03-29 23:34:14,380 INFO  - TESTNG PASSED CONFIGURATION: "Surefire test" - @AfterMethod org.apache.brooklyn.rest.testing.BrooklynRestApiTest.tearDownMethod() finished in 1 ms
2018-03-29 23:34:14,380 INFO  - TESTNG INVOKING CONFIGURATION: "Surefire test" - @AfterClass org.apache.brooklyn.rest.testing.BrooklynRestApiTest.tearDownClass()
2018-03-29 23:34:14,383 INFO  hQMsr60C-[koueec8kb1] Stopping application BasicApplicationImpl{id=koueec8kb1}
2018-03-29 23:34:14,385 INFO  VOs2XKdl-[koueec8kb1,ubk4xunfaa] Stopping RestMockSimpleEntity{id=ubk4xunfaa} in [SshMachineLocation[localhost:null@df4aa2f2563b/172.17.0.2:22(id=x39dzyimb8)]]
2018-03-29 23:34:14,389 INFO  hQMsr60C-[koueec8kb1] Stopped application BasicApplicationImpl{id=koueec8kb1}
2018-03-29 23:34:14,392 INFO  - TESTNG PASSED CONFIGURATION: "Surefire test" - @AfterClass org.apache.brooklyn.rest.testing.BrooklynRestApiTest.tearDownClass() finished in 12 ms
2018-03-29 23:34:14,403 INFO  - TESTNG 
===============================================
    Surefire test
    Tests run: 241, Failures: 1, Skips: 0
===============================================
2018-03-29 23:34:14,403 INFO  - TESTNG RUNNING: Suite: "Surefire test" containing "1" Tests (config: null)
2018-03-29 23:34:14,404 INFO  - TESTNG INVOKING CONFIGURATION: "Surefire test" - @BeforeClass org.apache.brooklyn.rest.testing.BrooklynRestApiTest.setUpClass()
2018-03-29 23:34:14,404 INFO  - Added external config supplier named 'brooklyn-demo-sample': org.apache.brooklyn.core.config.external.InPlaceExternalConfigSupplier@5adb56c5
2018-03-29 23:34:14,444 WARN  - Empty contextPath
2018-03-29 23:34:14,444 INFO  - TESTNG PASSED CONFIGURATION: "Surefire test" - @BeforeClass org.apache.brooklyn.rest.testing.BrooklynRestApiTest.setUpClass() finished in 41 ms
2018-03-29 23:34:14,445 INFO  - TESTNG INVOKING CONFIGURATION: "Surefire test" - @BeforeMethod org.apache.brooklyn.rest.testing.BrooklynRestApiTest.setUpMethod()
2018-03-29 23:34:14,445 INFO  - TESTNG PASSED CONFIGURATION: "Surefire test" - @BeforeMethod org.apache.brooklyn.rest.testing.BrooklynRestApiTest.setUpMethod() finished in 1 ms
2018-03-29 23:34:14,445 INFO  - TESTNG INVOKING: "Surefire test" - org.apache.brooklyn.rest.resources.AccessResourceTest.testGetAndSetAccessControl()
2018-03-29 23:34:14,485 INFO  - TESTNG PASSED: "Surefire test" - org.apache.brooklyn.rest.resources.AccessResourceTest.testGetAndSetAccessControl() finished in 40 ms
2018-03-29 23:34:14,485 INFO  - TESTNG INVOKING CONFIGURATION: "Surefire test" - @AfterMethod org.apache.brooklyn.rest.testing.BrooklynRestApiTest.tearDownMethod()
2018-03-29 23:34:14,485 INFO  - TESTNG PASSED CONFIGURATION: "Surefire test" - @AfterMethod org.apache.brooklyn.rest.testing.BrooklynRestApiTest.tearDownMethod() finished in 0 ms
2018-03-29 23:34:14,486 INFO  - TESTNG INVOKING CONFIGURATION: "Surefire test" - @AfterClass org.apache.brooklyn.rest.testing.BrooklynRestApiTest.tearDownClass()
2018-03-29 23:34:14,487 INFO  - TESTNG PASSED CONFIGURATION: "Surefire test" - @AfterClass org.apache.brooklyn.rest.testing.BrooklynRestApiTest.tearDownClass() finished in 2 ms
2018-03-29 23:34:14,489 INFO  - TESTNG 
===============================================
    Surefire test
    Tests run: 242, Failures: 1, Skips: 0
===============================================
[GC (Allocation Failure)  227899K->63146K(738304K), 0.0203801 secs]
Tests run: 242, Failures: 1, Errors: 0, Skipped: 0, Time elapsed: 38.958 sec <<< FAILURE! - in TestSuite
testInvokeEffectorWithTimeoutTimesOut(org.apache.brooklyn.rest.resources.EffectorResourceTest)  Time elapsed: 0.047 sec  <<< FAILURE!
java.lang.AssertionError: 
responseMap={id=USOIKGEe, displayName=sleepEffector, description=Invoking effector sleepEffector on TestEntity:tmze with parameters {duration=5m}, entityId=tmzevvffyt, entityDisplayName=TestEntity:tmze, tags=[EFFECTOR, {entityId=tmzevvffyt, effectorName=sleepEffector}, {type=org.apache.brooklyn.api.mgmt.ManagementContext}, {wrappingType=targetEntity, entity={type=org.apache.brooklyn.api.entity.Entity, id=tmzevvffyt}}, {wrappingType=contextEntity, entity={type=org.apache.brooklyn.api.entity.Entity, id=tmzevvffyt}}], submitTimeUtc=1.522366433574E12, startTimeUtc=1.522366433574E12, endTimeUtc=null, currentStatus=In progress, result=null, isError=false, isCancelled=false, children=[], submittedByTask=null, detailedStatus=Task[sleepEffector]@USOIKGEe

In progress (RUNNABLE)
At: org.apache.brooklyn.util.javalang.coerce.CommonAdaptorTryCoercions$TryCoercerWithFromMethod.tryCoerce(CommonAdaptorTryCoercions.java:69)
    org.apache.brooklyn.util.javalang.coerce.TypeCoercerExtensible.tryCoerceInternal(TypeCoercerExtensible.java:163)
    org.apache.brooklyn.util.javalang.coerce.TypeCoercerExtensible.tryCoerce(TypeCoercerExtensible.java:112)
    org.apache.brooklyn.util.javalang.coerce.TypeCoercerExtensible.coerce(TypeCoercerExtensible.java:102)
    org.apache.brooklyn.util.javalang.coerce.TypeCoercerExtensible.coerce(TypeCoercerExtensible.java:98)
    org.apache.brooklyn.util.core.flags.TypeCoercions.coerce(TypeCoercions.java:81)
    org.apache.brooklyn.core.mgmt.internal.EffectorUtils.prepareArgsForEffectorFromMap(EffectorUtils.java:167)
    org.apache.brooklyn.core.mgmt.internal.EffectorUtils.prepareArgsForEffector(EffectorUtils.java:75)
    org.apache.brooklyn.core.mgmt.internal.AbstractManagementContext.invokeEffectorMethodLocal(AbstractManagementContext.java:324)
    org.apache.brooklyn.core.mgmt.internal.AbstractManagementContext.invokeEffectorMethodSync(AbstractManagementContext.java:366)
    org.apache.brooklyn.core.mgmt.internal.EffectorUtils.invokeMethodEffector(EffectorUtils.java:274)
    org.apache.brooklyn.core.effector.MethodEffector.call(MethodEffector.java:153)
    org.apache.brooklyn.core.effector.AbstractEffector.call(AbstractEffector.java:61)
    org.apache.brooklyn.core.effector.AbstractEffector$1$1.call(AbstractEffector.java:79)
    org.apache.brooklyn.util.core.task.DynamicSequentialTask$DstJob.call(DynamicSequentialTask.java:364)
    org.apache.brooklyn.util.core.task.BasicExecutionManager$SubmissionCallable.call(BasicExecutionManager.java:565), streams={}, links={self=/activities/USOIKGEe, children=/activities/USOIKGEe/children, entity=/applications/i2nizu7cts/entities/tmzevvffyt}} expected [true] but found [false]
	at org.apache.brooklyn.rest.resources.EffectorResourceTest.testInvokeEffectorWithTimeoutTimesOut(EffectorResourceTest.java:135)


Results :

Failed tests: 
  EffectorResourceTest.testInvokeEffectorWithTimeoutTimesOut:135 responseMap={id=USOIKGEe, displayName=sleepEffector, description=Invoking effector sleepEffector on TestEntity:tmze with parameters {duration=5m}, entityId=tmzevvffyt, entityDisplayName=TestEntity:tmze, tags=[EFFECTOR, {entityId=tmzevvffyt, effectorName=sleepEffector}, {type=org.apache.brooklyn.api.mgmt.ManagementContext}, {wrappingType=targetEntity, entity={type=org.apache.brooklyn.api.entity.Entity, id=tmzevvffyt}}, {wrappingType=contextEntity, entity={type=org.apache.brooklyn.api.entity.Entity, id=tmzevvffyt}}], submitTimeUtc=1.522366433574E12, startTimeUtc=1.522366433574E12, endTimeUtc=null, currentStatus=In progress, result=null, isError=false, isCancelled=false, children=[], submittedByTask=null, detailedStatus=Task[sleepEffector]@USOIKGEe

In progress (RUNNABLE)
At: org.apache.brooklyn.util.javalang.coerce.CommonAdaptorTryCoercions$TryCoercerWithFromMethod.tryCoerce(CommonAdaptorTryCoercions.java:69)
    org.apache.brooklyn.util.javalang.coerce.TypeCoercerExtensible.tryCoerceInternal(TypeCoercerExtensible.java:163)
    org.apache.brooklyn.util.javalang.coerce.TypeCoercerExtensible.tryCoerce(TypeCoercerExtensible.java:112)
    org.apache.brooklyn.util.javalang.coerce.TypeCoercerExtensible.coerce(TypeCoercerExtensible.java:102)
    org.apache.brooklyn.util.javalang.coerce.TypeCoercerExtensible.coerce(TypeCoercerExtensible.java:98)
    org.apache.brooklyn.util.core.flags.TypeCoercions.coerce(TypeCoercions.java:81)
    org.apache.brooklyn.core.mgmt.internal.EffectorUtils.prepareArgsForEffectorFromMap(EffectorUtils.java:167)
    org.apache.brooklyn.core.mgmt.internal.EffectorUtils.prepareArgsForEffector(EffectorUtils.java:75)
    org.apache.brooklyn.core.mgmt.internal.AbstractManagementContext.invokeEffectorMethodLocal(AbstractManagementContext.java:324)
    org.apache.brooklyn.core.mgmt.internal.AbstractManagementContext.invokeEffectorMethodSync(AbstractManagementContext.java:366)
    org.apache.brooklyn.core.mgmt.internal.EffectorUtils.invokeMethodEffector(EffectorUtils.java:274)
    org.apache.brooklyn.core.effector.MethodEffector.call(MethodEffector.java:153)
    org.apache.brooklyn.core.effector.AbstractEffector.call(AbstractEffector.java:61)
    org.apache.brooklyn.core.effector.AbstractEffector$1$1.call(AbstractEffector.java:79)
    org.apache.brooklyn.util.core.task.DynamicSequentialTask$DstJob.call(DynamicSequentialTask.java:364)
    org.apache.brooklyn.util.core.task.BasicExecutionManager$SubmissionCallable.call(BasicExecutionManager.java:565), streams={}, links={self=/activities/USOIKGEe, children=/activities/USOIKGEe/children, entity=/applications/i2nizu7cts/entities/tmzevvffyt}} expected [true] but found [false]

Tests run: 242, Failures: 1, Errors: 0, Skipped: 0

[INFO] ------------------------------------------------------------------------
[INFO] Reactor Summary:
[INFO] 
[INFO] Brooklyn REST JavaScript Web GUI ................... SUCCESS [ 45.047 s]
[INFO] Brooklyn Server Root ............................... SUCCESS [  0.206 s]
[INFO] Brooklyn Parent Project ............................ SUCCESS [  2.275 s]
[INFO] Brooklyn Test Support Utilities .................... SUCCESS [  4.086 s]
[INFO] Brooklyn Logback Includable Configuration .......... SUCCESS [  0.439 s]
[INFO] Brooklyn Common Utilities .......................... SUCCESS [ 20.659 s]
[INFO] Brooklyn API ....................................... SUCCESS [  1.522 s]
[INFO] CAMP Server Parent Project ......................... SUCCESS [  0.290 s]
[INFO] CAMP Base .......................................... SUCCESS [  2.406 s]
[INFO] Brooklyn Test Support .............................. SUCCESS [  1.062 s]
[INFO] Brooklyn REST Swagger Apidoc Utilities ............. SUCCESS [  1.428 s]
[INFO] Brooklyn Logback Configuration ..................... SUCCESS [  0.230 s]
[INFO] CAMP Server ........................................ SUCCESS [  4.956 s]
[INFO] Brooklyn Felix Runtime ............................. SUCCESS [  2.680 s]
[INFO] Brooklyn Groovy Utilities .......................... SUCCESS [  2.055 s]
[INFO] Brooklyn Core ...................................... SUCCESS [02:52 min]
[INFO] Brooklyn Policies .................................. SUCCESS [ 26.656 s]
[INFO] Brooklyn WinRM Software Entities ................... SUCCESS [  9.795 s]
[INFO] Brooklyn Secure JMXMP Agent ........................ SUCCESS [  9.142 s]
[INFO] Brooklyn JMX RMI Agent ............................. SUCCESS [  0.489 s]
[INFO] Brooklyn Jclouds Location Targets .................. SUCCESS [ 34.407 s]
[INFO] Brooklyn Software Base ............................. SUCCESS [01:06 min]
[INFO] Brooklyn CAMP ...................................... SUCCESS [02:03 min]
[INFO] Brooklyn Launcher Common ........................... SUCCESS [  3.801 s]
[INFO] Brooklyn REST API .................................. SUCCESS [  8.328 s]
[INFO] Brooklyn REST Resources ............................ FAILURE [ 45.371 s]
[INFO] Brooklyn REST Server ............................... SKIPPED
[INFO] Brooklyn Launcher .................................. SKIPPED
[INFO] Brooklyn Container Location Targets ................ SKIPPED
[INFO] Brooklyn Command Line Interface .................... SKIPPED
[INFO] Brooklyn Test Framework ............................ SKIPPED
[INFO] Brooklyn OSGi init ................................. SKIPPED
[INFO] Brooklyn OSGi start ................................ SKIPPED
[INFO] Brooklyn Karaf ..................................... SKIPPED
[INFO] Jetty config fragment .............................. SKIPPED
[INFO] Apache Http Component extension .................... SKIPPED
[INFO] Brooklyn Karaf Features ............................ SKIPPED
[INFO] Brooklyn Karaf Shell Commands ...................... SKIPPED
[INFO] Brooklyn Library Root .............................. SKIPPED
[INFO] Brooklyn CM Chef ................................... SKIPPED
[INFO] Brooklyn CM SaltStack .............................. SKIPPED
[INFO] Brooklyn CM Ansible ................................ SKIPPED
[INFO] Brooklyn CM Integration Root ....................... SKIPPED
[INFO] Brooklyn Network Software Entities ................. SKIPPED
[INFO] Brooklyn OSGi Software Entities .................... SKIPPED
[INFO] Brooklyn Database Software Entities ................ SKIPPED
[INFO] Brooklyn Web App Software Entities ................. SKIPPED
[INFO] Brooklyn Messaging Software Entities ............... SKIPPED
[INFO] Brooklyn NoSQL Data Store Software Entities ........ SKIPPED
[INFO] Brooklyn Monitoring Software Entities .............. SKIPPED
[INFO] Brooklyn Web App Software Entities ................. SKIPPED
[INFO] Brooklyn QA ........................................ SKIPPED
[INFO] Brooklyn Examples Aggregator Project ............... SKIPPED
[INFO] Brooklyn Examples Aggregator Project - Webapps ..... SKIPPED
[INFO] hello-world-webapp Maven Webapp .................... SKIPPED
[INFO] hello-world-sql-webapp Maven Webapp ................ SKIPPED
[INFO] Brooklyn Simple Web Cluster Example ................ SKIPPED
[INFO] Brooklyn Library Karaf integration ................. SKIPPED
[INFO] Brooklyn Library Catalog ........................... SKIPPED
[INFO] Brooklyn Library Karaf Features .................... SKIPPED
[INFO] Brooklyn Client .................................... SKIPPED
[INFO] Brooklyn Client Command Line Interface ............. SKIPPED
[INFO] Brooklyn REST java Client .......................... SKIPPED
[INFO] Brooklyn Downstream Project Parent ................. SKIPPED
[INFO] Brooklyn Dist Root ................................. SKIPPED
[INFO] Brooklyn All Things ................................ SKIPPED
[INFO] Brooklyn Distribution .............................. SKIPPED
[INFO] Brooklyn Karaf Distribution Parent ................. SKIPPED
[INFO] Brooklyn Karaf Server Configuration ................ SKIPPED
[INFO] Brooklyn Dist Karaf Features ....................... SKIPPED
[INFO] Brooklyn Karaf Distribution ........................ SKIPPED
[INFO] Brooklyn Karaf pax-exam itest ...................... SKIPPED
[INFO] Brooklyn Vagrant Getting Started Environment ....... SKIPPED
[INFO] Brooklyn Quick-Start Project Archetype ............. SKIPPED
[INFO] Brooklyn Shared Package Files ...................... SKIPPED
[INFO] Brooklyn RPM Package ............................... SKIPPED
[INFO] Brooklyn DEB Package ............................... SKIPPED
[INFO] Brooklyn Root ...................................... SKIPPED
[INFO] ------------------------------------------------------------------------
[INFO] BUILD FAILURE
[INFO] ------------------------------------------------------------------------
[INFO] Total time: 09:54 min
[INFO] Finished at: 2018-03-29T23:34:15Z
[INFO] Final Memory: 143M/906M
[INFO] ------------------------------------------------------------------------
[ERROR] Failed to execute goal org.apache.maven.plugins:maven-surefire-plugin:2.19.1:test (default-test) on project brooklyn-rest-resources: There are test failures.
[ERROR] 
[ERROR] Please refer to /usr/build/brooklyn-server/rest/rest-resources/target/surefire-reports for the individual test results.
[ERROR] -> [Help 1]
[ERROR] 
[ERROR] To see the full stack trace of the errors, re-run Maven with the -e switch.
[ERROR] Re-run Maven using the -X switch to enable full debug logging.
[ERROR] 
[ERROR] For more information about the errors and possible solutions, please read the following articles:
[ERROR] [Help 1] http://cwiki.apache.org/confluence/display/MAVEN/MojoFailureException
[ERROR] 
[ERROR] After correcting the problems, you can resume the build with the command
[ERROR]   mvn <goals> -rf :brooklyn-rest-resources
Build step 'Execute shell' marked build as failure
Recording test results
TestNG Reports Processing: START
Looking for TestNG results report in workspace using pattern: **/testng-results.xml
testng-results.xml was last modified before this build started. Ignoring it.
testng-results.xml was last modified before this build started. Ignoring it.
testng-results.xml was last modified before this build started. Ignoring it.
testng-results.xml was last modified before this build started. Ignoring it.
testng-results.xml was last modified before this build started. Ignoring it.
testng-results.xml was last modified before this build started. Ignoring it.
testng-results.xml was last modified before this build started. Ignoring it.
testng-results.xml was last modified before this build started. Ignoring it.
testng-results.xml was last modified before this build started. Ignoring it.
testng-results.xml was last modified before this build started. Ignoring it.
testng-results.xml was last modified before this build started. Ignoring it.
testng-results.xml was last modified before this build started. Ignoring it.
testng-results.xml was last modified before this build started. Ignoring it.
testng-results.xml was last modified before this build started. Ignoring it.
testng-results.xml was last modified before this build started. Ignoring it.
testng-results.xml was last modified before this build started. Ignoring it.
testng-results.xml was last modified before this build started. Ignoring it.
testng-results.xml was last modified before this build started. Ignoring it.
testng-results.xml was last modified before this build started. Ignoring it.
testng-results.xml was last modified before this build started. Ignoring it.
Saving reports...
Processing '/x1/jenkins/jenkins-home/jobs/brooklyn-master-build-docker/builds/317/testng/testng-results-1.xml'
Processing '/x1/jenkins/jenkins-home/jobs/brooklyn-master-build-docker/builds/317/testng/testng-results-10.xml'
Processing '/x1/jenkins/jenkins-home/jobs/brooklyn-master-build-docker/builds/317/testng/testng-results-11.xml'
Processing '/x1/jenkins/jenkins-home/jobs/brooklyn-master-build-docker/builds/317/testng/testng-results-12.xml'
Processing '/x1/jenkins/jenkins-home/jobs/brooklyn-master-build-docker/builds/317/testng/testng-results-13.xml'
Processing '/x1/jenkins/jenkins-home/jobs/brooklyn-master-build-docker/builds/317/testng/testng-results-14.xml'
Processing '/x1/jenkins/jenkins-home/jobs/brooklyn-master-build-docker/builds/317/testng/testng-results-2.xml'
Processing '/x1/jenkins/jenkins-home/jobs/brooklyn-master-build-docker/builds/317/testng/testng-results-3.xml'
Processing '/x1/jenkins/jenkins-home/jobs/brooklyn-master-build-docker/builds/317/testng/testng-results-4.xml'
Processing '/x1/jenkins/jenkins-home/jobs/brooklyn-master-build-docker/builds/317/testng/testng-results-5.xml'
Processing '/x1/jenkins/jenkins-home/jobs/brooklyn-master-build-docker/builds/317/testng/testng-results-6.xml'
Processing '/x1/jenkins/jenkins-home/jobs/brooklyn-master-build-docker/builds/317/testng/testng-results-7.xml'
Processing '/x1/jenkins/jenkins-home/jobs/brooklyn-master-build-docker/builds/317/testng/testng-results-8.xml'
Processing '/x1/jenkins/jenkins-home/jobs/brooklyn-master-build-docker/builds/317/testng/testng-results-9.xml'
Processing '/x1/jenkins/jenkins-home/jobs/brooklyn-master-build-docker/builds/317/testng/testng-results.xml'
0.021872% of tests failed, which exceeded threshold of 0%. Marking build as UNSTABLE
TestNG Reports Processing: FINISH