OSDir

[Date Prev][Date Next][Thread Prev][Thread Next][Date Index][Thread Index]

Build failed in Jenkins: brooklyn-master-build-docker #370


See <https://builds.apache.org/job/brooklyn-master-build-docker/370/display/redirect>

------------------------------------------
[...truncated 8.07 MB...]
2018-04-19 23:12:59,544 INFO  - TESTNG PASSED CONFIGURATION: "Surefire test" - @BeforeMethod org.apache.brooklyn.rest.testing.BrooklynRestApiTest.setUpMethod() finished in 0 ms
2018-04-19 23:12:59,544 INFO  - TESTNG INVOKING CONFIGURATION: "Surefire test" - @BeforeMethod org.apache.brooklyn.rest.resources.UsageResourceTest.setUp()
2018-04-19 23:12:59,544 INFO  - TESTNG PASSED CONFIGURATION: "Surefire test" - @BeforeMethod org.apache.brooklyn.rest.resources.UsageResourceTest.setUp() finished in 0 ms
2018-04-19 23:12:59,544 INFO  - TESTNG INVOKING: "Surefire test" - org.apache.brooklyn.rest.resources.UsageResourceTest.testGetMachineUsagesForNonExistantMachine()
2018-04-19 23:12:59,552 INFO  - TESTNG PASSED: "Surefire test" - org.apache.brooklyn.rest.resources.UsageResourceTest.testGetMachineUsagesForNonExistantMachine() finished in 7 ms
2018-04-19 23:12:59,552 INFO  - TESTNG INVOKING CONFIGURATION: "Surefire test" - @AfterMethod org.apache.brooklyn.rest.testing.BrooklynRestApiTest.tearDownMethod()
2018-04-19 23:12:59,552 INFO  - TESTNG PASSED CONFIGURATION: "Surefire test" - @AfterMethod org.apache.brooklyn.rest.testing.BrooklynRestApiTest.tearDownMethod() finished in 0 ms
2018-04-19 23:12:59,552 INFO  - TESTNG INVOKING CONFIGURATION: "Surefire test" - @BeforeMethod org.apache.brooklyn.rest.testing.BrooklynRestApiTest.setUpMethod()
2018-04-19 23:12:59,552 INFO  - TESTNG PASSED CONFIGURATION: "Surefire test" - @BeforeMethod org.apache.brooklyn.rest.testing.BrooklynRestApiTest.setUpMethod() finished in 0 ms
2018-04-19 23:12:59,553 INFO  - TESTNG INVOKING CONFIGURATION: "Surefire test" - @BeforeMethod org.apache.brooklyn.rest.resources.UsageResourceTest.setUp()
2018-04-19 23:12:59,553 INFO  - TESTNG PASSED CONFIGURATION: "Surefire test" - @BeforeMethod org.apache.brooklyn.rest.resources.UsageResourceTest.setUp() finished in 1 ms
2018-04-19 23:12:59,553 INFO  - TESTNG INVOKING: "Surefire test" - org.apache.brooklyn.rest.resources.UsageResourceTest.testGetMachineUsagesInitiallyEmpty()
2018-04-19 23:12:59,569 INFO  - TESTNG PASSED: "Surefire test" - org.apache.brooklyn.rest.resources.UsageResourceTest.testGetMachineUsagesInitiallyEmpty() finished in 16 ms
2018-04-19 23:12:59,570 INFO  - TESTNG INVOKING CONFIGURATION: "Surefire test" - @AfterMethod org.apache.brooklyn.rest.testing.BrooklynRestApiTest.tearDownMethod()
2018-04-19 23:12:59,570 INFO  - TESTNG PASSED CONFIGURATION: "Surefire test" - @AfterMethod org.apache.brooklyn.rest.testing.BrooklynRestApiTest.tearDownMethod() finished in 0 ms
2018-04-19 23:12:59,570 INFO  - TESTNG INVOKING CONFIGURATION: "Surefire test" - @BeforeMethod org.apache.brooklyn.rest.testing.BrooklynRestApiTest.setUpMethod()
2018-04-19 23:12:59,570 INFO  - TESTNG PASSED CONFIGURATION: "Surefire test" - @BeforeMethod org.apache.brooklyn.rest.testing.BrooklynRestApiTest.setUpMethod() finished in 0 ms
2018-04-19 23:12:59,570 INFO  - TESTNG INVOKING CONFIGURATION: "Surefire test" - @BeforeMethod org.apache.brooklyn.rest.resources.UsageResourceTest.setUp()
2018-04-19 23:12:59,570 INFO  - TESTNG PASSED CONFIGURATION: "Surefire test" - @BeforeMethod org.apache.brooklyn.rest.resources.UsageResourceTest.setUp() finished in 0 ms
2018-04-19 23:12:59,570 INFO  - TESTNG INVOKING: "Surefire test" - org.apache.brooklyn.rest.resources.UsageResourceTest.testListAndGetMachineUsage()
2018-04-19 23:12:59,599 INFO  - Starting MyServiceImpl{id=tzwfg913yw} on machine SshMachineLocation[LocalhostMachine:qvl6:null@/172.17.0.3:22(id=qvl6zsnc53)]
2018-04-19 23:12:59,794 INFO  - TESTNG PASSED: "Surefire test" - org.apache.brooklyn.rest.resources.UsageResourceTest.testListAndGetMachineUsage() finished in 223 ms
2018-04-19 23:12:59,794 INFO  - TESTNG INVOKING CONFIGURATION: "Surefire test" - @AfterMethod org.apache.brooklyn.rest.testing.BrooklynRestApiTest.tearDownMethod()
2018-04-19 23:12:59,794 INFO  - TESTNG PASSED CONFIGURATION: "Surefire test" - @AfterMethod org.apache.brooklyn.rest.testing.BrooklynRestApiTest.tearDownMethod() finished in 0 ms
2018-04-19 23:12:59,795 INFO  - TESTNG INVOKING CONFIGURATION: "Surefire test" - @BeforeMethod org.apache.brooklyn.rest.testing.BrooklynRestApiTest.setUpMethod()
2018-04-19 23:12:59,795 INFO  - TESTNG PASSED CONFIGURATION: "Surefire test" - @BeforeMethod org.apache.brooklyn.rest.testing.BrooklynRestApiTest.setUpMethod() finished in 1 ms
2018-04-19 23:12:59,795 INFO  - TESTNG INVOKING CONFIGURATION: "Surefire test" - @BeforeMethod org.apache.brooklyn.rest.resources.UsageResourceTest.setUp()
2018-04-19 23:12:59,795 INFO  - TESTNG PASSED CONFIGURATION: "Surefire test" - @BeforeMethod org.apache.brooklyn.rest.resources.UsageResourceTest.setUp() finished in 0 ms
2018-04-19 23:12:59,795 INFO  - TESTNG INVOKING: "Surefire test" - org.apache.brooklyn.rest.resources.UsageResourceTest.testListApplicationUsages()
2018-04-19 23:12:59,804 INFO  - Entity type 'org.apache.brooklyn.rest.testing.mocks.RestMockSimpleEntity' not defined in catalog but is on classpath; continuing
2018-04-19 23:12:59,806 WARN  - Using deprecated functionality (as of 0.9.0), ApplicationSpec style (pre CAMP plans). Transition to actively supported spec plans.
2018-04-19 23:12:59,807 INFO  - REST creating instance for entity org.apache.brooklyn.rest.testing.mocks.RestMockSimpleEntity
2018-04-19 23:12:59,807 INFO  - Catalog does not contain item for type org.apache.brooklyn.rest.testing.mocks.RestMockSimpleEntity; loaded class directly instead
2018-04-19 23:12:59,807 INFO  - REST placing 'simple-app' under management
2018-04-19 23:12:59,838 INFO  - Starting RestMockSimpleEntity{id=nsw95mk3ok} on machine SshMachineLocation[localhost:null@/172.17.0.3:22(id=guqohst7b3)]
2018-04-19 23:12:59,977 INFO  FDSZ7TOZ-[c474jrx41i] Started application BasicApplicationImpl{id=c474jrx41i}
2018-04-19 23:13:00,064 INFO  - TESTNG PASSED: "Surefire test" - org.apache.brooklyn.rest.resources.UsageResourceTest.testListApplicationUsages() finished in 268 ms
2018-04-19 23:13:00,064 INFO  - TESTNG INVOKING CONFIGURATION: "Surefire test" - @AfterMethod org.apache.brooklyn.rest.testing.BrooklynRestApiTest.tearDownMethod()
2018-04-19 23:13:00,064 INFO  - TESTNG PASSED CONFIGURATION: "Surefire test" - @AfterMethod org.apache.brooklyn.rest.testing.BrooklynRestApiTest.tearDownMethod() finished in 0 ms
2018-04-19 23:13:00,064 INFO  - TESTNG INVOKING CONFIGURATION: "Surefire test" - @BeforeMethod org.apache.brooklyn.rest.testing.BrooklynRestApiTest.setUpMethod()
2018-04-19 23:13:00,065 INFO  - TESTNG PASSED CONFIGURATION: "Surefire test" - @BeforeMethod org.apache.brooklyn.rest.testing.BrooklynRestApiTest.setUpMethod() finished in 1 ms
2018-04-19 23:13:00,065 INFO  - TESTNG INVOKING CONFIGURATION: "Surefire test" - @BeforeMethod org.apache.brooklyn.rest.resources.UsageResourceTest.setUp()
2018-04-19 23:13:00,065 INFO  - TESTNG PASSED CONFIGURATION: "Surefire test" - @BeforeMethod org.apache.brooklyn.rest.resources.UsageResourceTest.setUp() finished in 0 ms
2018-04-19 23:13:00,065 INFO  - TESTNG INVOKING: "Surefire test" - org.apache.brooklyn.rest.resources.UsageResourceTest.testListMachinesUsageForApp()
2018-04-19 23:13:00,085 INFO  - Starting MyServiceImpl{id=knrrrbzqo7} on machine SshMachineLocation[LocalhostMachine:h36q:null@/172.17.0.3:22(id=h36qairvcq)]
2018-04-19 23:13:00,232 INFO  gF99fgEl-[w7wrdq1tym,knrrrbzqo7] Stopping MyServiceImpl{id=knrrrbzqo7} in [SshMachineLocation[LocalhostMachine:h36q:null@c03b4885829a/172.17.0.3:22(id=h36qairvcq)]]
2018-04-19 23:13:00,254 INFO  - TESTNG PASSED: "Surefire test" - org.apache.brooklyn.rest.resources.UsageResourceTest.testListMachinesUsageForApp() finished in 189 ms
2018-04-19 23:13:00,254 INFO  - TESTNG INVOKING CONFIGURATION: "Surefire test" - @AfterMethod org.apache.brooklyn.rest.testing.BrooklynRestApiTest.tearDownMethod()
2018-04-19 23:13:00,254 INFO  - TESTNG PASSED CONFIGURATION: "Surefire test" - @AfterMethod org.apache.brooklyn.rest.testing.BrooklynRestApiTest.tearDownMethod() finished in 0 ms
2018-04-19 23:13:00,254 INFO  - TESTNG INVOKING CONFIGURATION: "Surefire test" - @AfterClass org.apache.brooklyn.rest.testing.BrooklynRestApiTest.tearDownClass()
2018-04-19 23:13:00,257 INFO  Hr5WIPB0-[yum4wkps04,tzwfg913yw] Stopping MyServiceImpl{id=tzwfg913yw} in [SshMachineLocation[LocalhostMachine:qvl6:null@c03b4885829a/172.17.0.3:22(id=qvl6zsnc53)]]
2018-04-19 23:13:00,263 INFO  - TESTNG PASSED CONFIGURATION: "Surefire test" - @AfterClass org.apache.brooklyn.rest.testing.BrooklynRestApiTest.tearDownClass() finished in 9 ms
2018-04-19 23:13:00,265 INFO  - TESTNG 
===============================================
    Surefire test
    Tests run: 242, Failures: 1, Skips: 0
===============================================
[GC (Allocation Failure)  250676K->65418K(748032K), 0.0118419 secs]
Tests run: 242, Failures: 1, Errors: 0, Skipped: 0, Time elapsed: 36.517 sec <<< FAILURE! - in TestSuite
testInvokeEffectorWithTimeoutTimesOut(org.apache.brooklyn.rest.resources.EffectorResourceTest)  Time elapsed: 0.031 sec  <<< FAILURE!
java.lang.AssertionError: 
responseMap={id=EGdw1y78, displayName=sleepEffector, description=Invoking effector sleepEffector on TestEntity:e5p0 with parameters {duration=5m}, entityId=e5p0ge2nai, entityDisplayName=TestEntity:e5p0, tags=[EFFECTOR, {wrappingType=targetEntity, entity={type=org.apache.brooklyn.api.entity.Entity, id=e5p0ge2nai}}, {type=org.apache.brooklyn.api.mgmt.ManagementContext}, {entityId=e5p0ge2nai, effectorName=sleepEffector}, {wrappingType=contextEntity, entity={type=org.apache.brooklyn.api.entity.Entity, id=e5p0ge2nai}}], submitTimeUtc=1.524179564277E12, startTimeUtc=1.524179564277E12, endTimeUtc=null, currentStatus=In progress, result=null, isError=false, isCancelled=false, children=[], submittedByTask=null, detailedStatus=Task[sleepEffector]@EGdw1y78

In progress (RUNNABLE)
At: org.apache.brooklyn.util.javalang.coerce.TypeCoercerExtensible.tryCoerceInternal(TypeCoercerExtensible.java:189)
    org.apache.brooklyn.util.javalang.coerce.TypeCoercerExtensible.tryCoerce(TypeCoercerExtensible.java:112)
    org.apache.brooklyn.util.javalang.coerce.TypeCoercerExtensible.coerce(TypeCoercerExtensible.java:102)
    org.apache.brooklyn.util.javalang.coerce.TypeCoercerExtensible.coerce(TypeCoercerExtensible.java:98)
    org.apache.brooklyn.util.core.flags.TypeCoercions.coerce(TypeCoercions.java:81)
    org.apache.brooklyn.core.mgmt.internal.EffectorUtils.prepareArgsForEffectorFromMap(EffectorUtils.java:167)
    org.apache.brooklyn.core.mgmt.internal.EffectorUtils.prepareArgsForEffector(EffectorUtils.java:75)
    org.apache.brooklyn.core.mgmt.internal.AbstractManagementContext.invokeEffectorMethodLocal(AbstractManagementContext.java:324)
    org.apache.brooklyn.core.mgmt.internal.AbstractManagementContext.invokeEffectorMethodSync(AbstractManagementContext.java:366)
    org.apache.brooklyn.core.mgmt.internal.EffectorUtils.invokeMethodEffector(EffectorUtils.java:274)
    org.apache.brooklyn.core.effector.MethodEffector.call(MethodEffector.java:153)
    org.apache.brooklyn.core.effector.AbstractEffector.call(AbstractEffector.java:61)
    org.apache.brooklyn.core.effector.AbstractEffector$1$1.call(AbstractEffector.java:79)
    org.apache.brooklyn.util.core.task.DynamicSequentialTask$DstJob.call(DynamicSequentialTask.java:364)
    org.apache.brooklyn.util.core.task.BasicExecutionManager$SubmissionCallable.call(BasicExecutionManager.java:565), streams={}, links={self=/activities/EGdw1y78, children=/activities/EGdw1y78/children, entity=/applications/byx34kgvcc/entities/e5p0ge2nai}} expected [true] but found [false]
	at org.apache.brooklyn.rest.resources.EffectorResourceTest.testInvokeEffectorWithTimeoutTimesOut(EffectorResourceTest.java:135)


Results :

Failed tests: 
  EffectorResourceTest.testInvokeEffectorWithTimeoutTimesOut:135 responseMap={id=EGdw1y78, displayName=sleepEffector, description=Invoking effector sleepEffector on TestEntity:e5p0 with parameters {duration=5m}, entityId=e5p0ge2nai, entityDisplayName=TestEntity:e5p0, tags=[EFFECTOR, {wrappingType=targetEntity, entity={type=org.apache.brooklyn.api.entity.Entity, id=e5p0ge2nai}}, {type=org.apache.brooklyn.api.mgmt.ManagementContext}, {entityId=e5p0ge2nai, effectorName=sleepEffector}, {wrappingType=contextEntity, entity={type=org.apache.brooklyn.api.entity.Entity, id=e5p0ge2nai}}], submitTimeUtc=1.524179564277E12, startTimeUtc=1.524179564277E12, endTimeUtc=null, currentStatus=In progress, result=null, isError=false, isCancelled=false, children=[], submittedByTask=null, detailedStatus=Task[sleepEffector]@EGdw1y78

In progress (RUNNABLE)
At: org.apache.brooklyn.util.javalang.coerce.TypeCoercerExtensible.tryCoerceInternal(TypeCoercerExtensible.java:189)
    org.apache.brooklyn.util.javalang.coerce.TypeCoercerExtensible.tryCoerce(TypeCoercerExtensible.java:112)
    org.apache.brooklyn.util.javalang.coerce.TypeCoercerExtensible.coerce(TypeCoercerExtensible.java:102)
    org.apache.brooklyn.util.javalang.coerce.TypeCoercerExtensible.coerce(TypeCoercerExtensible.java:98)
    org.apache.brooklyn.util.core.flags.TypeCoercions.coerce(TypeCoercions.java:81)
    org.apache.brooklyn.core.mgmt.internal.EffectorUtils.prepareArgsForEffectorFromMap(EffectorUtils.java:167)
    org.apache.brooklyn.core.mgmt.internal.EffectorUtils.prepareArgsForEffector(EffectorUtils.java:75)
    org.apache.brooklyn.core.mgmt.internal.AbstractManagementContext.invokeEffectorMethodLocal(AbstractManagementContext.java:324)
    org.apache.brooklyn.core.mgmt.internal.AbstractManagementContext.invokeEffectorMethodSync(AbstractManagementContext.java:366)
    org.apache.brooklyn.core.mgmt.internal.EffectorUtils.invokeMethodEffector(EffectorUtils.java:274)
    org.apache.brooklyn.core.effector.MethodEffector.call(MethodEffector.java:153)
    org.apache.brooklyn.core.effector.AbstractEffector.call(AbstractEffector.java:61)
    org.apache.brooklyn.core.effector.AbstractEffector$1$1.call(AbstractEffector.java:79)
    org.apache.brooklyn.util.core.task.DynamicSequentialTask$DstJob.call(DynamicSequentialTask.java:364)
    org.apache.brooklyn.util.core.task.BasicExecutionManager$SubmissionCallable.call(BasicExecutionManager.java:565), streams={}, links={self=/activities/EGdw1y78, children=/activities/EGdw1y78/children, entity=/applications/byx34kgvcc/entities/e5p0ge2nai}} expected [true] but found [false]

Tests run: 242, Failures: 1, Errors: 0, Skipped: 0

[INFO] ------------------------------------------------------------------------
[INFO] Reactor Summary:
[INFO] 
[INFO] Brooklyn REST JavaScript Web GUI ................... SUCCESS [ 31.101 s]
[INFO] Brooklyn Server Root ............................... SUCCESS [  0.138 s]
[INFO] Brooklyn Parent Project ............................ SUCCESS [  1.952 s]
[INFO] Brooklyn Test Support Utilities .................... SUCCESS [  3.026 s]
[INFO] Brooklyn Logback Includable Configuration .......... SUCCESS [  0.374 s]
[INFO] Brooklyn Common Utilities .......................... SUCCESS [ 21.213 s]
[INFO] Brooklyn API ....................................... SUCCESS [  1.535 s]
[INFO] CAMP Server Parent Project ......................... SUCCESS [  0.137 s]
[INFO] CAMP Base .......................................... SUCCESS [  2.450 s]
[INFO] Brooklyn Test Support .............................. SUCCESS [  1.119 s]
[INFO] Brooklyn REST Swagger Apidoc Utilities ............. SUCCESS [  0.753 s]
[INFO] Brooklyn Logback Configuration ..................... SUCCESS [  0.164 s]
[INFO] CAMP Server ........................................ SUCCESS [  4.384 s]
[INFO] Brooklyn Felix Runtime ............................. SUCCESS [  2.368 s]
[INFO] Brooklyn Groovy Utilities .......................... SUCCESS [  1.906 s]
[INFO] Brooklyn Core ...................................... SUCCESS [02:52 min]
[INFO] Brooklyn Policies .................................. SUCCESS [ 27.518 s]
[INFO] Brooklyn WinRM Software Entities ................... SUCCESS [  7.377 s]
[INFO] Brooklyn Secure JMXMP Agent ........................ SUCCESS [  7.504 s]
[INFO] Brooklyn JMX RMI Agent ............................. SUCCESS [  0.347 s]
[INFO] Brooklyn Jclouds Location Targets .................. SUCCESS [ 33.262 s]
[INFO] Brooklyn Software Base ............................. SUCCESS [01:05 min]
[INFO] Brooklyn CAMP ...................................... SUCCESS [01:53 min]
[INFO] Brooklyn Launcher Common ........................... SUCCESS [  4.073 s]
[INFO] Brooklyn REST API .................................. SUCCESS [  5.445 s]
[INFO] Brooklyn REST Resources ............................ FAILURE [ 41.910 s]
[INFO] Brooklyn REST Server ............................... SKIPPED
[INFO] Brooklyn Launcher .................................. SKIPPED
[INFO] Brooklyn Container Location Targets ................ SKIPPED
[INFO] Brooklyn Command Line Interface .................... SKIPPED
[INFO] Brooklyn Test Framework ............................ SKIPPED
[INFO] Brooklyn OSGi init ................................. SKIPPED
[INFO] Brooklyn OSGi start ................................ SKIPPED
[INFO] Brooklyn Karaf ..................................... SKIPPED
[INFO] Jetty config fragment .............................. SKIPPED
[INFO] Apache Http Component extension .................... SKIPPED
[INFO] Brooklyn Karaf Features ............................ SKIPPED
[INFO] Brooklyn Karaf Shell Commands ...................... SKIPPED
[INFO] Brooklyn Library Root .............................. SKIPPED
[INFO] Brooklyn CM Chef ................................... SKIPPED
[INFO] Brooklyn CM SaltStack .............................. SKIPPED
[INFO] Brooklyn CM Ansible ................................ SKIPPED
[INFO] Brooklyn CM Integration Root ....................... SKIPPED
[INFO] Brooklyn Network Software Entities ................. SKIPPED
[INFO] Brooklyn OSGi Software Entities .................... SKIPPED
[INFO] Brooklyn Database Software Entities ................ SKIPPED
[INFO] Brooklyn Web App Software Entities ................. SKIPPED
[INFO] Brooklyn Messaging Software Entities ............... SKIPPED
[INFO] Brooklyn NoSQL Data Store Software Entities ........ SKIPPED
[INFO] Brooklyn Monitoring Software Entities .............. SKIPPED
[INFO] Brooklyn Web App Software Entities ................. SKIPPED
[INFO] Brooklyn QA ........................................ SKIPPED
[INFO] Brooklyn Examples Aggregator Project ............... SKIPPED
[INFO] Brooklyn Examples Aggregator Project - Webapps ..... SKIPPED
[INFO] hello-world-webapp Maven Webapp .................... SKIPPED
[INFO] hello-world-sql-webapp Maven Webapp ................ SKIPPED
[INFO] Brooklyn Simple Web Cluster Example ................ SKIPPED
[INFO] Brooklyn Library Karaf integration ................. SKIPPED
[INFO] Brooklyn Library Catalog ........................... SKIPPED
[INFO] Brooklyn Library Karaf Features .................... SKIPPED
[INFO] Brooklyn Client .................................... SKIPPED
[INFO] Brooklyn Client Command Line Interface ............. SKIPPED
[INFO] Brooklyn REST java Client .......................... SKIPPED
[INFO] Brooklyn Downstream Project Parent ................. SKIPPED
[INFO] Brooklyn Dist Root ................................. SKIPPED
[INFO] Brooklyn All Things ................................ SKIPPED
[INFO] Brooklyn Distribution .............................. SKIPPED
[INFO] Brooklyn Karaf Distribution Parent ................. SKIPPED
[INFO] Brooklyn Karaf Server Configuration ................ SKIPPED
[INFO] Brooklyn Dist Karaf Features ....................... SKIPPED
[INFO] Brooklyn Karaf Distribution ........................ SKIPPED
[INFO] Brooklyn Karaf pax-exam itest ...................... SKIPPED
[INFO] Brooklyn Vagrant Getting Started Environment ....... SKIPPED
[INFO] Brooklyn Quick-Start Project Archetype ............. SKIPPED
[INFO] Brooklyn Shared Package Files ...................... SKIPPED
[INFO] Brooklyn RPM Package ............................... SKIPPED
[INFO] Brooklyn DEB Package ............................... SKIPPED
[INFO] Brooklyn Root ...................................... SKIPPED
[INFO] ------------------------------------------------------------------------
[INFO] BUILD FAILURE
[INFO] ------------------------------------------------------------------------
[INFO] Total time: 09:14 min
[INFO] Finished at: 2018-04-19T23:13:01Z
[INFO] Final Memory: 142M/901M
[INFO] ------------------------------------------------------------------------
[ERROR] Failed to execute goal org.apache.maven.plugins:maven-surefire-plugin:2.19.1:test (default-test) on project brooklyn-rest-resources: There are test failures.
[ERROR] 
[ERROR] Please refer to /usr/build/brooklyn-server/rest/rest-resources/target/surefire-reports for the individual test results.
[ERROR] -> [Help 1]
[ERROR] 
[ERROR] To see the full stack trace of the errors, re-run Maven with the -e switch.
[ERROR] Re-run Maven using the -X switch to enable full debug logging.
[ERROR] 
[ERROR] For more information about the errors and possible solutions, please read the following articles:
[ERROR] [Help 1] http://cwiki.apache.org/confluence/display/MAVEN/MojoFailureException
[ERROR] 
[ERROR] After correcting the problems, you can resume the build with the command
[ERROR]   mvn <goals> -rf :brooklyn-rest-resources
Build step 'Execute shell' marked build as failure
Recording test results
TestNG Reports Processing: START
Looking for TestNG results report in workspace using pattern: **/testng-results.xml
testng-results.xml was last modified before this build started. Ignoring it.
testng-results.xml was last modified before this build started. Ignoring it.
testng-results.xml was last modified before this build started. Ignoring it.
testng-results.xml was last modified before this build started. Ignoring it.
testng-results.xml was last modified before this build started. Ignoring it.
testng-results.xml was last modified before this build started. Ignoring it.
testng-results.xml was last modified before this build started. Ignoring it.
testng-results.xml was last modified before this build started. Ignoring it.
testng-results.xml was last modified before this build started. Ignoring it.
testng-results.xml was last modified before this build started. Ignoring it.
testng-results.xml was last modified before this build started. Ignoring it.
testng-results.xml was last modified before this build started. Ignoring it.
testng-results.xml was last modified before this build started. Ignoring it.
testng-results.xml was last modified before this build started. Ignoring it.
testng-results.xml was last modified before this build started. Ignoring it.
testng-results.xml was last modified before this build started. Ignoring it.
testng-results.xml was last modified before this build started. Ignoring it.
testng-results.xml was last modified before this build started. Ignoring it.
testng-results.xml was last modified before this build started. Ignoring it.
testng-results.xml was last modified before this build started. Ignoring it.
Saving reports...
Processing '/x1/jenkins/jenkins-home/jobs/brooklyn-master-build-docker/builds/370/testng/testng-results-1.xml'
Processing '/x1/jenkins/jenkins-home/jobs/brooklyn-master-build-docker/builds/370/testng/testng-results-10.xml'
Processing '/x1/jenkins/jenkins-home/jobs/brooklyn-master-build-docker/builds/370/testng/testng-results-11.xml'
Processing '/x1/jenkins/jenkins-home/jobs/brooklyn-master-build-docker/builds/370/testng/testng-results-12.xml'
Processing '/x1/jenkins/jenkins-home/jobs/brooklyn-master-build-docker/builds/370/testng/testng-results-13.xml'
Processing '/x1/jenkins/jenkins-home/jobs/brooklyn-master-build-docker/builds/370/testng/testng-results-14.xml'
Processing '/x1/jenkins/jenkins-home/jobs/brooklyn-master-build-docker/builds/370/testng/testng-results-2.xml'
Processing '/x1/jenkins/jenkins-home/jobs/brooklyn-master-build-docker/builds/370/testng/testng-results-3.xml'
Processing '/x1/jenkins/jenkins-home/jobs/brooklyn-master-build-docker/builds/370/testng/testng-results-4.xml'
Processing '/x1/jenkins/jenkins-home/jobs/brooklyn-master-build-docker/builds/370/testng/testng-results-5.xml'
Processing '/x1/jenkins/jenkins-home/jobs/brooklyn-master-build-docker/builds/370/testng/testng-results-6.xml'
Processing '/x1/jenkins/jenkins-home/jobs/brooklyn-master-build-docker/builds/370/testng/testng-results-7.xml'
Processing '/x1/jenkins/jenkins-home/jobs/brooklyn-master-build-docker/builds/370/testng/testng-results-8.xml'
Processing '/x1/jenkins/jenkins-home/jobs/brooklyn-master-build-docker/builds/370/testng/testng-results-9.xml'
Processing '/x1/jenkins/jenkins-home/jobs/brooklyn-master-build-docker/builds/370/testng/testng-results.xml'
0.021872% of tests failed, which exceeded threshold of 0%. Marking build as UNSTABLE
TestNG Reports Processing: FINISH