OSDir

[Date Prev][Date Next][Thread Prev][Thread Next][Date Index][Thread Index]

Build failed in Jenkins: brooklyn-server-master-docker #69


See <https://builds.apache.org/job/brooklyn-server-master-docker/69/display/redirect?page=changes>

Changes:

[github] Defers reading of config in SshCommandSensor

[github] Adds test for SshcommandSensor DSL resolution

------------------------------------------
[...truncated 7.58 MB...]
2018-04-19 13:07:34,461 WARN  - Empty contextPath
2018-04-19 13:07:34,461 INFO  - TESTNG PASSED CONFIGURATION: "Surefire test" - @BeforeClass org.apache.brooklyn.rest.testing.BrooklynRestApiTest.setUpClass() finished in 48 ms
2018-04-19 13:07:34,462 INFO  - TESTNG INVOKING CONFIGURATION: "Surefire test" - @BeforeMethod org.apache.brooklyn.rest.testing.BrooklynRestApiTest.setUpMethod()
2018-04-19 13:07:34,462 INFO  - TESTNG PASSED CONFIGURATION: "Surefire test" - @BeforeMethod org.apache.brooklyn.rest.testing.BrooklynRestApiTest.setUpMethod() finished in 0 ms
2018-04-19 13:07:34,462 INFO  - TESTNG INVOKING: "Surefire test" - org.apache.brooklyn.rest.resources.LocationResourceTest.testAddLegacyLocationDefinition()
2018-04-19 13:07:34,482 WARN  - Request for bundle 'aws-ec2' was ignored as no framework available; and failed to find 'us-east-1' in plain old classpath
2018-04-19 13:07:34,562 WARN  - Request for bundle 'aws-ec2' was ignored as no framework available; and failed to find 'us-east-1' in plain old classpath
2018-04-19 13:07:34,572 WARN  - Request for bundle 'aws-ec2' was ignored as no framework available; and failed to find 'us-east-1' in plain old classpath
2018-04-19 13:07:34,587 WARN  - Request for bundle 'aws-ec2' was ignored as no framework available; and failed to find 'us-east-1' in plain old classpath
2018-04-19 13:07:34,604 INFO  - added legacy, at: http://localhost:9998/locations/my-jungle-legacy
2018-04-19 13:07:34,616 WARN  - Request for bundle 'aws-ec2' was ignored as no framework available; and failed to find 'us-east-1' in plain old classpath
2018-04-19 13:07:34,632 INFO  -  contents: LocationSummary{id='my-jungle-legacy:0.0.0-SNAPSHOT', type='null', catalog='CatalogLocationSummary{config=[]}', links={self=/locations/my-jungle-legacy:0.0.0-SNAPSHOT}}
2018-04-19 13:07:34,635 WARN  - Request for bundle 'aws-ec2' was ignored as no framework available; and failed to find 'us-east-1' in plain old classpath
2018-04-19 13:07:34,666 INFO  - TESTNG PASSED: "Surefire test" - org.apache.brooklyn.rest.resources.LocationResourceTest.testAddLegacyLocationDefinition() finished in 204 ms
2018-04-19 13:07:34,666 INFO  - TESTNG INVOKING CONFIGURATION: "Surefire test" - @AfterMethod org.apache.brooklyn.rest.testing.BrooklynRestApiTest.tearDownMethod()
2018-04-19 13:07:34,666 INFO  - TESTNG PASSED CONFIGURATION: "Surefire test" - @AfterMethod org.apache.brooklyn.rest.testing.BrooklynRestApiTest.tearDownMethod() finished in 0 ms
2018-04-19 13:07:34,667 INFO  - TESTNG INVOKING CONFIGURATION: "Surefire test" - @BeforeMethod org.apache.brooklyn.rest.testing.BrooklynRestApiTest.setUpMethod()
2018-04-19 13:07:34,667 INFO  - TESTNG PASSED CONFIGURATION: "Surefire test" - @BeforeMethod org.apache.brooklyn.rest.testing.BrooklynRestApiTest.setUpMethod() finished in 0 ms
2018-04-19 13:07:34,667 INFO  - TESTNG INVOKING: "Surefire test" - org.apache.brooklyn.rest.resources.LocationResourceTest.testAddNewLocationDefinition()
2018-04-19 13:07:34,678 WARN  - Request for bundle 'aws-ec2' was ignored as no framework available; and failed to find 'us-east-1' in plain old classpath
2018-04-19 13:07:34,685 WARN  - Request for bundle 'aws-ec2' was ignored as no framework available; and failed to find 'us-east-1' in plain old classpath
2018-04-19 13:07:34,691 WARN  - Request for bundle 'aws-ec2' was ignored as no framework available; and failed to find 'us-east-1' in plain old classpath
2018-04-19 13:07:34,696 INFO  - REST created catalog items: [BasicRegisteredType[my-jungle:0.1.2]]
2018-04-19 13:07:34,698 INFO  - added, at: null
2018-04-19 13:07:34,703 INFO  -  item: CatalogLocationSummary{config=[]}
2018-04-19 13:07:34,710 WARN  - Request for bundle 'aws-ec2' was ignored as no framework available; and failed to find 'us-east-1' in plain old classpath
2018-04-19 13:07:34,717 INFO  -  summary: LocationSummary{id='my-jungle:0.1.2', type='null', catalog='CatalogLocationSummary{config=[]}', links={self=/locations/my-jungle:0.1.2}}
2018-04-19 13:07:34,719 WARN  - Request for bundle 'aws-ec2' was ignored as no framework available; and failed to find 'us-east-1' in plain old classpath
2018-04-19 13:07:34,725 INFO  - TESTNG PASSED: "Surefire test" - org.apache.brooklyn.rest.resources.LocationResourceTest.testAddNewLocationDefinition() finished in 58 ms
2018-04-19 13:07:34,726 INFO  - TESTNG INVOKING CONFIGURATION: "Surefire test" - @AfterMethod org.apache.brooklyn.rest.testing.BrooklynRestApiTest.tearDownMethod()
2018-04-19 13:07:34,726 INFO  - TESTNG PASSED CONFIGURATION: "Surefire test" - @AfterMethod org.apache.brooklyn.rest.testing.BrooklynRestApiTest.tearDownMethod() finished in 0 ms
2018-04-19 13:07:34,726 INFO  - TESTNG INVOKING CONFIGURATION: "Surefire test" - @BeforeMethod org.apache.brooklyn.rest.testing.BrooklynRestApiTest.setUpMethod()
2018-04-19 13:07:34,726 INFO  - TESTNG PASSED CONFIGURATION: "Surefire test" - @BeforeMethod org.apache.brooklyn.rest.testing.BrooklynRestApiTest.setUpMethod() finished in 0 ms
2018-04-19 13:07:34,726 INFO  - TESTNG INVOKING: "Surefire test" - org.apache.brooklyn.rest.resources.LocationResourceTest.testDisplayNameInConfig()
2018-04-19 13:07:34,748 WARN  - Request for bundle 'byon' was ignored as no framework available; and failed to find '(hosts="10.10.10.102")' in plain old classpath
2018-04-19 13:07:34,764 WARN  - Request for bundle 'byon' was ignored as no framework available; and failed to find '(hosts="10.10.10.102")' in plain old classpath
2018-04-19 13:07:34,772 WARN  - Request for bundle 'byon' was ignored as no framework available; and failed to find '(hosts="10.10.10.102")' in plain old classpath
2018-04-19 13:07:34,779 INFO  - REST created catalog items: [BasicRegisteredType[test_config_displayName_id:0.1.2]]
2018-04-19 13:07:34,780 INFO  - added, at: null
2018-04-19 13:07:34,788 INFO  -  item: CatalogLocationSummary{config=[]}
[GC (Allocation Failure)  243667K->66641K(748544K), 0.0167867 secs]
2018-04-19 13:07:34,818 WARN  - Request for bundle 'byon' was ignored as no framework available; and failed to find '(hosts="10.10.10.102")' in plain old classpath
2018-04-19 13:07:34,829 INFO  -  summary: LocationSummary{id='test_config_displayName_id:0.1.2', type='null', catalog='CatalogLocationSummary{config=[]}', links={self=/locations/test_config_displayName_id:0.1.2}}
2018-04-19 13:07:34,832 WARN  - Request for bundle 'byon' was ignored as no framework available; and failed to find '(hosts="10.10.10.102")' in plain old classpath
2018-04-19 13:07:34,842 INFO  - TESTNG PASSED: "Surefire test" - org.apache.brooklyn.rest.resources.LocationResourceTest.testDisplayNameInConfig() finished in 115 ms
2018-04-19 13:07:34,842 INFO  - TESTNG INVOKING CONFIGURATION: "Surefire test" - @AfterMethod org.apache.brooklyn.rest.testing.BrooklynRestApiTest.tearDownMethod()
2018-04-19 13:07:34,842 INFO  - TESTNG PASSED CONFIGURATION: "Surefire test" - @AfterMethod org.apache.brooklyn.rest.testing.BrooklynRestApiTest.tearDownMethod() finished in 0 ms
2018-04-19 13:07:34,842 INFO  - TESTNG INVOKING CONFIGURATION: "Surefire test" - @BeforeMethod org.apache.brooklyn.rest.testing.BrooklynRestApiTest.setUpMethod()
2018-04-19 13:07:34,843 INFO  - TESTNG PASSED CONFIGURATION: "Surefire test" - @BeforeMethod org.apache.brooklyn.rest.testing.BrooklynRestApiTest.setUpMethod() finished in 1 ms
2018-04-19 13:07:34,843 INFO  - TESTNG INVOKING: "Surefire test" - org.apache.brooklyn.rest.resources.LocationResourceTest.testDisplayNameInItems()
2018-04-19 13:07:34,858 WARN  - Request for bundle 'byon' was ignored as no framework available; and failed to find '(hosts="10.10.10.102")' in plain old classpath
2018-04-19 13:07:34,870 WARN  - Request for bundle 'byon' was ignored as no framework available; and failed to find '(hosts="10.10.10.102")' in plain old classpath
2018-04-19 13:07:34,881 WARN  - Request for bundle 'byon' was ignored as no framework available; and failed to find '(hosts="10.10.10.102")' in plain old classpath
2018-04-19 13:07:34,888 INFO  - REST created catalog items: [BasicRegisteredType[test_items_displayName_id:0.1.2]]
2018-04-19 13:07:34,890 INFO  - added, at: null
2018-04-19 13:07:34,900 INFO  -  item: CatalogLocationSummary{config=[]}
2018-04-19 13:07:34,910 WARN  - Request for bundle 'byon' was ignored as no framework available; and failed to find '(hosts="10.10.10.102")' in plain old classpath
2018-04-19 13:07:34,918 INFO  -  summary: LocationSummary{id='test_items_displayName_id:0.1.2', type='null', catalog='CatalogLocationSummary{config=[]}', links={self=/locations/test_items_displayName_id:0.1.2}}
2018-04-19 13:07:34,922 WARN  - Request for bundle 'byon' was ignored as no framework available; and failed to find '(hosts="10.10.10.102")' in plain old classpath
2018-04-19 13:07:34,931 INFO  - TESTNG PASSED: "Surefire test" - org.apache.brooklyn.rest.resources.LocationResourceTest.testDisplayNameInItems() finished in 88 ms
2018-04-19 13:07:34,931 INFO  - TESTNG INVOKING CONFIGURATION: "Surefire test" - @AfterMethod org.apache.brooklyn.rest.testing.BrooklynRestApiTest.tearDownMethod()
2018-04-19 13:07:34,931 INFO  - TESTNG PASSED CONFIGURATION: "Surefire test" - @AfterMethod org.apache.brooklyn.rest.testing.BrooklynRestApiTest.tearDownMethod() finished in 0 ms
2018-04-19 13:07:34,932 INFO  - TESTNG INVOKING CONFIGURATION: "Surefire test" - @BeforeMethod org.apache.brooklyn.rest.testing.BrooklynRestApiTest.setUpMethod()
2018-04-19 13:07:34,932 INFO  - TESTNG PASSED CONFIGURATION: "Surefire test" - @BeforeMethod org.apache.brooklyn.rest.testing.BrooklynRestApiTest.setUpMethod() finished in 0 ms
2018-04-19 13:07:34,932 INFO  - TESTNG INVOKING: "Surefire test" - org.apache.brooklyn.rest.resources.LocationResourceTest.testGetLocationConfig()
2018-04-19 13:07:34,936 WARN  - Deprecated use of unmanaged location (SimulatedLocation{id=s2anh8dj1w, name=SimulatedLocation:s2an}); will be managed automatically now but not supported in future versions
2018-04-19 13:07:34,955 INFO  - TESTNG PASSED: "Surefire test" - org.apache.brooklyn.rest.resources.LocationResourceTest.testGetLocationConfig() finished in 23 ms
2018-04-19 13:07:34,956 INFO  - TESTNG INVOKING CONFIGURATION: "Surefire test" - @AfterMethod org.apache.brooklyn.rest.testing.BrooklynRestApiTest.tearDownMethod()
2018-04-19 13:07:34,956 INFO  - TESTNG PASSED CONFIGURATION: "Surefire test" - @AfterMethod org.apache.brooklyn.rest.testing.BrooklynRestApiTest.tearDownMethod() finished in 0 ms
2018-04-19 13:07:34,956 INFO  - TESTNG INVOKING CONFIGURATION: "Surefire test" - @BeforeMethod org.apache.brooklyn.rest.testing.BrooklynRestApiTest.setUpMethod()
2018-04-19 13:07:34,956 INFO  - TESTNG PASSED CONFIGURATION: "Surefire test" - @BeforeMethod org.apache.brooklyn.rest.testing.BrooklynRestApiTest.setUpMethod() finished in 0 ms
2018-04-19 13:07:34,956 INFO  - TESTNG INVOKING: "Surefire test" - org.apache.brooklyn.rest.resources.LocationResourceTest.testDisplayNameInConfigOverridesItems()
2018-04-19 13:07:34,969 WARN  - Request for bundle 'byon' was ignored as no framework available; and failed to find '(hosts="10.10.10.102")' in plain old classpath
2018-04-19 13:07:34,977 WARN  - Request for bundle 'byon' was ignored as no framework available; and failed to find '(hosts="10.10.10.102")' in plain old classpath
2018-04-19 13:07:34,984 WARN  - Request for bundle 'byon' was ignored as no framework available; and failed to find '(hosts="10.10.10.102")' in plain old classpath
2018-04-19 13:07:34,990 INFO  - REST created catalog items: [BasicRegisteredType[test_config_overrides_items_displayName_id:0.1.2]]
2018-04-19 13:07:34,991 INFO  - added, at: null
2018-04-19 13:07:34,999 INFO  -  item: CatalogLocationSummary{config=[]}
2018-04-19 13:07:35,008 WARN  - Request for bundle 'byon' was ignored as no framework available; and failed to find '(hosts="10.10.10.102")' in plain old classpath
2018-04-19 13:07:35,015 INFO  -  summary: LocationSummary{id='test_config_overrides_items_displayName_id:0.1.2', type='null', catalog='CatalogLocationSummary{config=[]}', links={self=/locations/test_config_overrides_items_displayName_id:0.1.2}}
2018-04-19 13:07:35,019 WARN  - Request for bundle 'byon' was ignored as no framework available; and failed to find '(hosts="10.10.10.102")' in plain old classpath
2018-04-19 13:07:35,026 INFO  - TESTNG PASSED: "Surefire test" - org.apache.brooklyn.rest.resources.LocationResourceTest.testDisplayNameInConfigOverridesItems() finished in 70 ms
2018-04-19 13:07:35,027 INFO  - TESTNG INVOKING CONFIGURATION: "Surefire test" - @AfterMethod org.apache.brooklyn.rest.testing.BrooklynRestApiTest.tearDownMethod()
2018-04-19 13:07:35,027 INFO  - TESTNG PASSED CONFIGURATION: "Surefire test" - @AfterMethod org.apache.brooklyn.rest.testing.BrooklynRestApiTest.tearDownMethod() finished in 1 ms
2018-04-19 13:07:35,027 INFO  - TESTNG INVOKING CONFIGURATION: "Surefire test" - @BeforeMethod org.apache.brooklyn.rest.testing.BrooklynRestApiTest.setUpMethod()
2018-04-19 13:07:35,027 INFO  - TESTNG PASSED CONFIGURATION: "Surefire test" - @BeforeMethod org.apache.brooklyn.rest.testing.BrooklynRestApiTest.setUpMethod() finished in 0 ms
2018-04-19 13:07:35,027 INFO  - TESTNG INVOKING: "Surefire test" - org.apache.brooklyn.rest.resources.LocationResourceTest.testDeleteLocation()
2018-04-19 13:07:35,036 INFO  - TESTNG PASSED: "Surefire test" - org.apache.brooklyn.rest.resources.LocationResourceTest.testDeleteLocation() finished in 9 ms
2018-04-19 13:07:35,037 INFO  - TESTNG INVOKING CONFIGURATION: "Surefire test" - @AfterMethod org.apache.brooklyn.rest.testing.BrooklynRestApiTest.tearDownMethod()
2018-04-19 13:07:35,037 INFO  - TESTNG PASSED CONFIGURATION: "Surefire test" - @AfterMethod org.apache.brooklyn.rest.testing.BrooklynRestApiTest.tearDownMethod() finished in 0 ms
2018-04-19 13:07:35,037 INFO  - TESTNG INVOKING CONFIGURATION: "Surefire test" - @BeforeMethod org.apache.brooklyn.rest.testing.BrooklynRestApiTest.setUpMethod()
2018-04-19 13:07:35,037 INFO  - TESTNG PASSED CONFIGURATION: "Surefire test" - @BeforeMethod org.apache.brooklyn.rest.testing.BrooklynRestApiTest.setUpMethod() finished in 0 ms
2018-04-19 13:07:35,038 INFO  - TESTNG INVOKING: "Surefire test" - org.apache.brooklyn.rest.resources.LocationResourceTest.testListAllLocationDefinitions()
2018-04-19 13:07:35,049 WARN  - Request for bundle 'aws-ec2' was ignored as no framework available; and failed to find 'us-east-1' in plain old classpath
2018-04-19 13:07:35,060 WARN  - Request for bundle 'byon' was ignored as no framework available; and failed to find '(hosts="10.10.10.102")' in plain old classpath
2018-04-19 13:07:35,068 WARN  - Request for bundle 'byon' was ignored as no framework available; and failed to find '(hosts="10.10.10.102")' in plain old classpath
2018-04-19 13:07:35,078 WARN  - Request for bundle 'byon' was ignored as no framework available; and failed to find '(hosts="10.10.10.102")' in plain old classpath
2018-04-19 13:07:35,089 INFO  - TESTNG PASSED: "Surefire test" - org.apache.brooklyn.rest.resources.LocationResourceTest.testListAllLocationDefinitions() finished in 52 ms
2018-04-19 13:07:35,090 INFO  - TESTNG INVOKING CONFIGURATION: "Surefire test" - @AfterMethod org.apache.brooklyn.rest.testing.BrooklynRestApiTest.tearDownMethod()
2018-04-19 13:07:35,090 INFO  - TESTNG PASSED CONFIGURATION: "Surefire test" - @AfterMethod org.apache.brooklyn.rest.testing.BrooklynRestApiTest.tearDownMethod() finished in 0 ms
2018-04-19 13:07:35,091 INFO  - TESTNG INVOKING CONFIGURATION: "Surefire test" - @BeforeMethod org.apache.brooklyn.rest.testing.BrooklynRestApiTest.setUpMethod()
2018-04-19 13:07:35,091 INFO  - TESTNG PASSED CONFIGURATION: "Surefire test" - @BeforeMethod org.apache.brooklyn.rest.testing.BrooklynRestApiTest.setUpMethod() finished in 1 ms
2018-04-19 13:07:35,091 INFO  - TESTNG INVOKING: "Surefire test" - org.apache.brooklyn.rest.resources.LocationResourceTest.testGetSpecificLocation()
2018-04-19 13:07:35,101 WARN  - Request for bundle 'aws-ec2' was ignored as no framework available; and failed to find 'us-east-1' in plain old classpath
2018-04-19 13:07:35,112 INFO  - TESTNG PASSED: "Surefire test" - org.apache.brooklyn.rest.resources.LocationResourceTest.testGetSpecificLocation() finished in 21 ms
2018-04-19 13:07:35,112 INFO  - TESTNG INVOKING CONFIGURATION: "Surefire test" - @AfterMethod org.apache.brooklyn.rest.testing.BrooklynRestApiTest.tearDownMethod()
2018-04-19 13:07:35,112 INFO  - TESTNG PASSED CONFIGURATION: "Surefire test" - @AfterMethod org.apache.brooklyn.rest.testing.BrooklynRestApiTest.tearDownMethod() finished in 0 ms
2018-04-19 13:07:35,113 INFO  - TESTNG INVOKING CONFIGURATION: "Surefire test" - @AfterClass org.apache.brooklyn.rest.testing.BrooklynRestApiTest.tearDownClass()
2018-04-19 13:07:35,114 INFO  - TESTNG PASSED CONFIGURATION: "Surefire test" - @AfterClass org.apache.brooklyn.rest.testing.BrooklynRestApiTest.tearDownClass() finished in 2 ms
2018-04-19 13:07:35,117 INFO  - TESTNG 
===============================================
    Surefire test
    Tests run: 242, Failures: 1, Skips: 0
===============================================
Tests run: 242, Failures: 1, Errors: 0, Skipped: 0, Time elapsed: 46.759 sec <<< FAILURE! - in TestSuite
testInvokeEffectorWithTimeoutTimesOut(org.apache.brooklyn.rest.resources.EffectorResourceTest)  Time elapsed: 0.035 sec  <<< FAILURE!
java.lang.AssertionError: 
responseMap={id=TfFAYVbX, displayName=sleepEffector, description=Invoking effector sleepEffector on TestEntity:et9d with parameters {duration=5m}, entityId=et9dfmhgbc, entityDisplayName=TestEntity:et9d, tags=[EFFECTOR, {type=org.apache.brooklyn.api.mgmt.ManagementContext}, {wrappingType=contextEntity, entity={type=org.apache.brooklyn.api.entity.Entity, id=et9dfmhgbc}}, {wrappingType=targetEntity, entity={type=org.apache.brooklyn.api.entity.Entity, id=et9dfmhgbc}}, {entityId=et9dfmhgbc, effectorName=sleepEffector}], submitTimeUtc=1.524143241939E12, startTimeUtc=1.524143241939E12, endTimeUtc=null, currentStatus=In progress, result=null, isError=false, isCancelled=false, children=[], submittedByTask=null, detailedStatus=Task[sleepEffector]@TfFAYVbX

In progress (RUNNABLE)
At: org.apache.brooklyn.util.javalang.coerce.TypeCoercerExtensible.tryCoerceInternal(TypeCoercerExtensible.java:189)
    org.apache.brooklyn.util.javalang.coerce.TypeCoercerExtensible.tryCoerce(TypeCoercerExtensible.java:112)
    org.apache.brooklyn.util.javalang.coerce.TypeCoercerExtensible.coerce(TypeCoercerExtensible.java:102)
    org.apache.brooklyn.util.javalang.coerce.TypeCoercerExtensible.coerce(TypeCoercerExtensible.java:98)
    org.apache.brooklyn.util.core.flags.TypeCoercions.coerce(TypeCoercions.java:81)
    org.apache.brooklyn.core.mgmt.internal.EffectorUtils.prepareArgsForEffectorFromMap(EffectorUtils.java:167)
    org.apache.brooklyn.core.mgmt.internal.EffectorUtils.prepareArgsForEffector(EffectorUtils.java:75)
    org.apache.brooklyn.core.mgmt.internal.AbstractManagementContext.invokeEffectorMethodLocal(AbstractManagementContext.java:324)
    org.apache.brooklyn.core.mgmt.internal.AbstractManagementContext.invokeEffectorMethodSync(AbstractManagementContext.java:366)
    org.apache.brooklyn.core.mgmt.internal.EffectorUtils.invokeMethodEffector(EffectorUtils.java:274)
    org.apache.brooklyn.core.effector.MethodEffector.call(MethodEffector.java:153)
    org.apache.brooklyn.core.effector.AbstractEffector.call(AbstractEffector.java:61)
    org.apache.brooklyn.core.effector.AbstractEffector$1$1.call(AbstractEffector.java:79)
    org.apache.brooklyn.util.core.task.DynamicSequentialTask$DstJob.call(DynamicSequentialTask.java:364)
    org.apache.brooklyn.util.core.task.BasicExecutionManager$SubmissionCallable.call(BasicExecutionManager.java:565), streams={}, links={self=/activities/TfFAYVbX, children=/activities/TfFAYVbX/children, entity=/applications/gkff4d6jt1/entities/et9dfmhgbc}} expected [true] but found [false]
	at org.apache.brooklyn.rest.resources.EffectorResourceTest.testInvokeEffectorWithTimeoutTimesOut(EffectorResourceTest.java:135)


Results :

Failed tests: 
  EffectorResourceTest.testInvokeEffectorWithTimeoutTimesOut:135 responseMap={id=TfFAYVbX, displayName=sleepEffector, description=Invoking effector sleepEffector on TestEntity:et9d with parameters {duration=5m}, entityId=et9dfmhgbc, entityDisplayName=TestEntity:et9d, tags=[EFFECTOR, {type=org.apache.brooklyn.api.mgmt.ManagementContext}, {wrappingType=contextEntity, entity={type=org.apache.brooklyn.api.entity.Entity, id=et9dfmhgbc}}, {wrappingType=targetEntity, entity={type=org.apache.brooklyn.api.entity.Entity, id=et9dfmhgbc}}, {entityId=et9dfmhgbc, effectorName=sleepEffector}], submitTimeUtc=1.524143241939E12, startTimeUtc=1.524143241939E12, endTimeUtc=null, currentStatus=In progress, result=null, isError=false, isCancelled=false, children=[], submittedByTask=null, detailedStatus=Task[sleepEffector]@TfFAYVbX

In progress (RUNNABLE)
At: org.apache.brooklyn.util.javalang.coerce.TypeCoercerExtensible.tryCoerceInternal(TypeCoercerExtensible.java:189)
    org.apache.brooklyn.util.javalang.coerce.TypeCoercerExtensible.tryCoerce(TypeCoercerExtensible.java:112)
    org.apache.brooklyn.util.javalang.coerce.TypeCoercerExtensible.coerce(TypeCoercerExtensible.java:102)
    org.apache.brooklyn.util.javalang.coerce.TypeCoercerExtensible.coerce(TypeCoercerExtensible.java:98)
    org.apache.brooklyn.util.core.flags.TypeCoercions.coerce(TypeCoercions.java:81)
    org.apache.brooklyn.core.mgmt.internal.EffectorUtils.prepareArgsForEffectorFromMap(EffectorUtils.java:167)
    org.apache.brooklyn.core.mgmt.internal.EffectorUtils.prepareArgsForEffector(EffectorUtils.java:75)
    org.apache.brooklyn.core.mgmt.internal.AbstractManagementContext.invokeEffectorMethodLocal(AbstractManagementContext.java:324)
    org.apache.brooklyn.core.mgmt.internal.AbstractManagementContext.invokeEffectorMethodSync(AbstractManagementContext.java:366)
    org.apache.brooklyn.core.mgmt.internal.EffectorUtils.invokeMethodEffector(EffectorUtils.java:274)
    org.apache.brooklyn.core.effector.MethodEffector.call(MethodEffector.java:153)
    org.apache.brooklyn.core.effector.AbstractEffector.call(AbstractEffector.java:61)
    org.apache.brooklyn.core.effector.AbstractEffector$1$1.call(AbstractEffector.java:79)
    org.apache.brooklyn.util.core.task.DynamicSequentialTask$DstJob.call(DynamicSequentialTask.java:364)
    org.apache.brooklyn.util.core.task.BasicExecutionManager$SubmissionCallable.call(BasicExecutionManager.java:565), streams={}, links={self=/activities/TfFAYVbX, children=/activities/TfFAYVbX/children, entity=/applications/gkff4d6jt1/entities/et9dfmhgbc}} expected [true] but found [false]

Tests run: 242, Failures: 1, Errors: 0, Skipped: 0

[INFO] ------------------------------------------------------------------------
[INFO] Reactor Summary:
[INFO] 
[INFO] Brooklyn Server Root ............................... SUCCESS [  1.086 s]
[INFO] Brooklyn Parent Project ............................ SUCCESS [  3.265 s]
[INFO] Brooklyn Test Support Utilities .................... SUCCESS [  5.800 s]
[INFO] Brooklyn Logback Includable Configuration .......... SUCCESS [  0.868 s]
[INFO] Brooklyn Common Utilities .......................... SUCCESS [ 25.459 s]
[INFO] Brooklyn API ....................................... SUCCESS [  2.008 s]
[INFO] CAMP Server Parent Project ......................... SUCCESS [  0.228 s]
[INFO] CAMP Base .......................................... SUCCESS [  3.357 s]
[INFO] Brooklyn Test Support .............................. SUCCESS [  1.116 s]
[INFO] Brooklyn REST Swagger Apidoc Utilities ............. SUCCESS [  1.249 s]
[INFO] Brooklyn Logback Configuration ..................... SUCCESS [  0.225 s]
[INFO] CAMP Server ........................................ SUCCESS [  5.628 s]
[INFO] Brooklyn Felix Runtime ............................. SUCCESS [  3.289 s]
[INFO] Brooklyn Groovy Utilities .......................... SUCCESS [  2.683 s]
[INFO] Brooklyn Core ...................................... SUCCESS [04:29 min]
[INFO] Brooklyn Policies .................................. SUCCESS [ 42.663 s]
[INFO] Brooklyn WinRM Software Entities ................... SUCCESS [ 12.505 s]
[INFO] Brooklyn Secure JMXMP Agent ........................ SUCCESS [ 11.260 s]
[INFO] Brooklyn JMX RMI Agent ............................. SUCCESS [  0.461 s]
[INFO] Brooklyn Jclouds Location Targets .................. SUCCESS [ 41.388 s]
[INFO] Brooklyn Software Base ............................. SUCCESS [01:48 min]
[INFO] Brooklyn CAMP ...................................... SUCCESS [03:10 min]
[INFO] Brooklyn Launcher Common ........................... SUCCESS [  5.128 s]
[INFO] Brooklyn REST API .................................. SUCCESS [ 12.973 s]
[INFO] Brooklyn REST Resources ............................ FAILURE [ 53.827 s]
[INFO] Brooklyn REST Server ............................... SKIPPED
[INFO] Brooklyn Launcher .................................. SKIPPED
[INFO] Brooklyn Container Location Targets ................ SKIPPED
[INFO] Brooklyn Command Line Interface .................... SKIPPED
[INFO] Brooklyn Test Framework ............................ SKIPPED
[INFO] Brooklyn OSGi init ................................. SKIPPED
[INFO] Brooklyn OSGi start ................................ SKIPPED
[INFO] Brooklyn Karaf ..................................... SKIPPED
[INFO] Jetty config fragment .............................. SKIPPED
[INFO] Apache Http Component extension .................... SKIPPED
[INFO] Brooklyn Karaf Features ............................ SKIPPED
[INFO] Brooklyn Karaf Shell Commands ...................... SKIPPED
[INFO] ------------------------------------------------------------------------
[INFO] BUILD FAILURE
[INFO] ------------------------------------------------------------------------
[INFO] Total time: 13:30 min
[INFO] Finished at: 2018-04-19T13:07:35Z
[INFO] Final Memory: 121M/677M
[INFO] ------------------------------------------------------------------------
[ERROR] Failed to execute goal org.apache.maven.plugins:maven-surefire-plugin:2.19.1:test (default-test) on project brooklyn-rest-resources: There are test failures.
[ERROR] 
[ERROR] Please refer to /usr/build/rest/rest-resources/target/surefire-reports for the individual test results.
[ERROR] -> [Help 1]
[ERROR] 
[ERROR] To see the full stack trace of the errors, re-run Maven with the -e switch.
[ERROR] Re-run Maven using the -X switch to enable full debug logging.
[ERROR] 
[ERROR] For more information about the errors and possible solutions, please read the following articles:
[ERROR] [Help 1] http://cwiki.apache.org/confluence/display/MAVEN/MojoFailureException
[ERROR] 
[ERROR] After correcting the problems, you can resume the build with the command
[ERROR]   mvn <goals> -rf :brooklyn-rest-resources
Build step 'Execute shell' marked build as failure
Recording test results
TestNG Reports Processing: START
Looking for TestNG results report in workspace using pattern: **/testng-results.xml
testng-results.xml was last modified before this build started. Ignoring it.
testng-results.xml was last modified before this build started. Ignoring it.
testng-results.xml was last modified before this build started. Ignoring it.
testng-results.xml was last modified before this build started. Ignoring it.
testng-results.xml was last modified before this build started. Ignoring it.
Saving reports...
Processing '/x1/jenkins/jenkins-home/jobs/brooklyn-server-master-docker/builds/69/testng/testng-results-1.xml'
Processing '/x1/jenkins/jenkins-home/jobs/brooklyn-server-master-docker/builds/69/testng/testng-results-10.xml'
Processing '/x1/jenkins/jenkins-home/jobs/brooklyn-server-master-docker/builds/69/testng/testng-results-11.xml'
Processing '/x1/jenkins/jenkins-home/jobs/brooklyn-server-master-docker/builds/69/testng/testng-results-12.xml'
Processing '/x1/jenkins/jenkins-home/jobs/brooklyn-server-master-docker/builds/69/testng/testng-results-13.xml'
Processing '/x1/jenkins/jenkins-home/jobs/brooklyn-server-master-docker/builds/69/testng/testng-results-14.xml'
Processing '/x1/jenkins/jenkins-home/jobs/brooklyn-server-master-docker/builds/69/testng/testng-results-2.xml'
Processing '/x1/jenkins/jenkins-home/jobs/brooklyn-server-master-docker/builds/69/testng/testng-results-3.xml'
Processing '/x1/jenkins/jenkins-home/jobs/brooklyn-server-master-docker/builds/69/testng/testng-results-4.xml'
Processing '/x1/jenkins/jenkins-home/jobs/brooklyn-server-master-docker/builds/69/testng/testng-results-5.xml'
Processing '/x1/jenkins/jenkins-home/jobs/brooklyn-server-master-docker/builds/69/testng/testng-results-6.xml'
Processing '/x1/jenkins/jenkins-home/jobs/brooklyn-server-master-docker/builds/69/testng/testng-results-7.xml'
Processing '/x1/jenkins/jenkins-home/jobs/brooklyn-server-master-docker/builds/69/testng/testng-results-8.xml'
Processing '/x1/jenkins/jenkins-home/jobs/brooklyn-server-master-docker/builds/69/testng/testng-results-9.xml'
Processing '/x1/jenkins/jenkins-home/jobs/brooklyn-server-master-docker/builds/69/testng/testng-results.xml'
0.021872% of tests failed, which exceeded threshold of 0%. Marking build as UNSTABLE
TestNG Reports Processing: FINISH