OSDir

[Date Prev][Date Next][Thread Prev][Thread Next][Date Index][Thread Index]

Build failed in Jenkins: brooklyn-dist-master-docker #19


See <https://builds.apache.org/job/brooklyn-dist-master-docker/19/display/redirect>

------------------------------------------
Started by user tbouron
[EnvInject] - Loading node environment variables.
Building remotely on H33 (ubuntu xenial) in workspace <https://builds.apache.org/job/brooklyn-dist-master-docker/ws/>
Cloning the remote Git repository
Cloning repository https://git-wip-us.apache.org/repos/asf/brooklyn-dist.git
 > git init <https://builds.apache.org/job/brooklyn-dist-master-docker/ws/> # timeout=10
Fetching upstream changes from https://git-wip-us.apache.org/repos/asf/brooklyn-dist.git
 > git --version # timeout=10
 > git fetch --tags --progress https://git-wip-us.apache.org/repos/asf/brooklyn-dist.git +refs/heads/*:refs/remotes/origin/*
 > git config remote.origin.url https://git-wip-us.apache.org/repos/asf/brooklyn-dist.git # timeout=10
 > git config --add remote.origin.fetch +refs/heads/*:refs/remotes/origin/* # timeout=10
 > git config remote.origin.url https://git-wip-us.apache.org/repos/asf/brooklyn-dist.git # timeout=10
Fetching upstream changes from https://git-wip-us.apache.org/repos/asf/brooklyn-dist.git
 > git fetch --tags --progress https://git-wip-us.apache.org/repos/asf/brooklyn-dist.git +refs/heads/*:refs/remotes/origin/*
 > git rev-parse origin/master^{commit} # timeout=10
Checking out Revision 67e899490e70c8321921bc355783fed68c840928 (origin/master)
 > git config core.sparsecheckout # timeout=10
 > git checkout -f 67e899490e70c8321921bc355783fed68c840928
Commit message: "Revert "This closes #119""
 > git rev-list --no-walk 67e899490e70c8321921bc355783fed68c840928 # timeout=10
Run condition [Current build status] enabling prebuild for step [Execute shell]
[brooklyn-dist-master-docker] $ /bin/bash -xe /tmp/jenkins4319960531387161518.sh
+ docker run -i --rm --name brooklyn-dist -v /home/jenkins/.m2:/root/.m2 -v <https://builds.apache.org/job/brooklyn-dist-master-docker/ws/>:/usr/build -w /usr/build tbouron/brooklyn-build:dist mvn clean install
Unable to find image 'tbouron/brooklyn-build:dist' locally
dist: Pulling from tbouron/brooklyn-build
b2388ca7fa65: Already exists
551fb2fe7af1: Already exists
31172a96e9a9: Already exists
399bf9752347: Already exists
9e41e7b89fb8: Already exists
1017f315d511: Already exists
22bc7fb81913: Already exists
2bb03009d8e3: Pulling fs layer
2bb03009d8e3: Verifying Checksum
2bb03009d8e3: Download complete
2bb03009d8e3: Pull complete
Digest: sha256:90aac8df68859c41a1495271562b46e194e4068ddc55b897976d2ffe48ab7441
Status: Downloaded newer image for tbouron/brooklyn-build:dist
[INFO] Scanning for projects...
[INFO] ------------------------------------------------------------------------
[INFO] Reactor Build Order:
[INFO] 
[INFO] Brooklyn Downstream Project Parent
[INFO] Brooklyn Dist Root
[INFO] Brooklyn All Things
[INFO] Brooklyn Distribution
[INFO] Brooklyn Karaf Distribution Parent
[INFO] Brooklyn Karaf Server Configuration
[INFO] Brooklyn Dist Karaf Features
[INFO] Brooklyn Karaf Distribution
[INFO] Brooklyn Karaf pax-exam itest
[INFO] Brooklyn Vagrant Getting Started Environment
[INFO] Brooklyn Quick-Start Project Archetype
[INFO] Brooklyn Shared Package Files
[INFO] Brooklyn RPM Package
[INFO] Brooklyn DEB Package
[INFO] 
[INFO] ------------------------------------------------------------------------
[INFO] Building Brooklyn Downstream Project Parent 1.0.0-SNAPSHOT
[INFO] ------------------------------------------------------------------------
[INFO] 
[INFO] --- maven-clean-plugin:2.6.1:clean (default-clean) @ brooklyn-downstream-parent ---
[INFO] Deleting /usr/build/downstream-parent (includes = [brooklyn*.log, brooklyn*.log.*, stacktrace.log, test-output, prodDb.*], excludes = [])
[INFO] 
[INFO] --- maven-remote-resources-plugin:1.5:process (default) @ brooklyn-downstream-parent ---
[INFO] 
[INFO] --- maven-site-plugin:3.4:attach-descriptor (attach-descriptor) @ brooklyn-downstream-parent ---
[INFO] 
[INFO] --- maven-install-plugin:2.5.2:install (default-install) @ brooklyn-downstream-parent ---
[INFO] Installing /usr/build/downstream-parent/pom.xml to /root/.m2/repository/org/apache/brooklyn/brooklyn-downstream-parent/1.0.0-SNAPSHOT/brooklyn-downstream-parent-1.0.0-SNAPSHOT.pom
[INFO] 
[INFO] ------------------------------------------------------------------------
[INFO] Building Brooklyn Dist Root 1.0.0-SNAPSHOT
[INFO] ------------------------------------------------------------------------
[INFO] 
[INFO] --- maven-clean-plugin:2.6.1:clean (default-clean) @ brooklyn-dist-root ---
[INFO] Deleting /usr/build (includes = [brooklyn*.log, brooklyn*.log.*, stacktrace.log, test-output, prodDb.*], excludes = [])
[INFO] 
[INFO] --- maven-replacer-plugin:1.4.1:replace (fix-eclipse-dot-classpath-mangling) @ brooklyn-dist-root ---
[INFO] Ignoring missing file
[INFO] Replacement run on 0 file.
[INFO] 
[INFO] --- buildnumber-maven-plugin:1.3:create (default) @ brooklyn-dist-root ---
[INFO] Executing: /bin/sh -c cd /usr/build && git rev-parse --verify HEAD
[INFO] Working directory: /usr/build
[INFO] Storing buildNumber: 67e899490e70c8321921bc355783fed68c840928 at timestamp: 1523877572971
[WARNING] Cannot get the branch information from the git repository: 
Detecting the current branch failed: fatal: ref HEAD is not a symbolic ref

[INFO] Executing: /bin/sh -c cd /usr/build && git rev-parse --verify HEAD
[INFO] Working directory: /usr/build
[INFO] Storing buildScmBranch: UNKNOWN
[INFO] 
[INFO] --- maven-enforcer-plugin:1.4.1:enforce (brooklyn-build-req) @ brooklyn-dist-root ---
[INFO] 
[INFO] --- maven-remote-resources-plugin:1.5:process (default) @ brooklyn-dist-root ---
[INFO] 
[INFO] --- maven-checkstyle-plugin:2.17:check (verify-style) @ brooklyn-dist-root ---
[INFO] 
[INFO] --- maven-site-plugin:3.4:attach-descriptor (attach-descriptor) @ brooklyn-dist-root ---
[INFO] 
[INFO] --- apache-rat-plugin:0.12:check (default) @ brooklyn-dist-root ---
[INFO] Enabled default license matchers.
[INFO] Will parse SCM ignores for exclusions...
[INFO] Parsing exclusions from /usr/build/.gitignore
[INFO] Finished adding exclusions from SCM ignore files.
[INFO] 92 implicit excludes (use -debug for more details).
[INFO] Exclude: sandbox/**
[INFO] Exclude: release/**
[INFO] Exclude: README.md
[INFO] Exclude: **/.git/**
[INFO] Exclude: **/.gitignore
[INFO] Exclude: **/.repository/**
[INFO] Exclude: **/.idea/**
[INFO] Exclude: **/*.iml
[INFO] Exclude: **/.classpath/**
[INFO] Exclude: **/.project
[INFO] Exclude: **/.settings/**
[INFO] Exclude: **/*.log
[INFO] Exclude: **/brooklyn*.log.*
[INFO] Exclude: **/target/**
[INFO] Exclude: **/nbactions.xml
[INFO] Exclude: **/nb-configuration.xml
[INFO] Exclude: ignored/**
[INFO] Exclude: LICENSE.md
[INFO] Exclude: .mvn/jvm.config
[INFO] Exclude: **/src/main/license/**
[INFO] Exclude: **/src/test/license/**
[INFO] Exclude: **/MANIFEST.MF
[INFO] Exclude: **/test-output/**
[INFO] Exclude: **/*.pem.pub
[INFO] Exclude: **/*.pem
[INFO] Exclude: **/*_rsa.pub
[INFO] Exclude: **/*_rsa
[INFO] Exclude: **/*.svg
[INFO] Exclude: **/*.crt
[INFO] Exclude: **/*.csr
[INFO] Exclude: **/*.key
[INFO] Exclude: **/*.key.org
[INFO] Exclude: **/*.psd
[INFO] Exclude: **/*.json
[INFO] Exclude: **/*.plxarc
[INFO] Exclude: **/src/test/resources/org/apache/brooklyn/entity/software/base/template_with_extra_substitutions.txt
[INFO] Exclude: **/src/main/resources/banner.txt
[INFO] Exclude: **/src/test/resources/ssl/certs/localhost/info.txt
[INFO] Exclude: **/src/main/history/dependencies.xml
[INFO] Exclude: **/sandbox/examples/src/main/scripts/amis.txt
[INFO] Exclude: docs/**
[INFO] Exclude: scripts/README.md
[INFO] Exclude: docker/README.md
[INFO] 16 resources included (use -debug for more details)
[INFO] Rat check: Summary over all files. Unapproved: 0, unknown: 0, generated: 0, approved: 14 licenses.
[INFO] 
[INFO] --- maven-source-plugin:2.4:jar-no-fork (attach-sources) @ brooklyn-dist-root ---
[INFO] 
[INFO] --- maven-source-plugin:2.4:test-jar-no-fork (attach-sources) @ brooklyn-dist-root ---
[INFO] 
[INFO] --- maven-install-plugin:2.5.2:install (default-install) @ brooklyn-dist-root ---
[INFO] Installing /usr/build/pom.xml to /root/.m2/repository/org/apache/brooklyn/brooklyn-dist-root/1.0.0-SNAPSHOT/brooklyn-dist-root-1.0.0-SNAPSHOT.pom
[INFO] 
[INFO] ------------------------------------------------------------------------
[INFO] Building Brooklyn All Things 1.0.0-SNAPSHOT
[INFO] ------------------------------------------------------------------------
Downloading from jclouds-snapshots: https://repository.apache.org/content/repositories/snapshots/io/netty/netty-tcnative-boringssl-static/2.0.6.Final/netty-tcnative-boringssl-static-2.0.6.Final-$%7Bos.detected.classifier%7D.jar
Downloading from central: https://repo.maven.apache.org/maven2/io/netty/netty-tcnative-boringssl-static/2.0.6.Final/netty-tcnative-boringssl-static-2.0.6.Final-$%7Bos.detected.classifier%7D.jar
[INFO] ------------------------------------------------------------------------
[INFO] Reactor Summary:
[INFO] 
[INFO] Brooklyn Downstream Project Parent ................. SUCCESS [  1.628 s]
[INFO] Brooklyn Dist Root ................................. SUCCESS [  3.344 s]
[INFO] Brooklyn All Things ................................ FAILURE [  1.994 s]
[INFO] Brooklyn Distribution .............................. SKIPPED
[INFO] Brooklyn Karaf Distribution Parent ................. SKIPPED
[INFO] Brooklyn Karaf Server Configuration ................ SKIPPED
[INFO] Brooklyn Dist Karaf Features ....................... SKIPPED
[INFO] Brooklyn Karaf Distribution ........................ SKIPPED
[INFO] Brooklyn Karaf pax-exam itest ...................... SKIPPED
[INFO] Brooklyn Vagrant Getting Started Environment ....... SKIPPED
[INFO] Brooklyn Quick-Start Project Archetype ............. SKIPPED
[INFO] Brooklyn Shared Package Files ...................... SKIPPED
[INFO] Brooklyn RPM Package ............................... SKIPPED
[INFO] Brooklyn DEB Package ............................... SKIPPED
[INFO] ------------------------------------------------------------------------
[INFO] BUILD FAILURE
[INFO] ------------------------------------------------------------------------
[INFO] Total time: 9.628 s
[INFO] Finished at: 2018-04-16T11:19:37Z
[INFO] Final Memory: 47M/656M
[INFO] ------------------------------------------------------------------------
[ERROR] Failed to execute goal on project brooklyn-all: Could not resolve dependencies for project org.apache.brooklyn:brooklyn-all:jar:1.0.0-SNAPSHOT: Could not find artifact io.netty:netty-tcnative-boringssl-static:jar:${os.detected.classifier}:2.0.6.Final in jclouds-snapshots (https://repository.apache.org/content/repositories/snapshots) -> [Help 1]
[ERROR] 
[ERROR] To see the full stack trace of the errors, re-run Maven with the -e switch.
[ERROR] Re-run Maven using the -X switch to enable full debug logging.
[ERROR] 
[ERROR] For more information about the errors and possible solutions, please read the following articles:
[ERROR] [Help 1] http://cwiki.apache.org/confluence/display/MAVEN/DependencyResolutionException
[ERROR] 
[ERROR] After correcting the problems, you can resume the build with the command
[ERROR]   mvn <goals> -rf :brooklyn-all
Build step 'Execute shell' marked build as failure
Recording test results
ERROR: Step ?Publish JUnit test result report? failed: No test report files were found. Configuration error?
TestNG Reports Processing: START
Looking for TestNG results report in workspace using pattern: **/testng-results.xml
Did not find any matching files.