OSDir


[Date Prev][Date Next][Thread Prev][Thread Next][Date Index][Thread Index]

Build failed in Jenkins: beam_Release_Gradle_NightlySnapshot #161


See <https://builds.apache.org/job/beam_Release_Gradle_NightlySnapshot/161/display/redirect?page=changes>

Changes:

[rpathak] [BEAM-3820] Exposing batchSize for SolrIO Writes

[rpathak] [BEAM-3820] Updating comments adding default batch size in javadoc

[Jozef.Vilcek] Remove slf4j-simple binding from dependencies

[thw] [BEAM-5277] Flink portable streaming: Empty side input for ready windows

[lukasz.gajowy] [BEAM-5293] Fix build break while running IOIT on s3 filesystem

------------------------------------------
[...truncated 18.55 MB...]

> Task :beam-vendor-sdks-java-extensions-protobuf:validateShadedJarDoesntLeakNonOrgApacheBeamClasses
Caching disabled for task ':beam-vendor-sdks-java-extensions-protobuf:validateShadedJarDoesntLeakNonOrgApacheBeamClasses': Caching has not been enabled for the task
Task ':beam-vendor-sdks-java-extensions-protobuf:validateShadedJarDoesntLeakNonOrgApacheBeamClasses' is not up-to-date because:
  Task has not declared any outputs despite executing actions.
:beam-vendor-sdks-java-extensions-protobuf:validateShadedJarDoesntLeakNonOrgApacheBeamClasses (Thread[Task worker for ':' Thread 2,5,main]) completed. Took 0.033 secs.
:beam-vendor-sdks-java-extensions-protobuf:check (Thread[Task worker for ':' Thread 2,5,main]) started.

> Task :beam-vendor-sdks-java-extensions-protobuf:check
Skipping task ':beam-vendor-sdks-java-extensions-protobuf:check' as it has no actions.
:beam-vendor-sdks-java-extensions-protobuf:check (Thread[Task worker for ':' Thread 2,5,main]) completed. Took 0.0 secs.
:beam-vendor-sdks-java-extensions-protobuf:build (Thread[Task worker for ':' Thread 2,5,main]) started.

> Task :beam-vendor-sdks-java-extensions-protobuf:build
Skipping task ':beam-vendor-sdks-java-extensions-protobuf:build' as it has no actions.
:beam-vendor-sdks-java-extensions-protobuf:build (Thread[Task worker for ':' Thread 2,5,main]) completed. Took 0.0 secs.
:beam-website:assemble (Thread[Task worker for ':' Thread 2,5,main]) started.

> Task :beam-website:assemble UP-TO-DATE
Skipping task ':beam-website:assemble' as it has no actions.
:beam-website:assemble (Thread[Task worker for ':' Thread 2,5,main]) completed. Took 0.0 secs.
:beam-website:setupBuildDir (Thread[Task worker for ':' Thread 2,5,main]) started.

> Task :beam-website:setupBuildDir
Build cache key for task ':beam-website:setupBuildDir' is 7afd3bd0c1a9269d50131165bb8a63a1
Caching disabled for task ':beam-website:setupBuildDir': Caching has not been enabled for the task
Task ':beam-website:setupBuildDir' is not up-to-date because:
  No history is available.
:beam-website:setupBuildDir (Thread[Task worker for ':' Thread 2,5,main]) completed. Took 0.024 secs.
:beam-website:buildDockerImage (Thread[Task worker for ':' Thread 2,5,main]) started.

> Task :beam-website:buildDockerImage
Caching disabled for task ':beam-website:buildDockerImage': Caching has not been enabled for the task
Task ':beam-website:buildDockerImage' is not up-to-date because:
  Task has not declared any outputs despite executing actions.
Starting process 'command 'docker''. Working directory: <https://builds.apache.org/job/beam_Release_Gradle_NightlySnapshot/ws/src/website> Command: docker build -t beam-website .
Successfully started process 'command 'docker''
Sending build context to Docker daemon  24.51MB
Step 1/7 : FROM ruby:2.5
2.5: Pulling from library/ruby
Digest: sha256:e1dc5bd27600a5e1ac190565f5573590b3610371bd995e9cc2b445b7d22f3cc4
Status: Downloaded newer image for ruby:2.5
 ---> 34d1c6024e99
Step 2/7 : WORKDIR /ruby
 ---> Using cache
 ---> 0f56322feb7e
Step 3/7 : RUN gem install bundler
 ---> Using cache
 ---> a1199664513a
Step 4/7 : ADD Gemfile Gemfile.lock /ruby/
 ---> Using cache
 ---> 6aaae1215cc2
Step 5/7 : RUN bundle install --deployment --path $GEM_HOME
 ---> Using cache
 ---> 0c340f1b6755
Step 6/7 : ENV LC_ALL C.UTF-8
 ---> Using cache
 ---> 948a9048123e
Step 7/7 : CMD sleep 3600
 ---> Using cache
 ---> 643d89b9f102
Successfully built 643d89b9f102
Successfully tagged beam-website:latest
:beam-website:buildDockerImage (Thread[Task worker for ':' Thread 2,5,main]) completed. Took 0.813 secs.
:beam-website:createDockerContainer (Thread[Task worker for ':' Thread 2,5,main]) started.

> Task :beam-website:createDockerContainer
Caching disabled for task ':beam-website:createDockerContainer': Caching has not been enabled for the task
Task ':beam-website:createDockerContainer' is not up-to-date because:
  Task has not declared any outputs despite executing actions.
Starting process 'command '/bin/bash''. Working directory: <https://builds.apache.org/job/beam_Release_Gradle_NightlySnapshot/ws/src/website> Command: /bin/bash -c docker create -v <https://builds.apache.org/job/beam_Release_Gradle_NightlySnapshot/ws/src>:/repo -u $(id -u):$(id -g) beam-website
Successfully started process 'command '/bin/bash''
:beam-website:createDockerContainer (Thread[Task worker for ':' Thread 2,5,main]) completed. Took 0.996 secs.
:beam-website:startDockerContainer (Thread[Task worker for ':' Thread 2,5,main]) started.

> Task :beam-website:startDockerContainer
Caching disabled for task ':beam-website:startDockerContainer': Caching has not been enabled for the task
Task ':beam-website:startDockerContainer' is not up-to-date because:
  Task has not declared any outputs despite executing actions.
Starting process 'command 'docker''. Working directory: <https://builds.apache.org/job/beam_Release_Gradle_NightlySnapshot/ws/src/website> Command: docker start 979c2ecb744641f42ad1467fa4cd78548bbfeb4b366266d8ad984320408e71c2
Successfully started process 'command 'docker''
979c2ecb744641f42ad1467fa4cd78548bbfeb4b366266d8ad984320408e71c2
:beam-website:startDockerContainer (Thread[Task worker for ':' Thread 2,5,main]) completed. Took 0.301 secs.
:beam-website:buildWebsite (Thread[Task worker for ':' Thread 2,5,main]) started.

> Task :beam-website:buildWebsite
Build cache key for task ':beam-website:buildWebsite' is d2133ce68354f0b7d6a16ed97f917c2a
Caching disabled for task ':beam-website:buildWebsite': Caching has not been enabled for the task
Task ':beam-website:buildWebsite' is not up-to-date because:
  No history is available.
Starting process 'command 'docker''. Working directory: <https://builds.apache.org/job/beam_Release_Gradle_NightlySnapshot/ws/src/website> Command: docker exec 979c2ecb744641f42ad1467fa4cd78548bbfeb4b366266d8ad984320408e71c2 /bin/bash -c cd /repo/build/website &&       bundle exec jekyll build       --config /repo/website/_config.yml       --incremental       --source /repo/website/src
      
Successfully started process 'command 'docker''
`/` is not writable.
Bundler will use `/tmp/bundler/home/unknown' as your home directory temporarily.
Configuration file: /repo/website/_config.yml
            Source: /repo/website/src
       Destination: content
 Incremental build: enabled
      Generating... 
                    done in 11.742 seconds.
 Auto-regeneration: disabled. Use --watch to enable.
:beam-website:buildWebsite (Thread[Task worker for ':' Thread 2,5,main]) completed. Took 13.147 secs.
:beam-website:testWebsite (Thread[Task worker for ':' Thread 2,5,main]) started.

> Task :beam-website:testWebsite
Caching disabled for task ':beam-website:testWebsite': Caching has not been enabled for the task
Task ':beam-website:testWebsite' is not up-to-date because:
  Task has not declared any outputs despite executing actions.
Starting process 'command 'docker''. Working directory: <https://builds.apache.org/job/beam_Release_Gradle_NightlySnapshot/ws/src/website> Command: docker exec 979c2ecb744641f42ad1467fa4cd78548bbfeb4b366266d8ad984320408e71c2 /bin/bash -c cd /repo/build/website &&       bundle exec rake test
Successfully started process 'command 'docker''
`/` is not writable.
Bundler will use `/tmp/bundler/home/unknown' as your home directory temporarily.
Running ["HtmlCheck", "LinkCheck", "ImageCheck", "ScriptCheck"] on ["./content"] on *.html... 


Checking 566 external links...
Ran on 135 files!


- ./content/contribute/release-guide/index.html
  *  External link https://github.com/apache/beam/blob/master/runners/google-cloud-dataflow-java/pom.xml failed: 404 No error
- ./content/get-started/downloads/index.html
  *  External link https://dist.apache.org/repos/dist/release/beam/2.5.0/apache-beam-2.5.0-source-release.zip failed: 404 No error
  *  External link https://dist.apache.org/repos/dist/release/beam/2.5.0/apache-beam-2.5.0-source-release.zip.asc failed: 404 No error
  *  External link https://dist.apache.org/repos/dist/release/beam/2.5.0/apache-beam-2.5.0-source-release.zip.sha512 failed: 404 No error
rake aborted!
HTML-Proofer found 4 failures!
/usr/local/bundle/ruby/2.5.0/gems/html-proofer-3.8.0/lib/html-proofer/runner.rb:167:in `print_failed_tests'
/usr/local/bundle/ruby/2.5.0/gems/html-proofer-3.8.0/lib/html-proofer/runner.rb:48:in `run'
/repo/build/website/Rakefile:23:in `block in <top (required)>'
/usr/local/bundle/ruby/2.5.0/gems/rake-12.3.0/exe/rake:27:in `<top (required)>'
/usr/local/bundle/bin/bundle:23:in `load'
/usr/local/bundle/bin/bundle:23:in `<main>'
Tasks: TOP => test
(See full trace by running task with --trace)

> Task :beam-website:testWebsite FAILED
:beam-website:testWebsite (Thread[Task worker for ':' Thread 2,5,main]) completed. Took 51.96 secs.
:beam-website:stopAndRemoveDockerContainer (Thread[Task worker for ':' Thread 2,5,main]) started.

> Task :beam-website:stopAndRemoveDockerContainer
Caching disabled for task ':beam-website:stopAndRemoveDockerContainer': Caching has not been enabled for the task
Task ':beam-website:stopAndRemoveDockerContainer' is not up-to-date because:
  Task has not declared any outputs despite executing actions.
Starting process 'command 'docker''. Working directory: <https://builds.apache.org/job/beam_Release_Gradle_NightlySnapshot/ws/src/website> Command: docker rm -f 979c2ecb744641f42ad1467fa4cd78548bbfeb4b366266d8ad984320408e71c2
Successfully started process 'command 'docker''
979c2ecb744641f42ad1467fa4cd78548bbfeb4b366266d8ad984320408e71c2
:beam-website:stopAndRemoveDockerContainer (Thread[Task worker for ':' Thread 2,5,main]) completed. Took 0.399 secs.
:release:compileJava (Thread[Task worker for ':' Thread 2,5,main]) started.

> Task :release:compileJava NO-SOURCE
file or directory '<https://builds.apache.org/job/beam_Release_Gradle_NightlySnapshot/ws/src/release/src/main/java',> not found
Skipping task ':release:compileJava' as it has no source files and no previous output files.
:release:compileJava (Thread[Task worker for ':' Thread 2,5,main]) completed. Took 0.001 secs.
:release:compileGroovy (Thread[Task worker for ':' Thread 2,5,main]) started.

> Task :release:compileGroovy FROM-CACHE
Build cache key for task ':release:compileGroovy' is 8963864c41ecab4c189a270fa94436aa
Task ':release:compileGroovy' is not up-to-date because:
  No history is available.
Origin for task ':release:compileGroovy': {executionTime=2052, hostName=apache-beam-jenkins-slave-group-51fn, operatingSystem=Linux, buildInvocationId=egdu4ymrovdqpefkmescupbfhu, creationTime=1533629360360, type=org.gradle.api.tasks.compile.GroovyCompile_Decorated, userName=jenkins, gradleVersion=4.8, rootPath=<https://builds.apache.org/job/beam_Release_Gradle_NightlySnapshot/ws/src,> path=:release:compileGroovy}
Unpacked output for task ':release:compileGroovy' from cache.
:release:compileGroovy (Thread[Task worker for ':' Thread 2,5,main]) completed. Took 0.399 secs.
:release:processResources (Thread[Task worker for ':' Thread 2,5,main]) started.

> Task :release:processResources NO-SOURCE
file or directory '<https://builds.apache.org/job/beam_Release_Gradle_NightlySnapshot/ws/src/release/src/main/resources',> not found
Skipping task ':release:processResources' as it has no source files and no previous output files.
:release:processResources (Thread[Task worker for ':' Thread 2,5,main]) completed. Took 0.01 secs.
:release:classes (Thread[Task worker for ':' Thread 2,5,main]) started.

> Task :release:classes UP-TO-DATE
Skipping task ':release:classes' as it has no actions.
:release:classes (Thread[Task worker for ':' Thread 2,5,main]) completed. Took 0.0 secs.
:release:jar (Thread[Task worker for ':' Thread 5,5,main]) started.

> Task :release:jar
Build cache key for task ':release:jar' is f2db96afb021a5cc9e6914be6de059db
Caching disabled for task ':release:jar': Caching has not been enabled for the task
Task ':release:jar' is not up-to-date because:
  No history is available.
:release:jar (Thread[Task worker for ':' Thread 5,5,main]) completed. Took 0.01 secs.
:release:assemble (Thread[Task worker for ':' Thread 5,5,main]) started.

> Task :release:assemble
Skipping task ':release:assemble' as it has no actions.
:release:assemble (Thread[Task worker for ':' Thread 5,5,main]) completed. Took 0.0 secs.
:release:compileTestJava (Thread[Task worker for ':' Thread 5,5,main]) started.

> Task :release:compileTestJava NO-SOURCE
file or directory '<https://builds.apache.org/job/beam_Release_Gradle_NightlySnapshot/ws/src/release/src/test/java',> not found
Skipping task ':release:compileTestJava' as it has no source files and no previous output files.
:release:compileTestJava (Thread[Task worker for ':' Thread 5,5,main]) completed. Took 0.001 secs.
:release:compileTestGroovy (Thread[Task worker for ':' Thread 5,5,main]) started.

> Task :release:compileTestGroovy NO-SOURCE
file or directory '<https://builds.apache.org/job/beam_Release_Gradle_NightlySnapshot/ws/src/release/src/test/groovy',> not found
Skipping task ':release:compileTestGroovy' as it has no source files and no previous output files.
:release:compileTestGroovy (Thread[Task worker for ':' Thread 5,5,main]) completed. Took 0.0 secs.
:release:processTestResources (Thread[Task worker for ':' Thread 5,5,main]) started.

> Task :release:processTestResources NO-SOURCE
file or directory '<https://builds.apache.org/job/beam_Release_Gradle_NightlySnapshot/ws/src/release/src/test/resources',> not found
Skipping task ':release:processTestResources' as it has no source files and no previous output files.
:release:processTestResources (Thread[Task worker for ':' Thread 5,5,main]) completed. Took 0.0 secs.
:release:testClasses (Thread[Task worker for ':' Thread 5,5,main]) started.

> Task :release:testClasses UP-TO-DATE
Skipping task ':release:testClasses' as it has no actions.
:release:testClasses (Thread[Task worker for ':' Thread 5,5,main]) completed. Took 0.0 secs.
:release:test (Thread[Task worker for ':' Thread 5,5,main]) started.

> Task :release:test NO-SOURCE
Skipping task ':release:test' as it has no source files and no previous output files.
:release:test (Thread[Task worker for ':' Thread 5,5,main]) completed. Took 0.001 secs.
:release:check (Thread[Task worker for ':' Thread 5,5,main]) started.

> Task :release:check UP-TO-DATE
Skipping task ':release:check' as it has no actions.
:release:check (Thread[Task worker for ':' Thread 5,5,main]) completed. Took 0.0 secs.
:release:build (Thread[Task worker for ':' Thread 11,5,main]) started.

> Task :release:build
Skipping task ':release:build' as it has no actions.
:release:build (Thread[Task worker for ':' Thread 11,5,main]) completed. Took 0.0 secs.

FAILURE: Build failed with an exception.

* What went wrong:
Execution failed for task ':beam-website:testWebsite'.
> Process 'command 'docker'' finished with non-zero exit value 1

* Try:
Run with --stacktrace option to get the stack trace. Run with --debug option to get more log output. Run with --scan to get full insights.

* Get more help at https://help.gradle.org

Deprecated Gradle features were used in this build, making it incompatible with Gradle 5.0.
See https://docs.gradle.org/4.8/userguide/command_line_interface.html#sec:command_line_warnings

BUILD FAILED in 1h 2m 36s
812 actionable tasks: 805 executed, 7 from cache

Publishing build scan...
https://gradle.com/s/uxb6mdigqj4n4

Build step 'Invoke Gradle script' changed build result to FAILURE
Build step 'Invoke Gradle script' marked build as failure