OSDir


[Date Prev][Date Next][Thread Prev][Thread Next][Date Index][Thread Index]

Build failed in Jenkins: beam_Release_Gradle_NightlySnapshot #131


See <https://builds.apache.org/job/beam_Release_Gradle_NightlySnapshot/131/display/redirect?page=changes>

Changes:

[yifanzou] [BEAM-4963] update org.apache.httpcomponents

[amaliujia] BEAM-4808: add e2e test for BeamSqlLine.

[garrettjonesgoogle] Switching to correct datastore proto package

[yifanzou] [BEAM-4906] upgrade org.apache.derby

[relax] Add Select and Filter transforms for schema types.

[relax] Add missing Experimental flag.

[chamikara] [Beam-4687]Automate JIRA for Dependency check (#6060)

[aaltay] Automate "Build a release candidate" step (#6059)

[apilloud] [BEAM-4804] Use beam-perf label for local perf tests

[gleb] [BEAM-5056] [SQL] Fix nullability in output schema

[valentyn] Use the same language semantics as defined by version of the interpreter

[relax] Address code-review comments.

[aaltay] [BEAM-4006] Futurize transforms subpackage (#5729)

[apilloud] [BEAM-4761] Run Nexmark in thread pool

[aaltay] Automate "Run validation tests" step (#6081)

[apilloud] [BEAM-4761] Handle skipped tests in parallel Nexmark

------------------------------------------
[...truncated 18.13 MB...]
Task ':beam-sdks-python-container:prepare' is not up-to-date because:
  Task has not declared any outputs despite executing actions.
Use project GOPATH: <https://builds.apache.org/job/beam_Release_Gradle_NightlySnapshot/ws/src/sdks/python/container/.gogradle/project_gopath>
:beam-sdks-python-container:prepare (Thread[Task worker for ':' Thread 10,5,main]) completed. Took 0.001 secs.
:beam-sdks-python-container:resolveBuildDependencies (Thread[Task worker for ':' Thread 10,5,main]) started.

> Task :beam-sdks-python-container:resolveBuildDependencies
Build cache key for task ':beam-sdks-python-container:resolveBuildDependencies' is 8b9b155163bbd49020994445c942671f
Caching disabled for task ':beam-sdks-python-container:resolveBuildDependencies': Caching has not been enabled for the task
Task ':beam-sdks-python-container:resolveBuildDependencies' is not up-to-date because:
  No history is available.
Cache <https://builds.apache.org/job/beam_Release_Gradle_NightlySnapshot/ws/src/sdks/python/container/.gogradle/cache/PersistenceNotationToResolvedCache-0.10.bin> not found, skip.
Cache <https://builds.apache.org/job/beam_Release_Gradle_NightlySnapshot/ws/src/sdks/python/container/.gogradle/cache/PersistenceResolvedToDependenciesCache-0.10.bin> not found, skip.
Resolving ./github.com/apache/beam/sdks/go@<https://builds.apache.org/job/beam_Release_Gradle_NightlySnapshot/ws/src/sdks/go>
:beam-sdks-python-container:resolveBuildDependencies (Thread[Task worker for ':' Thread 10,5,main]) completed. Took 2.879 secs.
:beam-sdks-python-container:installDependencies (Thread[Task worker for ':' Thread 10,5,main]) started.

> Task :beam-sdks-python-container:installDependencies
Caching disabled for task ':beam-sdks-python-container:installDependencies': Caching has not been enabled for the task
Task ':beam-sdks-python-container:installDependencies' is not up-to-date because:
  Task has not declared any outputs despite executing actions.
Cache <https://builds.apache.org/job/beam_Release_Gradle_NightlySnapshot/ws/src/sdks/python/container/.gogradle/cache/VendorSnapshot-0.10.bin> not found, skip.
:beam-sdks-python-container:installDependencies (Thread[Task worker for ':' Thread 10,5,main]) completed. Took 0.571 secs.
:beam-sdks-python-container:buildLinuxAmd64 (Thread[Task worker for ':' Thread 10,5,main]) started.

> Task :beam-sdks-python-container:buildLinuxAmd64
Build cache key for task ':beam-sdks-python-container:buildLinuxAmd64' is 96a676bb2799e7ccf5f31a42c61a6b8a
Caching disabled for task ':beam-sdks-python-container:buildLinuxAmd64': Caching has not been enabled for the task
Task ':beam-sdks-python-container:buildLinuxAmd64' is not up-to-date because:
  No history is available.
:beam-sdks-python-container:buildLinuxAmd64 (Thread[Task worker for ':' Thread 10,5,main]) completed. Took 2.719 secs.
:beam-sdks-python-container:build (Thread[Task worker for ':' Thread 10,5,main]) started.

> Task :beam-sdks-python-container:build
Caching disabled for task ':beam-sdks-python-container:build': Caching has not been enabled for the task
Task ':beam-sdks-python-container:build' is not up-to-date because:
  Task has not declared any outputs despite executing actions.
:beam-sdks-python-container:build (Thread[Task worker for ':' Thread 10,5,main]) completed. Took 0.002 secs.
:beam-vendor-sdks-java-extensions-protobuf:jar (Thread[Task worker for ':' Thread 10,5,main]) started.

> Task :beam-vendor-sdks-java-extensions-protobuf:jar
Build cache key for task ':beam-vendor-sdks-java-extensions-protobuf:jar' is 318184f3acfe150a3a38d605826c992a
Caching disabled for task ':beam-vendor-sdks-java-extensions-protobuf:jar': Caching has not been enabled for the task
Task ':beam-vendor-sdks-java-extensions-protobuf:jar' is not up-to-date because:
  No history is available.
:beam-vendor-sdks-java-extensions-protobuf:jar (Thread[Task worker for ':' Thread 10,5,main]) completed. Took 0.007 secs.
:beam-vendor-sdks-java-extensions-protobuf:compileTestJava (Thread[Task worker for ':' Thread 10,5,main]) started.

> Task :beam-vendor-sdks-java-extensions-protobuf:compileTestJava NO-SOURCE
file or directory '<https://builds.apache.org/job/beam_Release_Gradle_NightlySnapshot/ws/src/vendor/sdks-java-extensions-protobuf/src/test/java',> not found
Skipping task ':beam-vendor-sdks-java-extensions-protobuf:compileTestJava' as it has no source files and no previous output files.
:beam-vendor-sdks-java-extensions-protobuf:compileTestJava (Thread[Task worker for ':' Thread 10,5,main]) completed. Took 0.0 secs.
:beam-vendor-sdks-java-extensions-protobuf:processTestResources (Thread[Task worker for ':' Thread 10,5,main]) started.

> Task :beam-vendor-sdks-java-extensions-protobuf:processTestResources NO-SOURCE
file or directory '<https://builds.apache.org/job/beam_Release_Gradle_NightlySnapshot/ws/src/vendor/sdks-java-extensions-protobuf/src/test/resources',> not found
Skipping task ':beam-vendor-sdks-java-extensions-protobuf:processTestResources' as it has no source files and no previous output files.
:beam-vendor-sdks-java-extensions-protobuf:processTestResources (Thread[Task worker for ':' Thread 10,5,main]) completed. Took 0.0 secs.
:beam-vendor-sdks-java-extensions-protobuf:testClasses (Thread[Task worker for ':' Thread 10,5,main]) started.

> Task :beam-vendor-sdks-java-extensions-protobuf:testClasses UP-TO-DATE
Skipping task ':beam-vendor-sdks-java-extensions-protobuf:testClasses' as it has no actions.
:beam-vendor-sdks-java-extensions-protobuf:testClasses (Thread[Task worker for ':' Thread 10,5,main]) completed. Took 0.0 secs.
:beam-vendor-sdks-java-extensions-protobuf:packageTests (Thread[Task worker for ':' Thread 10,5,main]) started.

> Task :beam-vendor-sdks-java-extensions-protobuf:packageTests
Build cache key for task ':beam-vendor-sdks-java-extensions-protobuf:packageTests' is 725c57f0b1c0d6e4c572de9d9db06024
Caching disabled for task ':beam-vendor-sdks-java-extensions-protobuf:packageTests': Caching has not been enabled for the task
Task ':beam-vendor-sdks-java-extensions-protobuf:packageTests' is not up-to-date because:
  No history is available.
:beam-vendor-sdks-java-extensions-protobuf:packageTests (Thread[Task worker for ':' Thread 10,5,main]) completed. Took 0.002 secs.
:beam-vendor-sdks-java-extensions-protobuf:assemble (Thread[Task worker for ':' Thread 10,5,main]) started.

> Task :beam-vendor-sdks-java-extensions-protobuf:assemble
Skipping task ':beam-vendor-sdks-java-extensions-protobuf:assemble' as it has no actions.
:beam-vendor-sdks-java-extensions-protobuf:assemble (Thread[Task worker for ':' Thread 10,5,main]) completed. Took 0.0 secs.
:beam-vendor-sdks-java-extensions-protobuf:checkstyleMain (Thread[Task worker for ':' Thread 10,5,main]) started.

> Task :beam-vendor-sdks-java-extensions-protobuf:checkstyleMain NO-SOURCE
file or directory '<https://builds.apache.org/job/beam_Release_Gradle_NightlySnapshot/ws/src/vendor/sdks-java-extensions-protobuf/src/main/java',> not found
Skipping task ':beam-vendor-sdks-java-extensions-protobuf:checkstyleMain' as it has no source files and no previous output files.
:beam-vendor-sdks-java-extensions-protobuf:checkstyleMain (Thread[Task worker for ':' Thread 10,5,main]) completed. Took 0.0 secs.
:beam-vendor-sdks-java-extensions-protobuf:checkstyleTest (Thread[Task worker for ':' Thread 10,5,main]) started.

> Task :beam-vendor-sdks-java-extensions-protobuf:checkstyleTest NO-SOURCE
file or directory '<https://builds.apache.org/job/beam_Release_Gradle_NightlySnapshot/ws/src/vendor/sdks-java-extensions-protobuf/src/test/java',> not found
Skipping task ':beam-vendor-sdks-java-extensions-protobuf:checkstyleTest' as it has no source files and no previous output files.
:beam-vendor-sdks-java-extensions-protobuf:checkstyleTest (Thread[Task worker for ':' Thread 10,5,main]) completed. Took 0.0 secs.
:beam-vendor-sdks-java-extensions-protobuf:findbugsMain (Thread[Task worker for ':' Thread 10,5,main]) started.
Initialized native services in: /home/jenkins/.gradle/native

> Task :beam-vendor-sdks-java-extensions-protobuf:findbugsMain
file or directory '<https://builds.apache.org/job/beam_Release_Gradle_NightlySnapshot/ws/src/vendor/sdks-java-extensions-protobuf/src/main/java',> not found
Build cache key for task ':beam-vendor-sdks-java-extensions-protobuf:findbugsMain' is f85e9d0a359bd9cedef17c8bef6d5d5e
Task ':beam-vendor-sdks-java-extensions-protobuf:findbugsMain' is not up-to-date because:
  No history is available.
file or directory '<https://builds.apache.org/job/beam_Release_Gradle_NightlySnapshot/ws/src/vendor/sdks-java-extensions-protobuf/src/main/java',> not found
Starting process 'Gradle FindBugs Worker 126'. Working directory: <https://builds.apache.org/job/beam_Release_Gradle_NightlySnapshot/ws/src/vendor/sdks-java-extensions-protobuf> Command: /usr/local/asfpackages/java/jdk1.8.0_152/bin/java -Djava.security.manager=worker.org.gradle.process.internal.worker.child.BootstrapSecurityManager -Dfile.encoding=UTF-8 -Duser.country=US -Duser.language=en -Duser.variant -cp /home/jenkins/.gradle/caches/4.8/workerMain/gradle-worker.jar worker.org.gradle.process.internal.worker.GradleWorkerMain 'Gradle FindBugs Worker 126'
Successfully started process 'Gradle FindBugs Worker 126'
Packing task ':beam-vendor-sdks-java-extensions-protobuf:findbugsMain'
:beam-vendor-sdks-java-extensions-protobuf:findbugsMain (Thread[Task worker for ':' Thread 10,5,main]) completed. Took 4.232 secs.
:beam-vendor-sdks-java-extensions-protobuf:spotlessJava (Thread[Task worker for ':' Thread 10,5,main]) started.

> Task :beam-vendor-sdks-java-extensions-protobuf:spotlessJava
file or directory '<https://builds.apache.org/job/beam_Release_Gradle_NightlySnapshot/ws/src/vendor/sdks-java-extensions-protobuf/src/main/java',> not found
file or directory '<https://builds.apache.org/job/beam_Release_Gradle_NightlySnapshot/ws/src/vendor/sdks-java-extensions-protobuf/src/test/java',> not found
file or directory '<https://builds.apache.org/job/beam_Release_Gradle_NightlySnapshot/ws/src/vendor/sdks-java-extensions-protobuf/src/main/java',> not found
file or directory '<https://builds.apache.org/job/beam_Release_Gradle_NightlySnapshot/ws/src/vendor/sdks-java-extensions-protobuf/src/test/java',> not found
file or directory '<https://builds.apache.org/job/beam_Release_Gradle_NightlySnapshot/ws/src/vendor/sdks-java-extensions-protobuf/src/main/java',> not found
file or directory '<https://builds.apache.org/job/beam_Release_Gradle_NightlySnapshot/ws/src/vendor/sdks-java-extensions-protobuf/src/test/java',> not found
Caching disabled for task ':beam-vendor-sdks-java-extensions-protobuf:spotlessJava': Caching has not been enabled for the task
Task ':beam-vendor-sdks-java-extensions-protobuf:spotlessJava' is not up-to-date because:
  No history is available.
All input files are considered out-of-date for incremental task ':beam-vendor-sdks-java-extensions-protobuf:spotlessJava'.
file or directory '<https://builds.apache.org/job/beam_Release_Gradle_NightlySnapshot/ws/src/vendor/sdks-java-extensions-protobuf/src/main/java',> not found
file or directory '<https://builds.apache.org/job/beam_Release_Gradle_NightlySnapshot/ws/src/vendor/sdks-java-extensions-protobuf/src/test/java',> not found
:beam-vendor-sdks-java-extensions-protobuf:spotlessJava (Thread[Task worker for ':' Thread 10,5,main]) completed. Took 0.006 secs.
:beam-vendor-sdks-java-extensions-protobuf:spotlessJavaCheck (Thread[Task worker for ':' Thread 10,5,main]) started.

> Task :beam-vendor-sdks-java-extensions-protobuf:spotlessJavaCheck
Skipping task ':beam-vendor-sdks-java-extensions-protobuf:spotlessJavaCheck' as it has no actions.
:beam-vendor-sdks-java-extensions-protobuf:spotlessJavaCheck (Thread[Task worker for ':' Thread 10,5,main]) completed. Took 0.0 secs.
:beam-vendor-sdks-java-extensions-protobuf:spotlessCheck (Thread[Task worker for ':' Thread 10,5,main]) started.

> Task :beam-vendor-sdks-java-extensions-protobuf:spotlessCheck
Skipping task ':beam-vendor-sdks-java-extensions-protobuf:spotlessCheck' as it has no actions.
:beam-vendor-sdks-java-extensions-protobuf:spotlessCheck (Thread[Task worker for ':' Thread 10,5,main]) completed. Took 0.0 secs.
:beam-vendor-sdks-java-extensions-protobuf:test (Thread[Task worker for ':' Thread 7,5,main]) started.

> Task :beam-vendor-sdks-java-extensions-protobuf:test NO-SOURCE
Skipping task ':beam-vendor-sdks-java-extensions-protobuf:test' as it has no source files and no previous output files.
:beam-vendor-sdks-java-extensions-protobuf:test (Thread[Task worker for ':' Thread 7,5,main]) completed. Took 0.001 secs.
:beam-vendor-sdks-java-extensions-protobuf:validateShadedJarDoesntLeakNonOrgApacheBeamClasses (Thread[Task worker for ':' Thread 7,5,main]) started.

> Task :beam-vendor-sdks-java-extensions-protobuf:validateShadedJarDoesntLeakNonOrgApacheBeamClasses
Caching disabled for task ':beam-vendor-sdks-java-extensions-protobuf:validateShadedJarDoesntLeakNonOrgApacheBeamClasses': Caching has not been enabled for the task
Task ':beam-vendor-sdks-java-extensions-protobuf:validateShadedJarDoesntLeakNonOrgApacheBeamClasses' is not up-to-date because:
  Task has not declared any outputs despite executing actions.
:beam-vendor-sdks-java-extensions-protobuf:validateShadedJarDoesntLeakNonOrgApacheBeamClasses (Thread[Task worker for ':' Thread 7,5,main]) completed. Took 0.034 secs.
:beam-vendor-sdks-java-extensions-protobuf:check (Thread[Task worker for ':' Thread 7,5,main]) started.

> Task :beam-vendor-sdks-java-extensions-protobuf:check
Skipping task ':beam-vendor-sdks-java-extensions-protobuf:check' as it has no actions.
:beam-vendor-sdks-java-extensions-protobuf:check (Thread[Task worker for ':' Thread 7,5,main]) completed. Took 0.0 secs.
:beam-vendor-sdks-java-extensions-protobuf:build (Thread[Task worker for ':' Thread 7,5,main]) started.

> Task :beam-vendor-sdks-java-extensions-protobuf:build
Skipping task ':beam-vendor-sdks-java-extensions-protobuf:build' as it has no actions.
:beam-vendor-sdks-java-extensions-protobuf:build (Thread[Task worker for ':' Thread 7,5,main]) completed. Took 0.0 secs.
:release:compileJava (Thread[Task worker for ':' Thread 7,5,main]) started.

> Task :release:compileJava NO-SOURCE
file or directory '<https://builds.apache.org/job/beam_Release_Gradle_NightlySnapshot/ws/src/release/src/main/java',> not found
Skipping task ':release:compileJava' as it has no source files and no previous output files.
:release:compileJava (Thread[Task worker for ':' Thread 7,5,main]) completed. Took 0.001 secs.
:release:compileGroovy (Thread[Task worker for ':' Thread 7,5,main]) started.

> Task :release:compileGroovy FROM-CACHE
Build cache key for task ':release:compileGroovy' is 1160ddfbb47f6d8955e60c5704500912
Task ':release:compileGroovy' is not up-to-date because:
  No history is available.
Origin for task ':release:compileGroovy': {executionTime=1744, hostName=apache-beam-jenkins-slave-group-51fn, operatingSystem=Linux, buildInvocationId=zefj6tdiv5hqnambgh6m5tqrca, creationTime=1532591760309, type=org.gradle.api.tasks.compile.GroovyCompile_Decorated, userName=jenkins, gradleVersion=4.8, rootPath=<https://builds.apache.org/job/beam_Release_Gradle_NightlySnapshot/ws/src,> path=:release:compileGroovy}
Unpacked output for task ':release:compileGroovy' from cache.
:release:compileGroovy (Thread[Task worker for ':' Thread 7,5,main]) completed. Took 0.272 secs.
:release:processResources (Thread[Task worker for ':' Thread 7,5,main]) started.

> Task :release:processResources NO-SOURCE
file or directory '<https://builds.apache.org/job/beam_Release_Gradle_NightlySnapshot/ws/src/release/src/main/resources',> not found
Skipping task ':release:processResources' as it has no source files and no previous output files.
:release:processResources (Thread[Task worker for ':' Thread 7,5,main]) completed. Took 0.0 secs.
:release:classes (Thread[Task worker for ':' Thread 7,5,main]) started.

> Task :release:classes UP-TO-DATE
Skipping task ':release:classes' as it has no actions.
:release:classes (Thread[Task worker for ':' Thread 7,5,main]) completed. Took 0.0 secs.
:release:jar (Thread[Task worker for ':' Thread 7,5,main]) started.

> Task :release:jar
Build cache key for task ':release:jar' is e09f897523febc393828e611e2b99100
Caching disabled for task ':release:jar': Caching has not been enabled for the task
Task ':release:jar' is not up-to-date because:
  No history is available.
:release:jar (Thread[Task worker for ':' Thread 7,5,main]) completed. Took 0.009 secs.
:release:assemble (Thread[Task worker for ':' Thread 7,5,main]) started.

> Task :release:assemble
Skipping task ':release:assemble' as it has no actions.
:release:assemble (Thread[Task worker for ':' Thread 7,5,main]) completed. Took 0.0 secs.
:release:compileTestJava (Thread[Task worker for ':' Thread 7,5,main]) started.

> Task :release:compileTestJava NO-SOURCE
file or directory '<https://builds.apache.org/job/beam_Release_Gradle_NightlySnapshot/ws/src/release/src/test/java',> not found
Skipping task ':release:compileTestJava' as it has no source files and no previous output files.
:release:compileTestJava (Thread[Task worker for ':' Thread 7,5,main]) completed. Took 0.0 secs.
:release:compileTestGroovy (Thread[Task worker for ':' Thread 7,5,main]) started.

> Task :release:compileTestGroovy NO-SOURCE
file or directory '<https://builds.apache.org/job/beam_Release_Gradle_NightlySnapshot/ws/src/release/src/test/groovy',> not found
Skipping task ':release:compileTestGroovy' as it has no source files and no previous output files.
:release:compileTestGroovy (Thread[Task worker for ':' Thread 7,5,main]) completed. Took 0.0 secs.
:release:processTestResources (Thread[Task worker for ':' Thread 7,5,main]) started.

> Task :release:processTestResources NO-SOURCE
file or directory '<https://builds.apache.org/job/beam_Release_Gradle_NightlySnapshot/ws/src/release/src/test/resources',> not found
Skipping task ':release:processTestResources' as it has no source files and no previous output files.
:release:processTestResources (Thread[Task worker for ':' Thread 7,5,main]) completed. Took 0.0 secs.
:release:testClasses (Thread[Task worker for ':' Thread 7,5,main]) started.

> Task :release:testClasses UP-TO-DATE
Skipping task ':release:testClasses' as it has no actions.
:release:testClasses (Thread[Task worker for ':' Thread 7,5,main]) completed. Took 0.0 secs.
:release:test (Thread[Task worker for ':' Thread 7,5,main]) started.

> Task :release:test NO-SOURCE
Skipping task ':release:test' as it has no source files and no previous output files.
:release:test (Thread[Task worker for ':' Thread 7,5,main]) completed. Took 0.0 secs.
:release:check (Thread[Task worker for ':' Thread 7,5,main]) started.

> Task :release:check UP-TO-DATE
Skipping task ':release:check' as it has no actions.
:release:check (Thread[Task worker for ':' Thread 7,5,main]) completed. Took 0.0 secs.
:release:build (Thread[Task worker for ':' Thread 7,5,main]) started.

> Task :release:build
Skipping task ':release:build' as it has no actions.
:release:build (Thread[Task worker for ':' Thread 7,5,main]) completed. Took 0.0 secs.

FAILURE: Build failed with an exception.

* What went wrong:
Execution failed for task ':beam-sdks-java-nexmark:test'.
> There were failing tests. See the report at: file://<https://builds.apache.org/job/beam_Release_Gradle_NightlySnapshot/ws/src/sdks/java/nexmark/build/reports/tests/test/index.html>

* Try:
Run with --stacktrace option to get the stack trace. Run with --debug option to get more log output. Run with --scan to get full insights.

* Get more help at https://help.gradle.org

Deprecated Gradle features were used in this build, making it incompatible with Gradle 5.0.
See https://docs.gradle.org/4.8/userguide/command_line_interface.html#sec:command_line_warnings

BUILD FAILED in 1h 6m 17s
756 actionable tasks: 750 executed, 6 from cache

Publishing build scan...
https://gradle.com/s/7qtslax3gufnw

Build step 'Invoke Gradle script' changed build result to FAILURE
Build step 'Invoke Gradle script' marked build as failure