OSDir


[Date Prev][Date Next][Thread Prev][Thread Next][Date Index][Thread Index]

Build failed in Jenkins: beam_Release_Gradle_NightlySnapshot #127


See <https://builds.apache.org/job/beam_Release_Gradle_NightlySnapshot/127/display/redirect?page=changes>

Changes:

[github] [BEAM-4852] Only read symbol table when required.

[github] Update symbols.go

[github] Don't rely on order of elements in a PCollection after GBK in

[devinduan] Spelling mistakes

[rober] Avoid overwritting user changes to Resolver

[rober] Clean up deferedResolver

[pablo] Fix scheduling for jobs

[relax] Add convenience methods for pojo and javabean schema registration.

[relax] Address code-review comments.

------------------------------------------
[...truncated 18.85 MB...]

> Task :beam-sdks-java-maven-archetypes-starter:processTestResources UP-TO-DATE
Build cache key for task ':beam-sdks-java-maven-archetypes-starter:processTestResources' is f74f3200edf284b276c50da93794d928
Caching disabled for task ':beam-sdks-java-maven-archetypes-starter:processTestResources': Caching has not been enabled for the task
Skipping task ':beam-sdks-java-maven-archetypes-starter:processTestResources' as it is up-to-date.
:beam-sdks-java-maven-archetypes-starter:processTestResources (Thread[Daemon worker,5,main]) completed. Took 0.002 secs.
:beam-sdks-java-maven-archetypes-starter:testClasses (Thread[Daemon worker,5,main]) started.

> Task :beam-sdks-java-maven-archetypes-starter:testClasses UP-TO-DATE
Skipping task ':beam-sdks-java-maven-archetypes-starter:testClasses' as it has no actions.
:beam-sdks-java-maven-archetypes-starter:testClasses (Thread[Daemon worker,5,main]) completed. Took 0.0 secs.
:beam-sdks-java-maven-archetypes-starter:shadowTestJar (Thread[Task worker for ':',5,main]) started.

> Task :beam-sdks-java-maven-archetypes-starter:shadowTestJar
Build cache key for task ':beam-sdks-java-maven-archetypes-starter:shadowTestJar' is df2c278f7c412c8cac98a11ccfcec622
Caching disabled for task ':beam-sdks-java-maven-archetypes-starter:shadowTestJar': Caching has not been enabled for the task
Task ':beam-sdks-java-maven-archetypes-starter:shadowTestJar' is not up-to-date because:
  No history is available.
*******************
GRADLE SHADOW STATS

Total Jars: 1 (includes project)
Total Time: 0.0s [0ms]
Average Time/Jar: 0.0s [0.0ms]
*******************
:beam-sdks-java-maven-archetypes-starter:shadowTestJar (Thread[Task worker for ':',5,main]) completed. Took 0.007 secs.
:beam-sdks-java-maven-archetypes-starter:sourcesJar (Thread[Task worker for ':',5,main]) started.

> Task :beam-sdks-java-maven-archetypes-starter:sourcesJar
file or directory '<https://builds.apache.org/job/beam_Release_Gradle_NightlySnapshot/ws/src/sdks/java/maven-archetypes/starter/src/main/java',> not found
Build cache key for task ':beam-sdks-java-maven-archetypes-starter:sourcesJar' is a106f15937cacfee668e25636b705e03
Caching disabled for task ':beam-sdks-java-maven-archetypes-starter:sourcesJar': Caching has not been enabled for the task
Task ':beam-sdks-java-maven-archetypes-starter:sourcesJar' is not up-to-date because:
  No history is available.
file or directory '<https://builds.apache.org/job/beam_Release_Gradle_NightlySnapshot/ws/src/sdks/java/maven-archetypes/starter/src/main/java',> not found
:beam-sdks-java-maven-archetypes-starter:sourcesJar (Thread[Task worker for ':',5,main]) completed. Took 0.003 secs.
:beam-sdks-java-maven-archetypes-starter:testSourcesJar (Thread[Task worker for ':',5,main]) started.

> Task :beam-sdks-java-maven-archetypes-starter:testSourcesJar
file or directory '<https://builds.apache.org/job/beam_Release_Gradle_NightlySnapshot/ws/src/sdks/java/maven-archetypes/starter/src/test/java',> not found
Build cache key for task ':beam-sdks-java-maven-archetypes-starter:testSourcesJar' is 58715d6b8e221cace68f230ccfd69fd4
Caching disabled for task ':beam-sdks-java-maven-archetypes-starter:testSourcesJar': Caching has not been enabled for the task
Task ':beam-sdks-java-maven-archetypes-starter:testSourcesJar' is not up-to-date because:
  No history is available.
file or directory '<https://builds.apache.org/job/beam_Release_Gradle_NightlySnapshot/ws/src/sdks/java/maven-archetypes/starter/src/test/java',> not found
:beam-sdks-java-maven-archetypes-starter:testSourcesJar (Thread[Task worker for ':',5,main]) completed. Took 0.003 secs.
:beam-sdks-java-nexmark:generatePomFileForMavenJavaPublication (Thread[Task worker for ':',5,main]) started.

> Task :beam-sdks-java-nexmark:generatePomFileForMavenJavaPublication
Build cache key for task ':beam-sdks-java-nexmark:generatePomFileForMavenJavaPublication' is e88836a5bca732f78522d2de5a70d4e6
Caching disabled for task ':beam-sdks-java-nexmark:generatePomFileForMavenJavaPublication': Caching has not been enabled for the task
Task ':beam-sdks-java-nexmark:generatePomFileForMavenJavaPublication' is not up-to-date because:
  Task.upToDateWhen is false.
:beam-sdks-java-nexmark:generatePomFileForMavenJavaPublication (Thread[Task worker for ':',5,main]) completed. Took 0.008 secs.
:beam-sdks-java-nexmark:compileJava (Thread[Task worker for ':',5,main]) started.

> Task :beam-sdks-java-nexmark:compileJava
Build cache key for task ':beam-sdks-java-nexmark:compileJava' is f05c9faf98e1ef70f9828f50b995d553
Task ':beam-sdks-java-nexmark:compileJava' is not up-to-date because:
  Input property 'effectiveAnnotationProcessorPath' file <https://builds.apache.org/job/beam_Release_Gradle_NightlySnapshot/ws/src/sdks/java/io/google-cloud-platform/build/libs/beam-sdks-java-io-google-cloud-platform-2.7.0-SNAPSHOT.jar> has changed.
  Input property 'effectiveAnnotationProcessorPath' file <https://builds.apache.org/job/beam_Release_Gradle_NightlySnapshot/ws/src/sdks/java/extensions/google-cloud-platform-core/build/libs/beam-sdks-java-extensions-google-cloud-platform-core-2.7.0-SNAPSHOT.jar> has changed.
  Input property 'effectiveAnnotationProcessorPath' file <https://builds.apache.org/job/beam_Release_Gradle_NightlySnapshot/ws/src/sdks/java/extensions/sql/build/libs/beam-sdks-java-extensions-sql-2.7.0-SNAPSHOT.jar> has changed.
Custom actions are attached to task ':beam-sdks-java-nexmark:compileJava'.
Compiling with error-prone compiler
Note: Some input files use or override a deprecated API.
Note: Recompile with -Xlint:deprecation for details.
Note: Some input files use unchecked or unsafe operations.
Note: Recompile with -Xlint:unchecked for details.
Packing task ':beam-sdks-java-nexmark:compileJava'
:beam-sdks-java-nexmark:compileJava (Thread[Task worker for ':',5,main]) completed. Took 7.418 secs.
:beam-sdks-java-nexmark:processResources (Thread[Task worker for ':',5,main]) started.

> Task :beam-sdks-java-nexmark:processResources UP-TO-DATE
Build cache key for task ':beam-sdks-java-nexmark:processResources' is 5ee84f86d63f1ec7e0c47792990c7e88
Caching disabled for task ':beam-sdks-java-nexmark:processResources': Caching has not been enabled for the task
Skipping task ':beam-sdks-java-nexmark:processResources' as it is up-to-date.
:beam-sdks-java-nexmark:processResources (Thread[Task worker for ':',5,main]) completed. Took 0.002 secs.
:beam-sdks-java-nexmark:classes (Thread[Task worker for ':',5,main]) started.

> Task :beam-sdks-java-nexmark:classes
Skipping task ':beam-sdks-java-nexmark:classes' as it has no actions.
:beam-sdks-java-nexmark:classes (Thread[Task worker for ':',5,main]) completed. Took 0.0 secs.
:beam-sdks-java-nexmark:generatePomPropertiesFileForMavenJavaPublication (Thread[Task worker for ':',5,main]) started.

> Task :beam-sdks-java-nexmark:generatePomPropertiesFileForMavenJavaPublication
Build cache key for task ':beam-sdks-java-nexmark:generatePomPropertiesFileForMavenJavaPublication' is 016e6d816729dcec17aad81233a35f45
Caching disabled for task ':beam-sdks-java-nexmark:generatePomPropertiesFileForMavenJavaPublication': Caching has not been enabled for the task
Task ':beam-sdks-java-nexmark:generatePomPropertiesFileForMavenJavaPublication' is not up-to-date because:
  No history is available.
:beam-sdks-java-nexmark:generatePomPropertiesFileForMavenJavaPublication (Thread[Task worker for ':',5,main]) completed. Took 0.001 secs.
:beam-sdks-java-nexmark:shadowJar (Thread[Task worker for ':',5,main]) started.

> Task :beam-sdks-java-nexmark:shadowJar
Build cache key for task ':beam-sdks-java-nexmark:shadowJar' is 74b3759260dd535ffa88a7b7331ae290
Caching disabled for task ':beam-sdks-java-nexmark:shadowJar': Caching has not been enabled for the task
Task ':beam-sdks-java-nexmark:shadowJar' is not up-to-date because:
  Input property 'rootSpec$1$2.caseSensitive' has been added for task ':beam-sdks-java-nexmark:shadowJar'
  Input property 'rootSpec$1$2.destPath' has been added for task ':beam-sdks-java-nexmark:shadowJar'
  Input property 'rootSpec$1$2.dirMode' has been added for task ':beam-sdks-java-nexmark:shadowJar'
*******************
GRADLE SHADOW STATS

Total Jars: 2 (includes project)
Total Time: 1.969s [1969ms]
Average Time/Jar: 0.9845s [984.5ms]
*******************
:beam-sdks-java-nexmark:shadowJar (Thread[Task worker for ':',5,main]) completed. Took 2.221 secs.
:beam-sdks-java-nexmark:compileTestJava (Thread[Task worker for ':',5,main]) started.

> Task :beam-sdks-java-nexmark:compileTestJava
Build cache key for task ':beam-sdks-java-nexmark:compileTestJava' is 21bce415a1063468fc24a1da75a97795
Task ':beam-sdks-java-nexmark:compileTestJava' is not up-to-date because:
  Input property 'classpath' file <https://builds.apache.org/job/beam_Release_Gradle_NightlySnapshot/ws/src/sdks/java/extensions/google-cloud-platform-core/build/libs/beam-sdks-java-extensions-google-cloud-platform-core-2.7.0-SNAPSHOT-tests.jar> has changed.
  Input property 'classpath' file <https://builds.apache.org/job/beam_Release_Gradle_NightlySnapshot/ws/src/sdks/java/core/build/libs/beam-sdks-java-core-2.7.0-SNAPSHOT-tests.jar> has changed.
  Input property 'effectiveAnnotationProcessorPath' file <https://builds.apache.org/job/beam_Release_Gradle_NightlySnapshot/ws/src/sdks/java/io/google-cloud-platform/build/libs/beam-sdks-java-io-google-cloud-platform-2.7.0-SNAPSHOT.jar> has changed.
Custom actions are attached to task ':beam-sdks-java-nexmark:compileTestJava'.
Compiling with error-prone compiler
Note: <https://builds.apache.org/job/beam_Release_Gradle_NightlySnapshot/ws/src/sdks/java/nexmark/src/test/java/org/apache/beam/sdk/nexmark/queries/QueryTest.java> uses unchecked or unsafe operations.
Note: Recompile with -Xlint:unchecked for details.
Packing task ':beam-sdks-java-nexmark:compileTestJava'
:beam-sdks-java-nexmark:compileTestJava (Thread[Task worker for ':',5,main]) completed. Took 3.503 secs.
:beam-sdks-java-nexmark:processTestResources (Thread[Task worker for ':',5,main]) started.

> Task :beam-sdks-java-nexmark:processTestResources NO-SOURCE
file or directory '<https://builds.apache.org/job/beam_Release_Gradle_NightlySnapshot/ws/src/sdks/java/nexmark/src/test/resources',> not found
Skipping task ':beam-sdks-java-nexmark:processTestResources' as it has no source files and no previous output files.
:beam-sdks-java-nexmark:processTestResources (Thread[Task worker for ':',5,main]) completed. Took 0.0 secs.
:beam-sdks-java-nexmark:testClasses (Thread[Task worker for ':',5,main]) started.

> Task :beam-sdks-java-nexmark:testClasses
Skipping task ':beam-sdks-java-nexmark:testClasses' as it has no actions.
:beam-sdks-java-nexmark:testClasses (Thread[Task worker for ':',5,main]) completed. Took 0.0 secs.
:beam-sdks-java-nexmark:shadowTestJar (Thread[Task worker for ':',5,main]) started.

> Task :beam-sdks-java-nexmark:shadowTestJar
Build cache key for task ':beam-sdks-java-nexmark:shadowTestJar' is c81c8a6a4339ca7d4eb8610e589b202e
Caching disabled for task ':beam-sdks-java-nexmark:shadowTestJar': Caching has not been enabled for the task
Task ':beam-sdks-java-nexmark:shadowTestJar' is not up-to-date because:
  No history is available.
*******************
GRADLE SHADOW STATS

Total Jars: 2 (includes project)
Total Time: 2.02s [2020ms]
Average Time/Jar: 1.01s [1010.0ms]
*******************
:beam-sdks-java-nexmark:shadowTestJar (Thread[Task worker for ':',5,main]) completed. Took 2.093 secs.
:beam-sdks-java-nexmark:sourcesJar (Thread[Task worker for ':',5,main]) started.

> Task :beam-sdks-java-nexmark:sourcesJar
Build cache key for task ':beam-sdks-java-nexmark:sourcesJar' is b7d84e53346e2716dd97edf7e6a94477
Caching disabled for task ':beam-sdks-java-nexmark:sourcesJar': Caching has not been enabled for the task
Task ':beam-sdks-java-nexmark:sourcesJar' is not up-to-date because:
  No history is available.
:beam-sdks-java-nexmark:sourcesJar (Thread[Task worker for ':',5,main]) completed. Took 0.028 secs.
:beam-sdks-java-nexmark:testSourcesJar (Thread[Task worker for ':',5,main]) started.

> Task :beam-sdks-java-nexmark:testSourcesJar
file or directory '<https://builds.apache.org/job/beam_Release_Gradle_NightlySnapshot/ws/src/sdks/java/nexmark/src/test/resources',> not found
file or directory '<https://builds.apache.org/job/beam_Release_Gradle_NightlySnapshot/ws/src/sdks/java/nexmark/src/test/resources',> not found
Build cache key for task ':beam-sdks-java-nexmark:testSourcesJar' is e2ed244e83aa71b468373a75089039c2
Caching disabled for task ':beam-sdks-java-nexmark:testSourcesJar': Caching has not been enabled for the task
Task ':beam-sdks-java-nexmark:testSourcesJar' is not up-to-date because:
  No history is available.
file or directory '<https://builds.apache.org/job/beam_Release_Gradle_NightlySnapshot/ws/src/sdks/java/nexmark/src/test/resources',> not found
:beam-sdks-java-nexmark:testSourcesJar (Thread[Task worker for ':',5,main]) completed. Took 0.006 secs.
:beam-vendor-sdks-java-extensions-protobuf:compileTestJava (Thread[Task worker for ':' Thread 10,5,main]) started.

> Task :beam-vendor-sdks-java-extensions-protobuf:compileTestJava NO-SOURCE
file or directory '<https://builds.apache.org/job/beam_Release_Gradle_NightlySnapshot/ws/src/vendor/sdks-java-extensions-protobuf/src/test/java',> not found
Skipping task ':beam-vendor-sdks-java-extensions-protobuf:compileTestJava' as it has no source files and no previous output files.
:beam-vendor-sdks-java-extensions-protobuf:compileTestJava (Thread[Task worker for ':' Thread 10,5,main]) completed. Took 0.001 secs.
:beam-vendor-sdks-java-extensions-protobuf:processTestResources (Thread[Task worker for ':' Thread 10,5,main]) started.

> Task :beam-vendor-sdks-java-extensions-protobuf:processTestResources NO-SOURCE
file or directory '<https://builds.apache.org/job/beam_Release_Gradle_NightlySnapshot/ws/src/vendor/sdks-java-extensions-protobuf/src/test/resources',> not found
Skipping task ':beam-vendor-sdks-java-extensions-protobuf:processTestResources' as it has no source files and no previous output files.
:beam-vendor-sdks-java-extensions-protobuf:processTestResources (Thread[Task worker for ':' Thread 10,5,main]) completed. Took 0.0 secs.
:beam-vendor-sdks-java-extensions-protobuf:testClasses (Thread[Task worker for ':' Thread 10,5,main]) started.

> Task :beam-vendor-sdks-java-extensions-protobuf:testClasses UP-TO-DATE
Skipping task ':beam-vendor-sdks-java-extensions-protobuf:testClasses' as it has no actions.
:beam-vendor-sdks-java-extensions-protobuf:testClasses (Thread[Task worker for ':' Thread 10,5,main]) completed. Took 0.0 secs.
:beam-vendor-sdks-java-extensions-protobuf:shadowTestJar (Thread[Task worker for ':' Thread 9,5,main]) started.

> Task :beam-vendor-sdks-java-extensions-protobuf:shadowTestJar
Build cache key for task ':beam-vendor-sdks-java-extensions-protobuf:shadowTestJar' is f8f45c5ebe88628580fed6ea63107929
Caching disabled for task ':beam-vendor-sdks-java-extensions-protobuf:shadowTestJar': Caching has not been enabled for the task
Task ':beam-vendor-sdks-java-extensions-protobuf:shadowTestJar' is not up-to-date because:
  No history is available.
*******************
GRADLE SHADOW STATS

Total Jars: 2 (includes project)
Total Time: 1.606s [1606ms]
Average Time/Jar: 0.803s [803.0ms]
*******************
:beam-vendor-sdks-java-extensions-protobuf:shadowTestJar (Thread[Task worker for ':' Thread 9,5,main]) completed. Took 1.625 secs.
:beam-vendor-sdks-java-extensions-protobuf:sourcesJar (Thread[Task worker for ':' Thread 9,5,main]) started.

> Task :beam-vendor-sdks-java-extensions-protobuf:sourcesJar
file or directory '<https://builds.apache.org/job/beam_Release_Gradle_NightlySnapshot/ws/src/vendor/sdks-java-extensions-protobuf/src/main/resources',> not found
file or directory '<https://builds.apache.org/job/beam_Release_Gradle_NightlySnapshot/ws/src/vendor/sdks-java-extensions-protobuf/src/main/java',> not found
file or directory '<https://builds.apache.org/job/beam_Release_Gradle_NightlySnapshot/ws/src/vendor/sdks-java-extensions-protobuf/src/main/resources',> not found
file or directory '<https://builds.apache.org/job/beam_Release_Gradle_NightlySnapshot/ws/src/vendor/sdks-java-extensions-protobuf/src/main/java',> not found
Build cache key for task ':beam-vendor-sdks-java-extensions-protobuf:sourcesJar' is 725c57f0b1c0d6e4c572de9d9db06024
Caching disabled for task ':beam-vendor-sdks-java-extensions-protobuf:sourcesJar': Caching has not been enabled for the task
Task ':beam-vendor-sdks-java-extensions-protobuf:sourcesJar' is not up-to-date because:
  No history is available.
file or directory '<https://builds.apache.org/job/beam_Release_Gradle_NightlySnapshot/ws/src/vendor/sdks-java-extensions-protobuf/src/main/resources',> not found
file or directory '<https://builds.apache.org/job/beam_Release_Gradle_NightlySnapshot/ws/src/vendor/sdks-java-extensions-protobuf/src/main/java',> not found
:beam-vendor-sdks-java-extensions-protobuf:sourcesJar (Thread[Task worker for ':' Thread 9,5,main]) completed. Took 0.003 secs.
:beam-vendor-sdks-java-extensions-protobuf:testSourcesJar (Thread[Task worker for ':' Thread 9,5,main]) started.

> Task :beam-vendor-sdks-java-extensions-protobuf:testSourcesJar
file or directory '<https://builds.apache.org/job/beam_Release_Gradle_NightlySnapshot/ws/src/vendor/sdks-java-extensions-protobuf/src/test/resources',> not found
file or directory '<https://builds.apache.org/job/beam_Release_Gradle_NightlySnapshot/ws/src/vendor/sdks-java-extensions-protobuf/src/test/java',> not found
file or directory '<https://builds.apache.org/job/beam_Release_Gradle_NightlySnapshot/ws/src/vendor/sdks-java-extensions-protobuf/src/test/resources',> not found
file or directory '<https://builds.apache.org/job/beam_Release_Gradle_NightlySnapshot/ws/src/vendor/sdks-java-extensions-protobuf/src/test/java',> not found
Build cache key for task ':beam-vendor-sdks-java-extensions-protobuf:testSourcesJar' is 725c57f0b1c0d6e4c572de9d9db06024
Caching disabled for task ':beam-vendor-sdks-java-extensions-protobuf:testSourcesJar': Caching has not been enabled for the task
Task ':beam-vendor-sdks-java-extensions-protobuf:testSourcesJar' is not up-to-date because:
  No history is available.
file or directory '<https://builds.apache.org/job/beam_Release_Gradle_NightlySnapshot/ws/src/vendor/sdks-java-extensions-protobuf/src/test/resources',> not found
file or directory '<https://builds.apache.org/job/beam_Release_Gradle_NightlySnapshot/ws/src/vendor/sdks-java-extensions-protobuf/src/test/java',> not found
:beam-vendor-sdks-java-extensions-protobuf:testSourcesJar (Thread[Task worker for ':' Thread 9,5,main]) completed. Took 0.002 secs.

FAILURE: Build failed with an exception.

* What went wrong:
Execution failed for task ':beam-sdks-java-core:javadoc'.
> Javadoc generation failed. Generated Javadoc options file (useful for troubleshooting): '<https://builds.apache.org/job/beam_Release_Gradle_NightlySnapshot/ws/src/sdks/java/core/build/tmp/javadoc/javadoc.options'>

* Try:
Run with --stacktrace option to get the stack trace. Run with --debug option to get more log output. Run with --scan to get full insights.

* Get more help at https://help.gradle.org

Deprecated Gradle features were used in this build, making it incompatible with Gradle 5.0.
See https://docs.gradle.org/4.8/userguide/command_line_interface.html#sec:command_line_warnings

BUILD FAILED in 20m 27s
563 actionable tasks: 506 executed, 57 up-to-date

Publishing build scan...
https://gradle.com/s/6rzwgqgu4ymm6

Build step 'Invoke Gradle script' changed build result to FAILURE
Build step 'Invoke Gradle script' marked build as failure