osdir.com

[Date Prev][Date Next][Thread Prev][Thread Next][Date Index][Thread Index]

Build failed in Jenkins: beam_Release_Gradle_NightlySnapshot #97


See <https://builds.apache.org/job/beam_Release_Gradle_NightlySnapshot/97/display/redirect?page=changes>

Changes:

[robertwb] object() takes no parameters

[Pablo] Improving signing of all published artifacts and adding test publication

[Pablo] Removing extra publication

[cclauss] [BEAM-3761] Define cmp() in Python 3

[cclauss] [BEAM-3959] Add Python 3 undefined names to flake8

[amyrvold] [BEAM-3457] Upgrade version of gogradle and add examples and containers

[apilloud] [SQL] Inject JDBC rules through Hook.

[lcwik] [BEAM-4481, BEAM-4484] Start vendoring portability dependencies to not

[apilloud] [SQL] Plumb pipelineOptions through IOSinkRel

------------------------------------------
[...truncated 1.16 MB...]
file or directory '<https://builds.apache.org/job/beam_Release_Gradle_NightlySnapshot/ws/src/sdks/java/io/xml/src/test/resources',> not found
:beam-sdks-java-io-xml:testSourcesJar (Thread[Task worker for ':' Thread 5,5,main]) completed. Took 0.004 secs.
:beam-sdks-java-maven-archetypes-examples:generatePomFileForMavenJavaPublication (Thread[Task worker for ':' Thread 5,5,main]) started.

> Task :beam-sdks-java-maven-archetypes-examples:generatePomFileForMavenJavaPublication
Build cache key for task ':beam-sdks-java-maven-archetypes-examples:generatePomFileForMavenJavaPublication' is e88836a5bca732f78522d2de5a70d4e6
Caching disabled for task ':beam-sdks-java-maven-archetypes-examples:generatePomFileForMavenJavaPublication': Caching has not been enabled for the task
Task ':beam-sdks-java-maven-archetypes-examples:generatePomFileForMavenJavaPublication' is not up-to-date because:
  Task.upToDateWhen is false.
:beam-sdks-java-maven-archetypes-examples:generatePomFileForMavenJavaPublication (Thread[Task worker for ':' Thread 5,5,main]) completed. Took 0.005 secs.
:beam-sdks-java-maven-archetypes-examples:generateSources (Thread[Task worker for ':' Thread 5,5,main]) started.

> Task :beam-sdks-java-maven-archetypes-examples:generateSources
Caching disabled for task ':beam-sdks-java-maven-archetypes-examples:generateSources': Caching has not been enabled for the task
Task ':beam-sdks-java-maven-archetypes-examples:generateSources' is not up-to-date because:
  Task has not declared any outputs despite executing actions.
Starting process 'command './generate-sources.sh''. Working directory: <https://builds.apache.org/job/beam_Release_Gradle_NightlySnapshot/ws/src/sdks/java/maven-archetypes/examples> Command: ./generate-sources.sh 
Successfully started process 'command './generate-sources.sh''
:beam-sdks-java-maven-archetypes-examples:generateSources (Thread[Task worker for ':' Thread 5,5,main]) completed. Took 0.225 secs.
:beam-sdks-java-maven-archetypes-examples:processResources (Thread[Task worker for ':' Thread 5,5,main]) started.

> Task :beam-sdks-java-maven-archetypes-examples:processResources
Build cache key for task ':beam-sdks-java-maven-archetypes-examples:processResources' is 425c2a9455014215ad6b1b6c5335767f
Caching disabled for task ':beam-sdks-java-maven-archetypes-examples:processResources': Caching has not been enabled for the task
Task ':beam-sdks-java-maven-archetypes-examples:processResources' is not up-to-date because:
  No history is available.
:beam-sdks-java-maven-archetypes-examples:processResources (Thread[Task worker for ':' Thread 5,5,main]) completed. Took 0.109 secs.
:beam-sdks-java-maven-archetypes-examples:generatePomPropertiesFileForMavenJavaPublication (Thread[Task worker for ':' Thread 14,5,main]) started.

> Task :beam-sdks-java-maven-archetypes-examples:generatePomPropertiesFileForMavenJavaPublication
Build cache key for task ':beam-sdks-java-maven-archetypes-examples:generatePomPropertiesFileForMavenJavaPublication' is f01acc2a3fb8523136a4a5dce680860b
Caching disabled for task ':beam-sdks-java-maven-archetypes-examples:generatePomPropertiesFileForMavenJavaPublication': Caching has not been enabled for the task
Task ':beam-sdks-java-maven-archetypes-examples:generatePomPropertiesFileForMavenJavaPublication' is not up-to-date because:
  No history is available.
:beam-sdks-java-maven-archetypes-examples:generatePomPropertiesFileForMavenJavaPublication (Thread[Task worker for ':' Thread 14,5,main]) completed. Took 0.001 secs.
:beam-sdks-java-maven-archetypes-examples:processTestResources (Thread[Task worker for ':' Thread 14,5,main]) started.

> Task :beam-sdks-java-maven-archetypes-examples:processTestResources
Build cache key for task ':beam-sdks-java-maven-archetypes-examples:processTestResources' is 32f999b722303cf823d337566e91f1de
Caching disabled for task ':beam-sdks-java-maven-archetypes-examples:processTestResources': Caching has not been enabled for the task
Task ':beam-sdks-java-maven-archetypes-examples:processTestResources' is not up-to-date because:
  No history is available.
:beam-sdks-java-maven-archetypes-examples:processTestResources (Thread[Task worker for ':' Thread 14,5,main]) completed. Took 0.002 secs.
:beam-sdks-java-maven-archetypes-examples:sourcesJar (Thread[Task worker for ':' Thread 14,5,main]) started.

> Task :beam-sdks-java-maven-archetypes-examples:sourcesJar
file or directory '<https://builds.apache.org/job/beam_Release_Gradle_NightlySnapshot/ws/src/sdks/java/maven-archetypes/examples/src/main/java',> not found
Build cache key for task ':beam-sdks-java-maven-archetypes-examples:sourcesJar' is 3fcf0d3a3b8b26c012ae2b92c3835761
Caching disabled for task ':beam-sdks-java-maven-archetypes-examples:sourcesJar': Caching has not been enabled for the task
Task ':beam-sdks-java-maven-archetypes-examples:sourcesJar' is not up-to-date because:
  No history is available.
file or directory '<https://builds.apache.org/job/beam_Release_Gradle_NightlySnapshot/ws/src/sdks/java/maven-archetypes/examples/src/main/java',> not found
:beam-sdks-java-maven-archetypes-examples:sourcesJar (Thread[Task worker for ':' Thread 14,5,main]) completed. Took 0.014 secs.
:beam-sdks-java-maven-archetypes-examples:testSourcesJar (Thread[Task worker for ':' Thread 14,5,main]) started.

> Task :beam-sdks-java-maven-archetypes-examples:testSourcesJar
file or directory '<https://builds.apache.org/job/beam_Release_Gradle_NightlySnapshot/ws/src/sdks/java/maven-archetypes/examples/src/test/java',> not found
Build cache key for task ':beam-sdks-java-maven-archetypes-examples:testSourcesJar' is 07e2b94b1f1972b8f4bd07ad3873206f
Caching disabled for task ':beam-sdks-java-maven-archetypes-examples:testSourcesJar': Caching has not been enabled for the task
Task ':beam-sdks-java-maven-archetypes-examples:testSourcesJar' is not up-to-date because:
  No history is available.
file or directory '<https://builds.apache.org/job/beam_Release_Gradle_NightlySnapshot/ws/src/sdks/java/maven-archetypes/examples/src/test/java',> not found
:beam-sdks-java-maven-archetypes-examples:testSourcesJar (Thread[Task worker for ':' Thread 14,5,main]) completed. Took 0.002 secs.
:beam-sdks-java-maven-archetypes-starter:generatePomFileForMavenJavaPublication (Thread[Task worker for ':' Thread 14,5,main]) started.

> Task :beam-sdks-java-maven-archetypes-starter:generatePomFileForMavenJavaPublication
Build cache key for task ':beam-sdks-java-maven-archetypes-starter:generatePomFileForMavenJavaPublication' is e88836a5bca732f78522d2de5a70d4e6
Caching disabled for task ':beam-sdks-java-maven-archetypes-starter:generatePomFileForMavenJavaPublication': Caching has not been enabled for the task
Task ':beam-sdks-java-maven-archetypes-starter:generatePomFileForMavenJavaPublication' is not up-to-date because:
  Task.upToDateWhen is false.
:beam-sdks-java-maven-archetypes-starter:generatePomFileForMavenJavaPublication (Thread[Task worker for ':' Thread 14,5,main]) completed. Took 0.006 secs.
:beam-sdks-java-maven-archetypes-starter:processResources (Thread[Task worker for ':' Thread 14,5,main]) started.

> Task :beam-sdks-java-maven-archetypes-starter:processResources
Build cache key for task ':beam-sdks-java-maven-archetypes-starter:processResources' is 1b7aeac80390a98f69aa585c2e557c6a
Caching disabled for task ':beam-sdks-java-maven-archetypes-starter:processResources': Caching has not been enabled for the task
Task ':beam-sdks-java-maven-archetypes-starter:processResources' is not up-to-date because:
  No history is available.
:beam-sdks-java-maven-archetypes-starter:processResources (Thread[Task worker for ':' Thread 14,5,main]) completed. Took 0.003 secs.
:beam-sdks-java-maven-archetypes-starter:generatePomPropertiesFileForMavenJavaPublication (Thread[Task worker for ':' Thread 14,5,main]) started.

> Task :beam-sdks-java-maven-archetypes-starter:generatePomPropertiesFileForMavenJavaPublication
Build cache key for task ':beam-sdks-java-maven-archetypes-starter:generatePomPropertiesFileForMavenJavaPublication' is f01acc2a3fb8523136a4a5dce680860b
Caching disabled for task ':beam-sdks-java-maven-archetypes-starter:generatePomPropertiesFileForMavenJavaPublication': Caching has not been enabled for the task
Task ':beam-sdks-java-maven-archetypes-starter:generatePomPropertiesFileForMavenJavaPublication' is not up-to-date because:
  No history is available.
:beam-sdks-java-maven-archetypes-starter:generatePomPropertiesFileForMavenJavaPublication (Thread[Task worker for ':' Thread 14,5,main]) completed. Took 0.0 secs.
:beam-sdks-java-maven-archetypes-starter:processTestResources (Thread[Task worker for ':' Thread 14,5,main]) started.

> Task :beam-sdks-java-maven-archetypes-starter:processTestResources
Build cache key for task ':beam-sdks-java-maven-archetypes-starter:processTestResources' is f74f3200edf284b276c50da93794d928
Caching disabled for task ':beam-sdks-java-maven-archetypes-starter:processTestResources': Caching has not been enabled for the task
Task ':beam-sdks-java-maven-archetypes-starter:processTestResources' is not up-to-date because:
  No history is available.
:beam-sdks-java-maven-archetypes-starter:processTestResources (Thread[Task worker for ':' Thread 14,5,main]) completed. Took 0.003 secs.
:beam-sdks-java-maven-archetypes-starter:sourcesJar (Thread[Task worker for ':' Thread 14,5,main]) started.

> Task :beam-sdks-java-maven-archetypes-starter:sourcesJar
file or directory '<https://builds.apache.org/job/beam_Release_Gradle_NightlySnapshot/ws/src/sdks/java/maven-archetypes/starter/src/main/java',> not found
Build cache key for task ':beam-sdks-java-maven-archetypes-starter:sourcesJar' is a106f15937cacfee668e25636b705e03
Caching disabled for task ':beam-sdks-java-maven-archetypes-starter:sourcesJar': Caching has not been enabled for the task
Task ':beam-sdks-java-maven-archetypes-starter:sourcesJar' is not up-to-date because:
  No history is available.
file or directory '<https://builds.apache.org/job/beam_Release_Gradle_NightlySnapshot/ws/src/sdks/java/maven-archetypes/starter/src/main/java',> not found
:beam-sdks-java-maven-archetypes-starter:sourcesJar (Thread[Task worker for ':' Thread 14,5,main]) completed. Took 0.003 secs.
:beam-sdks-java-maven-archetypes-starter:testSourcesJar (Thread[Task worker for ':' Thread 14,5,main]) started.

> Task :beam-sdks-java-maven-archetypes-starter:testSourcesJar
file or directory '<https://builds.apache.org/job/beam_Release_Gradle_NightlySnapshot/ws/src/sdks/java/maven-archetypes/starter/src/test/java',> not found
Build cache key for task ':beam-sdks-java-maven-archetypes-starter:testSourcesJar' is 58715d6b8e221cace68f230ccfd69fd4
Caching disabled for task ':beam-sdks-java-maven-archetypes-starter:testSourcesJar': Caching has not been enabled for the task
Task ':beam-sdks-java-maven-archetypes-starter:testSourcesJar' is not up-to-date because:
  No history is available.
file or directory '<https://builds.apache.org/job/beam_Release_Gradle_NightlySnapshot/ws/src/sdks/java/maven-archetypes/starter/src/test/java',> not found
:beam-sdks-java-maven-archetypes-starter:testSourcesJar (Thread[Task worker for ':' Thread 14,5,main]) completed. Took 0.01 secs.
:beam-sdks-java-nexmark:generatePomFileForMavenJavaPublication (Thread[Task worker for ':' Thread 5,5,main]) started.

> Task :beam-sdks-java-nexmark:generatePomFileForMavenJavaPublication
Build cache key for task ':beam-sdks-java-nexmark:generatePomFileForMavenJavaPublication' is e88836a5bca732f78522d2de5a70d4e6
Caching disabled for task ':beam-sdks-java-nexmark:generatePomFileForMavenJavaPublication': Caching has not been enabled for the task
Task ':beam-sdks-java-nexmark:generatePomFileForMavenJavaPublication' is not up-to-date because:
  Task.upToDateWhen is false.
:beam-sdks-java-nexmark:generatePomFileForMavenJavaPublication (Thread[Task worker for ':' Thread 5,5,main]) completed. Took 0.006 secs.
:beam-sdks-java-nexmark:processResources (Thread[Task worker for ':' Thread 5,5,main]) started.

> Task :beam-sdks-java-nexmark:processResources
Build cache key for task ':beam-sdks-java-nexmark:processResources' is 5ee84f86d63f1ec7e0c47792990c7e88
Caching disabled for task ':beam-sdks-java-nexmark:processResources': Caching has not been enabled for the task
Task ':beam-sdks-java-nexmark:processResources' is not up-to-date because:
  No history is available.
:beam-sdks-java-nexmark:processResources (Thread[Task worker for ':' Thread 5,5,main]) completed. Took 0.002 secs.
:beam-sdks-java-nexmark:generatePomPropertiesFileForMavenJavaPublication (Thread[Task worker for ':' Thread 5,5,main]) started.

> Task :beam-sdks-java-nexmark:generatePomPropertiesFileForMavenJavaPublication
Build cache key for task ':beam-sdks-java-nexmark:generatePomPropertiesFileForMavenJavaPublication' is f01acc2a3fb8523136a4a5dce680860b
Caching disabled for task ':beam-sdks-java-nexmark:generatePomPropertiesFileForMavenJavaPublication': Caching has not been enabled for the task
Task ':beam-sdks-java-nexmark:generatePomPropertiesFileForMavenJavaPublication' is not up-to-date because:
  No history is available.
:beam-sdks-java-nexmark:generatePomPropertiesFileForMavenJavaPublication (Thread[Task worker for ':' Thread 5,5,main]) completed. Took 0.0 secs.
:beam-sdks-java-nexmark:processTestResources (Thread[Task worker for ':' Thread 5,5,main]) started.

> Task :beam-sdks-java-nexmark:processTestResources NO-SOURCE
file or directory '<https://builds.apache.org/job/beam_Release_Gradle_NightlySnapshot/ws/src/sdks/java/nexmark/src/test/resources',> not found
Skipping task ':beam-sdks-java-nexmark:processTestResources' as it has no source files and no previous output files.
:beam-sdks-java-nexmark:processTestResources (Thread[Task worker for ':' Thread 5,5,main]) completed. Took 0.0 secs.
:beam-sdks-java-nexmark:sourcesJar (Thread[Task worker for ':' Thread 5,5,main]) started.

> Task :beam-sdks-java-nexmark:sourcesJar
Build cache key for task ':beam-sdks-java-nexmark:sourcesJar' is 1230c062bcf7fd1308dae98237a97623
Caching disabled for task ':beam-sdks-java-nexmark:sourcesJar': Caching has not been enabled for the task
Task ':beam-sdks-java-nexmark:sourcesJar' is not up-to-date because:
  No history is available.
:beam-sdks-java-nexmark:sourcesJar (Thread[Task worker for ':' Thread 5,5,main]) completed. Took 0.03 secs.
:beam-sdks-java-nexmark:testSourcesJar (Thread[Task worker for ':' Thread 5,5,main]) started.

> Task :beam-sdks-java-nexmark:testSourcesJar
file or directory '<https://builds.apache.org/job/beam_Release_Gradle_NightlySnapshot/ws/src/sdks/java/nexmark/src/test/resources',> not found
file or directory '<https://builds.apache.org/job/beam_Release_Gradle_NightlySnapshot/ws/src/sdks/java/nexmark/src/test/resources',> not found
Build cache key for task ':beam-sdks-java-nexmark:testSourcesJar' is 5746c4bdf21e2f354817f5440b963fc4
Caching disabled for task ':beam-sdks-java-nexmark:testSourcesJar': Caching has not been enabled for the task
Task ':beam-sdks-java-nexmark:testSourcesJar' is not up-to-date because:
  No history is available.
file or directory '<https://builds.apache.org/job/beam_Release_Gradle_NightlySnapshot/ws/src/sdks/java/nexmark/src/test/resources',> not found
:beam-sdks-java-nexmark:testSourcesJar (Thread[Task worker for ':' Thread 5,5,main]) completed. Took 0.007 secs.
:runners:google-cloud-dataflow-java:generatePomFileForMavenJavaPublication (Thread[Task worker for ':' Thread 2,5,main]) started.

> Task :runners:google-cloud-dataflow-java:generatePomFileForMavenJavaPublication
Build cache key for task ':runners:google-cloud-dataflow-java:generatePomFileForMavenJavaPublication' is e88836a5bca732f78522d2de5a70d4e6
Caching disabled for task ':runners:google-cloud-dataflow-java:generatePomFileForMavenJavaPublication': Caching has not been enabled for the task
Task ':runners:google-cloud-dataflow-java:generatePomFileForMavenJavaPublication' is not up-to-date because:
  Task.upToDateWhen is false.
:runners:google-cloud-dataflow-java:generatePomFileForMavenJavaPublication (Thread[Task worker for ':' Thread 2,5,main]) completed. Took 0.006 secs.
:runners:google-cloud-dataflow-java:processResources (Thread[Task worker for ':' Thread 2,5,main]) started.

> Task :runners:google-cloud-dataflow-java:processResources
Build cache key for task ':runners:google-cloud-dataflow-java:processResources' is 22dffc7b490a45a239a90a252ae224e6
Caching disabled for task ':runners:google-cloud-dataflow-java:processResources': Caching has not been enabled for the task
Task ':runners:google-cloud-dataflow-java:processResources' is not up-to-date because:
  No history is available.
:runners:google-cloud-dataflow-java:processResources (Thread[Task worker for ':' Thread 2,5,main]) completed. Took 0.002 secs.
:runners:google-cloud-dataflow-java:generatePomPropertiesFileForMavenJavaPublication (Thread[Task worker for ':' Thread 2,5,main]) started.

> Task :runners:google-cloud-dataflow-java:generatePomPropertiesFileForMavenJavaPublication
Build cache key for task ':runners:google-cloud-dataflow-java:generatePomPropertiesFileForMavenJavaPublication' is f01acc2a3fb8523136a4a5dce680860b
Caching disabled for task ':runners:google-cloud-dataflow-java:generatePomPropertiesFileForMavenJavaPublication': Caching has not been enabled for the task
Task ':runners:google-cloud-dataflow-java:generatePomPropertiesFileForMavenJavaPublication' is not up-to-date because:
  No history is available.
:runners:google-cloud-dataflow-java:generatePomPropertiesFileForMavenJavaPublication (Thread[Task worker for ':' Thread 2,5,main]) completed. Took 0.001 secs.
:runners:google-cloud-dataflow-java:processTestResources (Thread[Task worker for ':' Thread 2,5,main]) started.

> Task :runners:google-cloud-dataflow-java:processTestResources NO-SOURCE
file or directory '<https://builds.apache.org/job/beam_Release_Gradle_NightlySnapshot/ws/src/runners/google-cloud-dataflow-java/src/test/resources',> not found
Skipping task ':runners:google-cloud-dataflow-java:processTestResources' as it has no source files and no previous output files.
:runners:google-cloud-dataflow-java:processTestResources (Thread[Task worker for ':' Thread 2,5,main]) completed. Took 0.0 secs.
:runners:google-cloud-dataflow-java:sourcesJar (Thread[Task worker for ':' Thread 2,5,main]) started.

> Task :runners:google-cloud-dataflow-java:sourcesJar
Build cache key for task ':runners:google-cloud-dataflow-java:sourcesJar' is f6ee32afc2df554e5f9f7a347763d5a4
Caching disabled for task ':runners:google-cloud-dataflow-java:sourcesJar': Caching has not been enabled for the task
Task ':runners:google-cloud-dataflow-java:sourcesJar' is not up-to-date because:
  No history is available.
:runners:google-cloud-dataflow-java:sourcesJar (Thread[Task worker for ':' Thread 2,5,main]) completed. Took 0.022 secs.
:runners:google-cloud-dataflow-java:testSourcesJar (Thread[Task worker for ':' Thread 2,5,main]) started.

> Task :runners:google-cloud-dataflow-java:testSourcesJar
file or directory '<https://builds.apache.org/job/beam_Release_Gradle_NightlySnapshot/ws/src/runners/google-cloud-dataflow-java/src/test/resources',> not found
file or directory '<https://builds.apache.org/job/beam_Release_Gradle_NightlySnapshot/ws/src/runners/google-cloud-dataflow-java/src/test/resources',> not found
Build cache key for task ':runners:google-cloud-dataflow-java:testSourcesJar' is 7db575505fe0f56f66473048903f7dac
Caching disabled for task ':runners:google-cloud-dataflow-java:testSourcesJar': Caching has not been enabled for the task
Task ':runners:google-cloud-dataflow-java:testSourcesJar' is not up-to-date because:
  No history is available.
file or directory '<https://builds.apache.org/job/beam_Release_Gradle_NightlySnapshot/ws/src/runners/google-cloud-dataflow-java/src/test/resources',> not found
:runners:google-cloud-dataflow-java:testSourcesJar (Thread[Task worker for ':' Thread 2,5,main]) completed. Took 0.011 secs.

FAILURE: Build completed with 2 failures.

1: Task failed with an exception.
-----------
* What went wrong:
Execution failed for task ':beam-runners-core-construction-java:compileJava'.
> Compilation failed with exit code 1; see the compiler error output for details.

* Try:
Run with --stacktrace option to get the stack trace. Run with --debug option to get more log output. Run with --scan to get full insights.
==============================================================================

2: Task failed with an exception.
-----------
* What went wrong:
Execution failed for task ':beam-sdks-java-fn-execution:compileJava'.
> Compilation failed with exit code 1; see the compiler error output for details.

* Try:
Run with --stacktrace option to get the stack trace. Run with --debug option to get more log output. Run with --scan to get full insights.
==============================================================================

* Get more help at https://help.gradle.org

Deprecated Gradle features were used in this build, making it incompatible with Gradle 5.0.
See https://docs.gradle.org/4.8/userguide/command_line_interface.html#sec:command_line_warnings

BUILD FAILED in 12m 1s
485 actionable tasks: 483 executed, 2 from cache

Publishing build scan...
https://gradle.com/s/o5jplucyth2te

Build step 'Invoke Gradle script' changed build result to FAILURE
Build step 'Invoke Gradle script' marked build as failure