osdir.com

[Date Prev][Date Next][Thread Prev][Thread Next][Date Index][Thread Index]

Build failed in Jenkins: beam_Release_Gradle_NightlySnapshot #86


See <https://builds.apache.org/job/beam_Release_Gradle_NightlySnapshot/86/display/redirect?page=changes>

Changes:

[relax] Fix build.

[klk] Revert accidental clobber of MinimalWordCount.java

[relax] Exclude schema tests from Samza runner.

[klk] Update BigQueryAvroUtils to support BigQuery's NUMERIC type.

------------------------------------------
[...truncated 1.59 MB...]
:beam-sdks-java-nexmark:compileJava (Thread[Task worker for ':' Thread 9,5,main]) started.

> Task :beam-sdks-java-nexmark:compileJava
Build cache key for task ':beam-sdks-java-nexmark:compileJava' is 84d095dfaa01ff7e107f8bded9d795fe
Task ':beam-sdks-java-nexmark:compileJava' is not up-to-date because:
  No history is available.
Custom actions are attached to task ':beam-sdks-java-nexmark:compileJava'.
All input files are considered out-of-date for incremental task ':beam-sdks-java-nexmark:compileJava'.
Compiling with error-prone compiler
Note: Some input files use or override a deprecated API.
Note: Recompile with -Xlint:deprecation for details.
Note: Some input files use unchecked or unsafe operations.
Note: Recompile with -Xlint:unchecked for details.
Packing task ':beam-sdks-java-nexmark:compileJava'
:beam-sdks-java-nexmark:compileJava (Thread[Task worker for ':' Thread 9,5,main]) completed. Took 6.98 secs.
:beam-sdks-java-nexmark:processResources (Thread[Task worker for ':' Thread 9,5,main]) started.

> Task :beam-sdks-java-nexmark:processResources
Build cache key for task ':beam-sdks-java-nexmark:processResources' is 5ee84f86d63f1ec7e0c47792990c7e88
Caching disabled for task ':beam-sdks-java-nexmark:processResources': Caching has not been enabled for the task
Task ':beam-sdks-java-nexmark:processResources' is not up-to-date because:
  No history is available.
:beam-sdks-java-nexmark:processResources (Thread[Task worker for ':' Thread 9,5,main]) completed. Took 0.002 secs.
:beam-sdks-java-nexmark:classes (Thread[Task worker for ':' Thread 9,5,main]) started.

> Task :beam-sdks-java-nexmark:classes
Skipping task ':beam-sdks-java-nexmark:classes' as it has no actions.
:beam-sdks-java-nexmark:classes (Thread[Task worker for ':' Thread 9,5,main]) completed. Took 0.0 secs.
:beam-sdks-java-nexmark:generatePomPropertiesFileForMavenJavaPublication (Thread[Task worker for ':' Thread 7,5,main]) started.

> Task :beam-sdks-java-nexmark:generatePomPropertiesFileForMavenJavaPublication
Build cache key for task ':beam-sdks-java-nexmark:generatePomPropertiesFileForMavenJavaPublication' is e5a9a09d874a024bb3717678f8149932
Caching disabled for task ':beam-sdks-java-nexmark:generatePomPropertiesFileForMavenJavaPublication': Caching has not been enabled for the task
Task ':beam-sdks-java-nexmark:generatePomPropertiesFileForMavenJavaPublication' is not up-to-date because:
  No history is available.
:beam-sdks-java-nexmark:generatePomPropertiesFileForMavenJavaPublication (Thread[Task worker for ':' Thread 7,5,main]) completed. Took 0.001 secs.
:beam-sdks-java-nexmark:shadowJar (Thread[Task worker for ':' Thread 7,5,main]) started.

> Task :beam-sdks-java-nexmark:shadowJar
Build cache key for task ':beam-sdks-java-nexmark:shadowJar' is 864230789e7f975a09034c5fa6a51616
Caching disabled for task ':beam-sdks-java-nexmark:shadowJar': Caching has not been enabled for the task
Task ':beam-sdks-java-nexmark:shadowJar' is not up-to-date because:
  No history is available.
*******************
GRADLE SHADOW STATS

Total Jars: 2 (includes project)
Total Time: 2.099s [2099ms]
Average Time/Jar: 1.0495s [1049.5ms]
*******************
:beam-sdks-java-nexmark:shadowJar (Thread[Task worker for ':' Thread 7,5,main]) completed. Took 2.385 secs.
:beam-sdks-java-nexmark:compileTestJava (Thread[Task worker for ':' Thread 7,5,main]) started.

> Task :beam-sdks-java-nexmark:compileTestJava
Build cache key for task ':beam-sdks-java-nexmark:compileTestJava' is 04f3ded9f7db5a4438160a3fce177b54
Task ':beam-sdks-java-nexmark:compileTestJava' is not up-to-date because:
  No history is available.
Custom actions are attached to task ':beam-sdks-java-nexmark:compileTestJava'.
All input files are considered out-of-date for incremental task ':beam-sdks-java-nexmark:compileTestJava'.
Compiling with error-prone compiler
Note: Some input files use unchecked or unsafe operations.
Note: Recompile with -Xlint:unchecked for details.
Packing task ':beam-sdks-java-nexmark:compileTestJava'
:beam-sdks-java-nexmark:compileTestJava (Thread[Task worker for ':' Thread 7,5,main]) completed. Took 3.483 secs.
:beam-sdks-java-nexmark:processTestResources (Thread[Task worker for ':' Thread 7,5,main]) started.

> Task :beam-sdks-java-nexmark:processTestResources NO-SOURCE
file or directory '<https://builds.apache.org/job/beam_Release_Gradle_NightlySnapshot/ws/src/sdks/java/nexmark/src/test/resources',> not found
Skipping task ':beam-sdks-java-nexmark:processTestResources' as it has no source files and no previous output files.
:beam-sdks-java-nexmark:processTestResources (Thread[Task worker for ':' Thread 7,5,main]) completed. Took 0.0 secs.
:beam-sdks-java-nexmark:testClasses (Thread[Task worker for ':' Thread 7,5,main]) started.

> Task :beam-sdks-java-nexmark:testClasses
Skipping task ':beam-sdks-java-nexmark:testClasses' as it has no actions.
:beam-sdks-java-nexmark:testClasses (Thread[Task worker for ':' Thread 7,5,main]) completed. Took 0.0 secs.
:beam-sdks-java-nexmark:shadowTestJar (Thread[Task worker for ':' Thread 2,5,main]) started.

> Task :beam-sdks-java-nexmark:shadowTestJar
Build cache key for task ':beam-sdks-java-nexmark:shadowTestJar' is abbed2bd8fa956b3d40f344b1664add3
Caching disabled for task ':beam-sdks-java-nexmark:shadowTestJar': Caching has not been enabled for the task
Task ':beam-sdks-java-nexmark:shadowTestJar' is not up-to-date because:
  No history is available.
*******************
GRADLE SHADOW STATS

Total Jars: 2 (includes project)
Total Time: 2.048s [2048ms]
Average Time/Jar: 1.024s [1024.0ms]
*******************
:beam-sdks-java-nexmark:shadowTestJar (Thread[Task worker for ':' Thread 2,5,main]) completed. Took 2.099 secs.
:beam-sdks-java-nexmark:sourcesJar (Thread[Task worker for ':' Thread 2,5,main]) started.

> Task :beam-sdks-java-nexmark:sourcesJar
Build cache key for task ':beam-sdks-java-nexmark:sourcesJar' is 763bac4745fc6c19a9680e7135d82af7
Caching disabled for task ':beam-sdks-java-nexmark:sourcesJar': Caching has not been enabled for the task
Task ':beam-sdks-java-nexmark:sourcesJar' is not up-to-date because:
  No history is available.
:beam-sdks-java-nexmark:sourcesJar (Thread[Task worker for ':' Thread 2,5,main]) completed. Took 0.024 secs.
:beam-sdks-java-nexmark:testSourcesJar (Thread[Task worker for ':' Thread 2,5,main]) started.

> Task :beam-sdks-java-nexmark:testSourcesJar
file or directory '<https://builds.apache.org/job/beam_Release_Gradle_NightlySnapshot/ws/src/sdks/java/nexmark/src/test/resources',> not found
file or directory '<https://builds.apache.org/job/beam_Release_Gradle_NightlySnapshot/ws/src/sdks/java/nexmark/src/test/resources',> not found
Build cache key for task ':beam-sdks-java-nexmark:testSourcesJar' is 2355745b89159ca6fdaeaeb10222bd98
Caching disabled for task ':beam-sdks-java-nexmark:testSourcesJar': Caching has not been enabled for the task
Task ':beam-sdks-java-nexmark:testSourcesJar' is not up-to-date because:
  No history is available.
file or directory '<https://builds.apache.org/job/beam_Release_Gradle_NightlySnapshot/ws/src/sdks/java/nexmark/src/test/resources',> not found
:beam-sdks-java-nexmark:testSourcesJar (Thread[Task worker for ':' Thread 2,5,main]) completed. Took 0.005 secs.
:runners:google-cloud-dataflow-java:generatePomFileForMavenJavaPublication (Thread[Task worker for ':' Thread 11,5,main]) started.

> Task :runners:google-cloud-dataflow-java:generatePomFileForMavenJavaPublication
Build cache key for task ':runners:google-cloud-dataflow-java:generatePomFileForMavenJavaPublication' is e88836a5bca732f78522d2de5a70d4e6
Caching disabled for task ':runners:google-cloud-dataflow-java:generatePomFileForMavenJavaPublication': Caching has not been enabled for the task
Task ':runners:google-cloud-dataflow-java:generatePomFileForMavenJavaPublication' is not up-to-date because:
  Task.upToDateWhen is false.
:runners:google-cloud-dataflow-java:generatePomFileForMavenJavaPublication (Thread[Task worker for ':' Thread 11,5,main]) completed. Took 0.01 secs.
:runners:google-cloud-dataflow-java:compileJava (Thread[Task worker for ':' Thread 11,5,main]) started.

> Task :runners:google-cloud-dataflow-java:compileJava
Build cache key for task ':runners:google-cloud-dataflow-java:compileJava' is a7775a31e56972b05ded2099bba2f2ba
Caching disabled for task ':runners:google-cloud-dataflow-java:compileJava': Gradle does not know how file 'build/classes/java/main' was created (output property 'destinationDir'). Task output caching requires exclusive access to output paths to guarantee correctness.
Task ':runners:google-cloud-dataflow-java:compileJava' is not up-to-date because:
  No history is available.
All input files are considered out-of-date for incremental task ':runners:google-cloud-dataflow-java:compileJava'.
Compiling with error-prone compiler
Note: Some input files use or override a deprecated API.
Note: Recompile with -Xlint:deprecation for details.
Note: Some input files use unchecked or unsafe operations.
Note: Recompile with -Xlint:unchecked for details.
:runners:google-cloud-dataflow-java:compileJava (Thread[Task worker for ':' Thread 11,5,main]) completed. Took 7.528 secs.
:runners:google-cloud-dataflow-java:processResources (Thread[Task worker for ':' Thread 11,5,main]) started.

> Task :runners:google-cloud-dataflow-java:processResources
Build cache key for task ':runners:google-cloud-dataflow-java:processResources' is 22dffc7b490a45a239a90a252ae224e6
Caching disabled for task ':runners:google-cloud-dataflow-java:processResources': Caching has not been enabled for the task
Task ':runners:google-cloud-dataflow-java:processResources' is not up-to-date because:
  No history is available.
:runners:google-cloud-dataflow-java:processResources (Thread[Task worker for ':' Thread 11,5,main]) completed. Took 0.003 secs.
:runners:google-cloud-dataflow-java:classes (Thread[Task worker for ':' Thread 11,5,main]) started.

> Task :runners:google-cloud-dataflow-java:classes
Skipping task ':runners:google-cloud-dataflow-java:classes' as it has no actions.
:runners:google-cloud-dataflow-java:classes (Thread[Task worker for ':' Thread 11,5,main]) completed. Took 0.0 secs.
:runners:google-cloud-dataflow-java:generatePomPropertiesFileForMavenJavaPublication (Thread[Task worker for ':' Thread 11,5,main]) started.

> Task :runners:google-cloud-dataflow-java:generatePomPropertiesFileForMavenJavaPublication
Build cache key for task ':runners:google-cloud-dataflow-java:generatePomPropertiesFileForMavenJavaPublication' is e5a9a09d874a024bb3717678f8149932
Caching disabled for task ':runners:google-cloud-dataflow-java:generatePomPropertiesFileForMavenJavaPublication': Caching has not been enabled for the task
Task ':runners:google-cloud-dataflow-java:generatePomPropertiesFileForMavenJavaPublication' is not up-to-date because:
  No history is available.
:runners:google-cloud-dataflow-java:generatePomPropertiesFileForMavenJavaPublication (Thread[Task worker for ':' Thread 11,5,main]) completed. Took 0.0 secs.
:runners:google-cloud-dataflow-java:shadowJar (Thread[Task worker for ':' Thread 11,5,main]) started.

> Task :runners:google-cloud-dataflow-java:shadowJar
Build cache key for task ':runners:google-cloud-dataflow-java:shadowJar' is 224839a258f986199eef41cbca14e4c2
Caching disabled for task ':runners:google-cloud-dataflow-java:shadowJar': Caching has not been enabled for the task
Task ':runners:google-cloud-dataflow-java:shadowJar' is not up-to-date because:
  No history is available.
*******************
GRADLE SHADOW STATS

Total Jars: 2 (includes project)
Total Time: 1.985s [1985ms]
Average Time/Jar: 0.9925s [992.5ms]
*******************
:runners:google-cloud-dataflow-java:shadowJar (Thread[Task worker for ':' Thread 11,5,main]) completed. Took 2.234 secs.
:runners:google-cloud-dataflow-java:compileTestJava (Thread[Task worker for ':' Thread 11,5,main]) started.

> Task :runners:google-cloud-dataflow-java:compileTestJava
Build cache key for task ':runners:google-cloud-dataflow-java:compileTestJava' is e517f867d2ba67e24c7cdc87620ab8d7
Caching disabled for task ':runners:google-cloud-dataflow-java:compileTestJava': Gradle does not know how file 'build/classes/java/test' was created (output property 'destinationDir'). Task output caching requires exclusive access to output paths to guarantee correctness.
Task ':runners:google-cloud-dataflow-java:compileTestJava' is not up-to-date because:
  No history is available.
All input files are considered out-of-date for incremental task ':runners:google-cloud-dataflow-java:compileTestJava'.
Compiling with error-prone compiler
Note: Some input files use or override a deprecated API.
Note: Recompile with -Xlint:deprecation for details.
Note: Some input files use unchecked or unsafe operations.
Note: Recompile with -Xlint:unchecked for details.
:runners:google-cloud-dataflow-java:compileTestJava (Thread[Task worker for ':' Thread 11,5,main]) completed. Took 7.253 secs.
:runners:google-cloud-dataflow-java:processTestResources (Thread[Task worker for ':' Thread 11,5,main]) started.

> Task :runners:google-cloud-dataflow-java:processTestResources NO-SOURCE
file or directory '<https://builds.apache.org/job/beam_Release_Gradle_NightlySnapshot/ws/src/runners/google-cloud-dataflow-java/src/test/resources',> not found
Skipping task ':runners:google-cloud-dataflow-java:processTestResources' as it has no source files and no previous output files.
:runners:google-cloud-dataflow-java:processTestResources (Thread[Task worker for ':' Thread 11,5,main]) completed. Took 0.0 secs.
:runners:google-cloud-dataflow-java:testClasses (Thread[Task worker for ':' Thread 11,5,main]) started.

> Task :runners:google-cloud-dataflow-java:testClasses
Skipping task ':runners:google-cloud-dataflow-java:testClasses' as it has no actions.
:runners:google-cloud-dataflow-java:testClasses (Thread[Task worker for ':' Thread 11,5,main]) completed. Took 0.0 secs.
:runners:google-cloud-dataflow-java:shadowTestJar (Thread[Task worker for ':' Thread 5,5,main]) started.

> Task :runners:google-cloud-dataflow-java:shadowTestJar
Build cache key for task ':runners:google-cloud-dataflow-java:shadowTestJar' is fa8f0e05bc68d18a9661aacddcacdea1
Caching disabled for task ':runners:google-cloud-dataflow-java:shadowTestJar': Caching has not been enabled for the task
Task ':runners:google-cloud-dataflow-java:shadowTestJar' is not up-to-date because:
  No history is available.
*******************
GRADLE SHADOW STATS

Total Jars: 2 (includes project)
Total Time: 2.083s [2083ms]
Average Time/Jar: 1.0415s [1041.5ms]
*******************
:runners:google-cloud-dataflow-java:shadowTestJar (Thread[Task worker for ':' Thread 5,5,main]) completed. Took 2.261 secs.
:runners:google-cloud-dataflow-java:sourcesJar (Thread[Task worker for ':' Thread 5,5,main]) started.

> Task :runners:google-cloud-dataflow-java:sourcesJar
Build cache key for task ':runners:google-cloud-dataflow-java:sourcesJar' is 7d30b7746e0ef5e97bd0da1d8a78807a
Caching disabled for task ':runners:google-cloud-dataflow-java:sourcesJar': Caching has not been enabled for the task
Task ':runners:google-cloud-dataflow-java:sourcesJar' is not up-to-date because:
  No history is available.
:runners:google-cloud-dataflow-java:sourcesJar (Thread[Task worker for ':' Thread 5,5,main]) completed. Took 0.023 secs.
:runners:google-cloud-dataflow-java:testSourcesJar (Thread[Task worker for ':' Thread 5,5,main]) started.

> Task :runners:google-cloud-dataflow-java:testSourcesJar
file or directory '<https://builds.apache.org/job/beam_Release_Gradle_NightlySnapshot/ws/src/runners/google-cloud-dataflow-java/src/test/resources',> not found
file or directory '<https://builds.apache.org/job/beam_Release_Gradle_NightlySnapshot/ws/src/runners/google-cloud-dataflow-java/src/test/resources',> not found
Build cache key for task ':runners:google-cloud-dataflow-java:testSourcesJar' is 7db575505fe0f56f66473048903f7dac
Caching disabled for task ':runners:google-cloud-dataflow-java:testSourcesJar': Caching has not been enabled for the task
Task ':runners:google-cloud-dataflow-java:testSourcesJar' is not up-to-date because:
  No history is available.
file or directory '<https://builds.apache.org/job/beam_Release_Gradle_NightlySnapshot/ws/src/runners/google-cloud-dataflow-java/src/test/resources',> not found
:runners:google-cloud-dataflow-java:testSourcesJar (Thread[Task worker for ':' Thread 5,5,main]) completed. Took 0.011 secs.

FAILURE: Build failed with an exception.

* What went wrong:
Execution failed for task ':beam-runners-core-construction-java:javadoc'.
> Javadoc generation failed. Generated Javadoc options file (useful for troubleshooting): '<https://builds.apache.org/job/beam_Release_Gradle_NightlySnapshot/ws/src/runners/core-construction-java/build/tmp/javadoc/javadoc.options'>

* Try:
Run with --stacktrace option to get the stack trace. Run with --debug option to get more log output. Run with --scan to get full insights.

* Get more help at https://help.gradle.org

Deprecated Gradle features were used in this build, making it incompatible with Gradle 5.0.
See https://docs.gradle.org/4.8/userguide/command_line_interface.html#sec:command_line_warnings

BUILD FAILED in 18m 22s
631 actionable tasks: 626 executed, 5 from cache

Publishing build scan...
https://gradle.com/s/4hdzjn2nr73b4

Build step 'Invoke Gradle script' changed build result to FAILURE
Build step 'Invoke Gradle script' marked build as failure