OSDir


[Date Prev][Date Next][Thread Prev][Thread Next][Date Index][Thread Index]

Build failed in Jenkins: PreCommit-ATLAS-Build-Test #349-master-ATLAS-2407-Fixed-EntityV2JerseyResourceIT.patch


See <https://builds.apache.org/job/PreCommit-ATLAS-Build-Test/349/display/redirect?page=changes>

Changes:

[ssubramanian] ATLAS-2643: Re-evaluate tag propagation when a relationship edge is

[amestry] ATLAS-2634: Avoid duplicate message processing.

------------------------------------------
[...truncated 467.63 KB...]
127.0.0.1 - - [04/May/2018:23:19:12 +0000] "GET //localhost:31000/api/atlas/v2/search/dsl?offset=0&query=Table&limit=10 HTTP/1.1" 200 4710 "-" "Java/1.8.0_172"
127.0.0.1 - - [04/May/2018:23:19:13 +0000] "GET //localhost:31000/api/atlas/v2/search/dsl?offset=0&query=Table+is+Dimension&limit=10 HTTP/1.1" 200 3137 "-" "Java/1.8.0_172"
127.0.0.1 - - [04/May/2018:23:19:13 +0000] "GET //localhost:31000/api/atlas/v2/search/dsl?offset=0&query=Column+where+Column+isa+PII&limit=10 HTTP/1.1" 200 1532 "-" "Java/1.8.0_172"
127.0.0.1 - - [04/May/2018:23:19:13 +0000] "GET //localhost:31000/api/atlas/v2/search/dsl?offset=0&query=View+is+Dimension&limit=10 HTTP/1.1" 200 1133 "-" "Java/1.8.0_172"
127.0.0.1 - - [04/May/2018:23:19:14 +0000] "GET //localhost:31000/api/atlas/v2/search/dsl?offset=0&query=Column+select+Column.name&limit=10 HTTP/1.1" 200 226 "-" "Java/1.8.0_172"
127.0.0.1 - - [04/May/2018:23:19:14 +0000] "GET //localhost:31000/api/atlas/v2/search/dsl?offset=0&query=Column+select+name&limit=10 HTTP/1.1" 200 203 "-" "Java/1.8.0_172"
127.0.0.1 - - [04/May/2018:23:19:14 +0000] "GET //localhost:31000/api/atlas/v2/search/dsl?offset=0&query=Column+where+Column.name%3D%22customer_id%22&limit=10 HTTP/1.1" 200 827 "-" "Java/1.8.0_172"
127.0.0.1 - - [04/May/2018:23:19:14 +0000] "GET //localhost:31000/api/atlas/v2/search/dsl?offset=0&query=from+Table+select+Table.name&limit=10 HTTP/1.1" 200 271 "-" "Java/1.8.0_172"
127.0.0.1 - - [04/May/2018:23:19:15 +0000] "GET //localhost:31000/api/atlas/v2/search/dsl?offset=0&query=DB+where+(name+%3D+%22Reporting%22)&limit=10 HTTP/1.1" 200 378 "-" "Java/1.8.0_172"
127.0.0.1 - - [04/May/2018:23:19:15 +0000] "GET //localhost:31000/api/atlas/v2/search/dsl?offset=0&query=DB+where+DB+is+JdbcAccess&limit=10 HTTP/1.1" 200 59 "-" "Java/1.8.0_172"
127.0.0.1 - - [04/May/2018:23:19:15 +0000] "GET //localhost:31000/api/atlas/v2/search/dsl?offset=0&query=DB+where+DB+has+name&limit=10 HTTP/1.1" 200 950 "-" "Java/1.8.0_172"
127.0.0.1 - - [04/May/2018:23:19:16 +0000] "GET //localhost:31000/api/atlas/v2/search/dsl?offset=0&query=DB+as+db1+Table+where+(db1.name+%3D+%22Reporting%22)&limit=10 HTTP/1.1" 200 82 "-" "Java/1.8.0_172"
127.0.0.1 - - [04/May/2018:23:19:16 +0000] "GET //localhost:31000/api/atlas/v2/search/dsl?offset=0&query=Dimension&limit=10 HTTP/1.1" 200 5683 "-" "Java/1.8.0_172"
127.0.0.1 - - [04/May/2018:23:19:16 +0000] "GET //localhost:31000/api/atlas/v2/search/dsl?offset=0&query=JdbcAccess&limit=10 HTTP/1.1" 200 1126 "-" "Java/1.8.0_172"
127.0.0.1 - - [04/May/2018:23:19:17 +0000] "GET //localhost:31000/api/atlas/v2/search/dsl?offset=0&query=ETL&limit=10 HTTP/1.1" 200 4521 "-" "Java/1.8.0_172"
127.0.0.1 - - [04/May/2018:23:19:17 +0000] "GET //localhost:31000/api/atlas/v2/search/dsl?offset=0&query=Metric&limit=10 HTTP/1.1" 200 3004 "-" "Java/1.8.0_172"
127.0.0.1 - - [04/May/2018:23:19:17 +0000] "GET //localhost:31000/api/atlas/v2/search/dsl?offset=0&query=PII&limit=10 HTTP/1.1" 200 1508 "-" "Java/1.8.0_172"
127.0.0.1 - - [04/May/2018:23:19:18 +0000] "GET //localhost:31000/api/atlas/v2/search/dsl?offset=0&query=%60Log+Data%60&limit=10 HTTP/1.1" 200 2134 "-" "Java/1.8.0_172"
127.0.0.1 - - [04/May/2018:23:19:18 +0000] "GET //localhost:31000/api/atlas/v2/search/dsl?offset=0&query=Table+where+name%3D%22sales_fact%22,+columns&limit=10 HTTP/1.1" 200 1367 "-" "Java/1.8.0_172"
127.0.0.1 - - [04/May/2018:23:19:18 +0000] "GET //localhost:31000/api/atlas/v2/search/dsl?offset=0&query=Table+where+name%3D%22sales_fact%22,+columns+as+column+select+column.name,+column.dataType,+column.comment&limit=10 HTTP/1.1" 200 350 "-" "Java/1.8.0_172"
127.0.0.1 - - [04/May/2018:23:19:19 +0000] "GET //localhost:31000/api/atlas/v2/search/dsl?offset=0&query=from+DataSet&limit=10 HTTP/1.1" 200 5387 "-" "Java/1.8.0_172"
127.0.0.1 - - [04/May/2018:23:19:19 +0000] "GET //localhost:31000/api/atlas/v2/search/dsl?offset=0&query=from+Process&limit=10 HTTP/1.1" 200 6853 "-" "Java/1.8.0_172"
127.0.0.1 - - [04/May/2018:23:19:19 +0000] "GET //localhost:31000/api/atlas/v2/entity/uniqueAttribute/type/Table?attr:qualifiedName=sales_fact_daily_mv HTTP/1.1" 200 3950 "-" "Java/1.8.0_172"
127.0.0.1 - - [04/May/2018:23:19:19 +0000] "GET //localhost:31000/api/atlas/v2/lineage/5145e6c4-d6cd-4c6c-b9b7-d99b4bbd0de9?depth=0&direction=BOTH HTTP/1.1" 200 3345 "-" "Java/1.8.0_172"
127.0.0.1 - - [04/May/2018:23:19:20 +0000] "GET //localhost:31000/api/atlas/v2/entity/uniqueAttribute/type/Table?attr:qualifiedName=sales_fact HTTP/1.1" 200 3381 "-" "Java/1.8.0_172"
127.0.0.1 - - [04/May/2018:23:19:20 +0000] "GET //localhost:31000/api/atlas/v2/entity/uniqueAttribute/type/DB?attr:name=Sales HTTP/1.1" 200 346 "-" "Java/1.8.0_172"
127.0.0.1 - - [04/May/2018:23:19:20 +0000] "GET //localhost:31000/api/atlas/v2/entity/guid/115ee235-ac75-43e8-94c5-423865f4725e/classifications HTTP/1.1" 200 160 "-" "Java/1.8.0_172"
127.0.0.1 - - [04/May/2018:23:19:20 +0000] "GET //localhost:31000/api/atlas/v2/entity/uniqueAttribute/type/LoadProcess?attr:qualifiedName=loadSalesDaily HTTP/1.1" 200 1866 "-" "Java/1.8.0_172"
127.0.0.1 - - [04/May/2018:23:19:20 +0000] "GET //localhost:31000/api/atlas/v2/entity/uniqueAttribute/type/Table?attr:qualifiedName=sales_fact HTTP/1.1" 200 3381 "-" "Java/1.8.0_172"
127.0.0.1 - - [04/May/2018:23:19:20 +0000] "GET //localhost:31000/api/atlas/v2/entity/uniqueAttribute/type/Table?attr:qualifiedName=time_dim HTTP/1.1" 200 2701 "-" "Java/1.8.0_172"
127.0.0.1 - - [04/May/2018:23:19:20 +0000] "GET //localhost:31000/api/atlas/v2/entity/uniqueAttribute/type/Table?attr:qualifiedName=sales_fact_daily_mv HTTP/1.1" 200 3950 "-" "Java/1.8.0_172"
127.0.0.1 - - [04/May/2018:23:19:20 +0000] "GET //localhost:31000/api/atlas/v2/entity/uniqueAttribute/type/Table?attr:qualifiedName=sales_fact HTTP/1.1" 200 3381 "-" "Java/1.8.0_172"
127.0.0.1 - - [04/May/2018:23:19:20 +0000] "GET //localhost:31000/api/atlas/v2/entity/uniqueAttribute/type/Table?attr:qualifiedName=time_dim HTTP/1.1" 200 2701 "-" "Java/1.8.0_172"
127.0.0.1 - - [04/May/2018:23:19:20 +0000] "GET //localhost:31000/api/atlas/v2/entity/uniqueAttribute/type/Table?attr:qualifiedName=sales_fact_daily_mv HTTP/1.1" 200 3950 "-" "Java/1.8.0_172"
127.0.0.1 - - [04/May/2018:23:19:20 +0000] "GET //localhost:31000/api/atlas/v2/entity/uniqueAttribute/type/Table?attr:qualifiedName=sales_fact_monthly_mv HTTP/1.1" 200 3882 "-" "Java/1.8.0_172"
127.0.0.1 - - [04/May/2018:23:19:20 +0000] "GET //localhost:31000/api/atlas/v2/entity/uniqueAttribute/type/LoadProcess?attr:qualifiedName=loadSalesDaily HTTP/1.1" 200 1866 "-" "Java/1.8.0_172"
127.0.0.1 - - [04/May/2018:23:19:20 +0000] "GET //localhost:31000/api/atlas/v2/entity/uniqueAttribute/type/LoadProcess?attr:qualifiedName=loadSalesMonthly HTTP/1.1" 200 1752 "-" "Java/1.8.0_172"
127.0.0.1 - - [04/May/2018:23:19:20 +0000] "GET //localhost:31000/api/atlas/v2/lineage/5145e6c4-d6cd-4c6c-b9b7-d99b4bbd0de9?depth=0&direction=BOTH HTTP/1.1" 200 3345 "-" "Java/1.8.0_172"
127.0.0.1 - - [04/May/2018:23:19:21 +0000] "GET //localhost:31000/api/atlas/v2/entity/uniqueAttribute/type/View?attr:qualifiedName=product_dim_view HTTP/1.1" 200 805 "-" "Java/1.8.0_172"
127.0.0.1 - - [04/May/2018:23:19:21 +0000] "GET //localhost:31000/api/atlas/v2/entity/uniqueAttribute/type/Table?attr:qualifiedName=product_dim HTTP/1.1" 200 2473 "-" "Java/1.8.0_172"
127.0.0.1 - - [04/May/2018:23:19:21 +0000] "GET //localhost:31000/api/atlas/v2/entity/uniqueAttribute/type/DB?attr:name=Sales HTTP/1.1" 200 346 "-" "Java/1.8.0_172"
Tests run: 120, Failures: 3, Errors: 0, Skipped: 0, Time elapsed: 149.197 sec <<< FAILURE! - in TestSuite
testAddNullPropertyValue(org.apache.atlas.web.integration.EntityV2JerseyResourceIT)  Time elapsed: 0.819 sec  <<< FAILURE!
org.testng.TestException: 
Method EntityV2JerseyResourceIT.testAddNullPropertyValue()[pri:0, instance:org.apache.atlas.web.integration.EntityV2JerseyResourceIT@5faae89c] should have thrown an exception of type class org.apache.atlas.exception.AtlasBaseException
	at org.testng.internal.Invoker.handleInvocationResults(Invoker.java:1426)
	at org.testng.internal.Invoker.invokeMethod(Invoker.java:701)
	at org.testng.internal.Invoker.invokeTestMethod(Invoker.java:845)
	at org.testng.internal.Invoker.invokeTestMethods(Invoker.java:1153)
	at org.testng.internal.TestMethodWorker.invokeTestMethods(TestMethodWorker.java:125)
	at org.testng.internal.TestMethodWorker.run(TestMethodWorker.java:108)
	at org.testng.TestRunner.privateRun(TestRunner.java:771)
	at org.testng.TestRunner.run(TestRunner.java:621)
	at org.testng.SuiteRunner.runTest(SuiteRunner.java:357)
	at org.testng.SuiteRunner.runSequentially(SuiteRunner.java:352)
	at org.testng.SuiteRunner.privateRun(SuiteRunner.java:310)
	at org.testng.SuiteRunner.run(SuiteRunner.java:259)
	at org.testng.SuiteRunnerWorker.runSuite(SuiteRunnerWorker.java:52)
	at org.testng.SuiteRunnerWorker.run(SuiteRunnerWorker.java:86)
	at org.testng.TestNG.runSuitesSequentially(TestNG.java:1199)
	at org.testng.TestNG.runSuitesLocally(TestNG.java:1124)
	at org.testng.TestNG.run(TestNG.java:1032)
	at org.apache.maven.surefire.testng.TestNGExecutor.run(TestNGExecutor.java:115)
	at org.apache.maven.surefire.testng.TestNGDirectoryTestSuite.executeMulti(TestNGDirectoryTestSuite.java:205)
	at org.apache.maven.surefire.testng.TestNGDirectoryTestSuite.execute(TestNGDirectoryTestSuite.java:108)
	at org.apache.maven.surefire.testng.TestNGProvider.invoke(TestNGProvider.java:111)
	at sun.reflect.NativeMethodAccessorImpl.invoke0(Native Method)
	at sun.reflect.NativeMethodAccessorImpl.invoke(NativeMethodAccessorImpl.java:62)
	at sun.reflect.DelegatingMethodAccessorImpl.invoke(DelegatingMethodAccessorImpl.java:43)
	at java.lang.reflect.Method.invoke(Method.java:498)
	at org.apache.maven.surefire.util.ReflectionUtils.invokeMethodWithArray2(ReflectionUtils.java:208)
	at org.apache.maven.surefire.booter.ProviderFactory$ProviderProxy.invoke(ProviderFactory.java:155)
	at org.apache.maven.surefire.booter.ProviderFactory.invokeProvider(ProviderFactory.java:81)
	at org.apache.maven.plugin.surefire.InPluginVMSurefireStarter.runSuitesInProcess(InPluginVMSurefireStarter.java:82)
	at org.apache.maven.plugin.surefire.AbstractSurefireMojo.executeProvider(AbstractSurefireMojo.java:974)
	at org.apache.maven.plugin.surefire.AbstractSurefireMojo.executeAfterPreconditionsChecked(AbstractSurefireMojo.java:824)
	at org.apache.maven.plugin.surefire.AbstractSurefireMojo.execute(AbstractSurefireMojo.java:722)
	at org.apache.maven.plugin.DefaultBuildPluginManager.executeMojo(DefaultBuildPluginManager.java:134)
	at org.apache.maven.lifecycle.internal.MojoExecutor.execute(MojoExecutor.java:208)
	at org.apache.maven.lifecycle.internal.MojoExecutor.execute(MojoExecutor.java:154)
	at org.apache.maven.lifecycle.internal.MojoExecutor.execute(MojoExecutor.java:146)
	at org.apache.maven.lifecycle.internal.LifecycleModuleBuilder.buildProject(LifecycleModuleBuilder.java:117)
	at org.apache.maven.lifecycle.internal.LifecycleModuleBuilder.buildProject(LifecycleModuleBuilder.java:81)
	at org.apache.maven.lifecycle.internal.builder.singlethreaded.SingleThreadedBuilder.build(SingleThreadedBuilder.java:51)
	at org.apache.maven.lifecycle.internal.LifecycleStarter.execute(LifecycleStarter.java:128)
	at org.apache.maven.DefaultMaven.doExecute(DefaultMaven.java:309)
	at org.apache.maven.DefaultMaven.doExecute(DefaultMaven.java:194)
	at org.apache.maven.DefaultMaven.execute(DefaultMaven.java:107)
	at org.apache.maven.cli.MavenCli.execute(MavenCli.java:955)
	at org.apache.maven.cli.MavenCli.doMain(MavenCli.java:290)
	at org.apache.maven.cli.MavenCli.main(MavenCli.java:194)
	at sun.reflect.NativeMethodAccessorImpl.invoke0(Native Method)
	at sun.reflect.NativeMethodAccessorImpl.invoke(NativeMethodAccessorImpl.java:62)
	at sun.reflect.DelegatingMethodAccessorImpl.invoke(DelegatingMethodAccessorImpl.java:43)
	at java.lang.reflect.Method.invoke(Method.java:498)
	at org.codehaus.plexus.classworlds.launcher.Launcher.launchEnhanced(Launcher.java:289)
	at org.codehaus.plexus.classworlds.launcher.Launcher.launch(Launcher.java:229)
	at org.codehaus.plexus.classworlds.launcher.Launcher.mainWithExitCode(Launcher.java:415)
	at org.codehaus.plexus.classworlds.launcher.Launcher.main(Launcher.java:356)

testAddProperty(org.apache.atlas.web.integration.EntityV2JerseyResourceIT)  Time elapsed: 0.245 sec  <<< FAILURE!
java.lang.AssertionError: expected object to not be null
	at org.testng.Assert.fail(Assert.java:94)
	at org.testng.Assert.assertNotNull(Assert.java:406)
	at org.testng.Assert.assertNotNull(Assert.java:391)
	at org.apache.atlas.web.integration.EntityV2JerseyResourceIT.addProperty(EntityV2JerseyResourceIT.java:368)
	at org.apache.atlas.web.integration.EntityV2JerseyResourceIT.testAddProperty(EntityV2JerseyResourceIT.java:296)

testGetEntityListForNoInstances(org.apache.atlas.web.integration.EntityV2JerseyResourceIT)  Time elapsed: 0.031 sec  <<< FAILURE!
java.lang.ClassCastException: org.apache.atlas.model.instance.AtlasEntityHeader cannot be cast to org.apache.atlas.model.instance.AtlasEntity
	at org.apache.atlas.web.integration.EntityV2JerseyResourceIT.lambda$testGetEntityListForNoInstances$0(EntityV2JerseyResourceIT.java:327)


Results :

Failed tests: 
  EntityV2JerseyResourceIT.testAddNullPropertyValue » Test 
Method EntityV2Jerse...
  EntityV2JerseyResourceIT.testAddProperty:296->addProperty:368 expected object to not be null
  EntityV2JerseyResourceIT.testGetEntityListForNoInstances:327->lambda$testGetEntityListForNoInstances$0:327 ClassCast

Tests run: 120, Failures: 3, Errors: 0, Skipped: 0

[INFO] 
[INFO] --- jetty-maven-plugin:9.3.14.v20161028:stop (stop-jetty) @ atlas-webapp ---
[INFO] Waiting 10 seconds for jetty to stop
[INFO] Stopped ServerConnector@736a4109{HTTP/1.1,[http/1.1]}{0.0.0.0:31000}
[INFO] Closing Spring root WebApplicationContext
[INFO] Shutting down log4j
[INFO] Stopped o.e.j.m.p.JettyWebAppContext@7dd717d7{/,file://<https://builds.apache.org/job/PreCommit-ATLAS-Build-Test/ws/webapp/target/atlas-webapp-1.0.0-SNAPSHOT/,UNAVAILABLE}{/home/jenkins/jenkins-slave/workspace/PreCommit-ATLAS-Build-Test/webapp/target/atlas-webapp-1.0.0-SNAPSHOT.war}>
[INFO] Server reports itself as stopped
[INFO] 
[INFO] --- maven-source-plugin:2.4:jar-no-fork (attach-sources) @ atlas-webapp ---
[INFO] Building jar: <https://builds.apache.org/job/PreCommit-ATLAS-Build-Test/ws/webapp/target/atlas-webapp-1.0.0-SNAPSHOT-sources.jar>
log4j:WARN No appenders could be found for logger (org.apache.zookeeper.ClientCnxn).
log4j:WARN Please initialize the log4j system properly.
log4j:WARN See http://logging.apache.org/log4j/1.2/faq.html#noconfig for more info.
[INFO] 
[INFO] --- maven-source-plugin:2.4:test-jar-no-fork (attach-sources) @ atlas-webapp ---
[INFO] Building jar: <https://builds.apache.org/job/PreCommit-ATLAS-Build-Test/ws/webapp/target/atlas-webapp-1.0.0-SNAPSHOT-test-sources.jar>
[INFO] 
[INFO] --- maven-failsafe-plugin:2.18.1:verify (verify) @ atlas-webapp ---
[INFO] Failsafe report directory: <https://builds.apache.org/job/PreCommit-ATLAS-Build-Test/ws/webapp/target/failsafe-reports>
[INFO] ------------------------------------------------------------------------
[INFO] Reactor Summary:
[INFO] 
[INFO] Apache Atlas Server Build Tools .................... SUCCESS [  0.768 s]
[INFO] apache-atlas ....................................... SUCCESS [  3.407 s]
[INFO] Apache Atlas Test Utility Tools .................... SUCCESS [  5.062 s]
[INFO] Open Connector Framework (OCF) ..................... SUCCESS [  1.983 s]
[INFO] Open Metadata Repository Services (OMRS) ........... SUCCESS [  6.160 s]
[INFO] Open Metadata and Governance (OMAG) Server APIs .... SUCCESS [  0.951 s]
[INFO] Connected Asset Open Metadata Access Service (OMAS)  SUCCESS [  1.329 s]
[INFO] Asset Consumer Open Metadata Access Service (OMAS) . SUCCESS [  1.007 s]
[INFO] Open Metadata and Governance (OMAG) Server ......... SUCCESS [  1.095 s]
[INFO] Apache Atlas Integration ........................... SUCCESS [ 39.243 s]
[INFO] Apache Atlas Common ................................ SUCCESS [  2.476 s]
[INFO] Apache Atlas Client ................................ SUCCESS [  0.139 s]
[INFO] atlas-client-common ................................ SUCCESS [  0.663 s]
[INFO] atlas-client-v1 .................................... SUCCESS [  2.658 s]
[INFO] Apache Atlas Server API ............................ SUCCESS [  0.782 s]
[INFO] Apache Atlas Notification .......................... SUCCESS [ 16.214 s]
[INFO] atlas-client-v2 .................................... SUCCESS [  0.812 s]
[INFO] Apache Atlas Graph Database Projects ............... SUCCESS [  0.121 s]
[INFO] Apache Atlas Graph Database API .................... SUCCESS [  0.694 s]
[INFO] Graph Database Common Code ......................... SUCCESS [  0.842 s]
[INFO] Apache Atlas JanusGraph DB Impl .................... SUCCESS [02:26 min]
[INFO] Apache Atlas Graph Database Implementation Dependencies SUCCESS [  1.807 s]
[INFO] Shaded version of Apache hbase client .............. SUCCESS [  7.928 s]
[INFO] Shaded version of Apache hbase server .............. SUCCESS [ 21.050 s]
[INFO] Apache Atlas Authorization ......................... SUCCESS [  2.367 s]
[INFO] Apache Atlas Repository ............................ SUCCESS [03:06 min]
[INFO] Apache Atlas UI .................................... SUCCESS [01:51 min]
[INFO] Apache Atlas Web Application ....................... FAILURE [09:09 min]
[INFO] Apache Atlas Documentation ......................... SKIPPED
[INFO] Apache Atlas FileSystem Model ...................... SKIPPED
[INFO] Apache Atlas Plugin Classloader .................... SKIPPED
[INFO] Apache Atlas Hive Bridge Shim ...................... SKIPPED
[INFO] Apache Atlas Hive Bridge ........................... SKIPPED
[INFO] Apache Atlas Falcon Bridge Shim .................... SKIPPED
[INFO] Apache Atlas Falcon Bridge ......................... SKIPPED
[INFO] Apache Atlas Sqoop Bridge Shim ..................... SKIPPED
[INFO] Apache Atlas Sqoop Bridge .......................... SKIPPED
[INFO] Apache Atlas Storm Bridge Shim ..................... SKIPPED
[INFO] Apache Atlas Storm Bridge .......................... SKIPPED
[INFO] Apache Atlas Hbase Bridge Shim ..................... SKIPPED
[INFO] Apache Atlas Hbase Bridge .......................... SKIPPED
[INFO] Apache Atlas Kafka Bridge .......................... SKIPPED
[INFO] Apache Atlas Distribution .......................... SKIPPED
[INFO] ------------------------------------------------------------------------
[INFO] BUILD FAILURE
[INFO] ------------------------------------------------------------------------
[INFO] Total time: 18:34 min
[INFO] Finished at: 2018-05-04T23:19:26Z
[INFO] Final Memory: 367M/2043M
[INFO] ------------------------------------------------------------------------
[ERROR] Failed to execute goal org.apache.maven.plugins:maven-failsafe-plugin:2.18.1:verify (verify) on project atlas-webapp: There are test failures.
[ERROR] 
[ERROR] Please refer to <https://builds.apache.org/job/PreCommit-ATLAS-Build-Test/ws/webapp/target/failsafe-reports> for the individual test results.
[ERROR] -> [Help 1]
[ERROR] 
[ERROR] To see the full stack trace of the errors, re-run Maven with the -e switch.
[ERROR] Re-run Maven using the -X switch to enable full debug logging.
[ERROR] 
[ERROR] For more information about the errors and possible solutions, please read the following articles:
[ERROR] [Help 1] http://cwiki.apache.org/confluence/display/MAVEN/MojoFailureException
[ERROR] 
[ERROR] After correcting the problems, you can resume the build with the command
[ERROR]   mvn <goals> -rf :atlas-webapp




{color:red}-1 overall{color}.  

    {color:green}+1 @author{color}.  The patch does not contain any @author tags.

Console output: https://builds.apache.org/job/PreCommit-ATLAS-Build-Test/349//console

This message is automatically generated.


======================================================================
======================================================================
    Adding comment to Jira.
======================================================================
======================================================================




======================================================================
======================================================================
    Finished build.
======================================================================
======================================================================


+ EXIT_CODE=1
+ '[' -d <https://builds.apache.org/job/PreCommit-ATLAS-Build-Test/ws/../atlas_patchprocess_23364> ']'
+ '[' -d <https://builds.apache.org/job/PreCommit-ATLAS-Build-Test/ws/atlas_patchprocess_23364> ']'
+ mv <https://builds.apache.org/job/PreCommit-ATLAS-Build-Test/ws/atlas_patchprocess_23364> <https://builds.apache.org/job/PreCommit-ATLAS-Build-Test/ws/patchprocess>
+ rm -f <https://builds.apache.org/job/PreCommit-ATLAS-Build-Test/ws/../atlas_patchprocess_23364>
+ exit 1
Build step 'Execute shell' marked build as failure
Set build name.
New build name is '#349-master-ATLAS-2407-Fixed-EntityV2JerseyResourceIT.patch'
Archiving artifacts
[Fast Archiver] Compressed 164.69 MB of artifacts by 84.4% relative to #343