OSDir


[Date Prev][Date Next][Thread Prev][Thread Next][Date Index][Thread Index]

Build failed in Jenkins: Atlas-master-UnitTests #1262


See <https://builds.apache.org/job/Atlas-master-UnitTests/1262/display/redirect>

------------------------------------------
[...truncated 173.53 KB...]
[INFO] --- maven-resources-plugin:2.7:testResources (default-testResources) @ atlas-repository ---
[INFO] Using 'UTF-8' encoding to copy filtered resources.
[INFO] Copying 35 resources
[INFO] Copying 3 resources
[INFO] 
[INFO] --- maven-compiler-plugin:3.7.0:testCompile (default-testCompile) @ atlas-repository ---
[INFO] Changes detected - recompiling the module!
[INFO] Compiling 43 source files to <https://builds.apache.org/job/Atlas-master-UnitTests/ws/repository/target/test-classes>
[INFO] <https://builds.apache.org/job/Atlas-master-UnitTests/ws/repository/src/test/java/org/apache/atlas/query/BasicTestSetup.java>: <https://builds.apache.org/job/Atlas-master-UnitTests/ws/repository/src/test/java/org/apache/atlas/query/BasicTestSetup.java> uses or overrides a deprecated API.
[INFO] <https://builds.apache.org/job/Atlas-master-UnitTests/ws/repository/src/test/java/org/apache/atlas/query/BasicTestSetup.java>: Recompile with -Xlint:deprecation for details.
[INFO] <https://builds.apache.org/job/Atlas-master-UnitTests/ws/repository/src/test/java/org/apache/atlas/repository/store/graph/v1/InverseReferenceUpdateV1Test.java>: Some input files use unchecked or unsafe operations.
[INFO] <https://builds.apache.org/job/Atlas-master-UnitTests/ws/repository/src/test/java/org/apache/atlas/repository/store/graph/v1/InverseReferenceUpdateV1Test.java>: Recompile with -Xlint:unchecked for details.
[INFO] 
[INFO] --- maven-surefire-plugin:2.18.1:test (default-test) @ atlas-repository ---
[INFO] Surefire report directory: <https://builds.apache.org/job/Atlas-master-UnitTests/ws/repository/target/surefire-reports>
[INFO] Using configured provider org.apache.maven.surefire.testng.TestNGProvider

-------------------------------------------------------
 T E S T S
-------------------------------------------------------
Running org.apache.atlas.glossary.GlossaryServiceTest
Running org.apache.atlas.utils.ObjectUpdateSynchronizerTest
Running org.apache.atlas.TestModules
Running org.apache.atlas.repository.impexp.ExportServiceTest
Running org.apache.atlas.repository.migration.HiveStocksTest
Running org.apache.atlas.repository.impexp.ImportTransformerTest
Running org.apache.atlas.repository.tagpropagation.ClassificationPropagationTest
Running org.apache.atlas.repository.store.graph.v1.AtlasEntityDefStoreV1Test
Running org.apache.atlas.utils.TestResourceFileUtils
Running org.apache.atlas.repository.migration.MigrationProgressServiceTest
Running org.apache.atlas.repository.impexp.AtlasImportRequestTest
Running org.apache.atlas.repository.store.graph.v1.AtlasRelationshipStoreV1Test
Tests run: 0, Failures: 0, Errors: 0, Skipped: 0, Time elapsed: 0.774 sec - in org.apache.atlas.TestModules
Tests run: 9, Failures: 0, Errors: 0, Skipped: 0, Time elapsed: 1.477 sec - in org.apache.atlas.utils.ObjectUpdateSynchronizerTest
Running org.apache.atlas.repository.migration.RelationshipMappingTest
Running org.apache.atlas.repository.audit.InMemoryAuditRepositoryTest
Tests run: 0, Failures: 0, Errors: 0, Skipped: 0, Time elapsed: 2.472 sec - in org.apache.atlas.utils.TestResourceFileUtils
Running org.apache.atlas.query.DSLQueriesTest
Running org.apache.atlas.repository.impexp.UniqueListTest
Running org.apache.atlas.repository.store.graph.v1.InverseReferenceUpdateV1Test
Running org.apache.atlas.repository.store.graph.v1.InverseReferenceUpdateSoftDeleteV1Test
Running org.apache.atlas.repository.store.graph.v1.InverseReferenceUpdateHardDeleteV1Test
Running org.apache.atlas.glossary.PaginationHelperTest
Running org.apache.atlas.repository.store.graph.v1.AtlasRelationshipStoreSoftDeleteV1Test
Tests run: 8, Failures: 0, Errors: 0, Skipped: 0, Time elapsed: 3.507 sec - in org.apache.atlas.repository.impexp.ImportTransformerTest
Running org.apache.atlas.repository.impexp.TypeAttributeDifferenceTest
Running org.apache.atlas.repository.store.graph.AtlasTypeDefGraphStoreTest
Running org.apache.atlas.repository.impexp.ImportTransformerJSONTest
Tests run: 0, Failures: 0, Errors: 0, Skipped: 0, Time elapsed: 3.838 sec - in org.apache.atlas.repository.store.graph.v1.AtlasRelationshipStoreV1Test
Running org.apache.atlas.repository.store.graph.v1.AtlasRelationshipStoreHardDeleteV1Test
Tests run: 0, Failures: 0, Errors: 0, Skipped: 0, Time elapsed: 1.512 sec - in org.apache.atlas.repository.store.graph.v1.InverseReferenceUpdateV1Test
Tests run: 6, Failures: 0, Errors: 0, Skipped: 0, Time elapsed: 4.424 sec - in org.apache.atlas.repository.impexp.AtlasImportRequestTest
Tests run: 4, Failures: 0, Errors: 0, Skipped: 0, Time elapsed: 4.479 sec - in org.apache.atlas.repository.migration.MigrationProgressServiceTest
Tests run: 6, Failures: 0, Errors: 0, Skipped: 0, Time elapsed: 2.97 sec - in org.apache.atlas.repository.audit.InMemoryAuditRepositoryTest
Running org.apache.atlas.services.MetricsServiceTest
Tests run: 4, Failures: 0, Errors: 0, Skipped: 0, Time elapsed: 1.907 sec - in org.apache.atlas.repository.impexp.UniqueListTest
Tests run: 20, Failures: 0, Errors: 0, Skipped: 0, Time elapsed: 1.926 sec - in org.apache.atlas.glossary.PaginationHelperTest
Running org.apache.atlas.repository.migration.HiveParititionTest
Running org.apache.atlas.repository.impexp.ZipSinkTest
Running org.apache.atlas.query.GremlinQueryComposerTest
Tests run: 1, Failures: 0, Errors: 0, Skipped: 0, Time elapsed: 1.493 sec - in org.apache.atlas.repository.impexp.ImportTransformerJSONTest
Running org.apache.atlas.repository.migration.PathTest
Running org.apache.atlas.repository.impexp.ZipSourceTest
Running org.apache.atlas.repository.userprofile.UserProfileServiceTest
Running org.apache.atlas.repository.store.graph.v1.AtlasEntityStoreV1BulkImportPercentTest
Running org.apache.atlas.repository.impexp.ImportServiceTest
Running org.apache.atlas.query.DSLParsingTest
Running org.apache.atlas.repository.impexp.ImportTransformsTest
Running org.apache.atlas.repository.store.graph.v1.AtlasRelationshipDefStoreV1Test
Running org.apache.atlas.repository.store.graph.v1.AtlasEntityStoreV1Test
Running org.apache.atlas.repository.audit.CassandraAuditRepositoryTest
Tests run: 6, Failures: 0, Errors: 0, Skipped: 0, Time elapsed: 2.865 sec - in org.apache.atlas.repository.impexp.TypeAttributeDifferenceTest
Tests run: 9, Failures: 0, Errors: 0, Skipped: 0, Time elapsed: 2.813 sec - in org.apache.atlas.repository.store.graph.v1.AtlasEntityStoreV1BulkImportPercentTest
Tests run: 6, Failures: 0, Errors: 0, Skipped: 0, Time elapsed: 3.227 sec - in org.apache.atlas.repository.impexp.ZipSourceTest
Tests run: 8, Failures: 0, Errors: 0, Skipped: 0, Time elapsed: 4.364 sec - in org.apache.atlas.repository.impexp.ZipSinkTest
Tests run: 8, Failures: 0, Errors: 0, Skipped: 0, Time elapsed: 4.671 sec - in org.apache.atlas.query.DSLParsingTest
Tests run: 3, Failures: 0, Errors: 0, Skipped: 0, Time elapsed: 4.854 sec - in org.apache.atlas.repository.impexp.ImportTransformsTest
Tests run: 39, Failures: 0, Errors: 0, Skipped: 0, Time elapsed: 13.439 sec - in org.apache.atlas.query.GremlinQueryComposerTest
Tests run: 6, Failures: 0, Errors: 0, Skipped: 0, Time elapsed: 20.791 sec - in org.apache.atlas.repository.audit.CassandraAuditRepositoryTest
Tests run: 1, Failures: 0, Errors: 0, Skipped: 0, Time elapsed: 24.41 sec - in org.apache.atlas.services.MetricsServiceTest
Tests run: 1, Failures: 0, Errors: 0, Skipped: 0, Time elapsed: 55.763 sec - in org.apache.atlas.repository.store.graph.v1.AtlasEntityDefStoreV1Test
Tests run: 10, Failures: 0, Errors: 0, Skipped: 0, Time elapsed: 56.001 sec - in org.apache.atlas.repository.store.graph.v1.AtlasRelationshipDefStoreV1Test
Tests run: 1, Failures: 0, Errors: 0, Skipped: 0, Time elapsed: 63.621 sec - in org.apache.atlas.repository.migration.RelationshipMappingTest
Tests run: 4, Failures: 0, Errors: 0, Skipped: 0, Time elapsed: 69.62 sec - in org.apache.atlas.repository.store.graph.v1.AtlasRelationshipStoreSoftDeleteV1Test
Tests run: 5, Failures: 4, Errors: 0, Skipped: 0, Time elapsed: 66.622 sec <<< FAILURE! - in org.apache.atlas.repository.store.graph.v1.InverseReferenceUpdateHardDeleteV1Test
testInverseReferenceAutoUpdate_Map(org.apache.atlas.repository.store.graph.v1.InverseReferenceUpdateHardDeleteV1Test)  Time elapsed: 0.819 sec  <<< FAILURE!
java.lang.AssertionError: expected [null] but found [AtlasObjectId{guid='dc7b3c4f-386d-4d5f-889f-df3ba816b075', typeName='A', uniqueAttributes={}}]
	at org.testng.Assert.fail(Assert.java:94)
	at org.testng.Assert.failNotSame(Assert.java:492)
	at org.testng.Assert.assertNull(Assert.java:428)
	at org.testng.Assert.assertNull(Assert.java:417)
	at org.apache.atlas.repository.store.graph.v1.InverseReferenceUpdateV1Test.verifyReferenceValue(InverseReferenceUpdateV1Test.java:362)
	at org.apache.atlas.repository.store.graph.v1.InverseReferenceUpdateHardDeleteV1Test.verify_testInverseReferenceAutoUpdate_Map(InverseReferenceUpdateHardDeleteV1Test.java:71)

testInverseReferenceAutoUpdate_NonCompositeManyToOne(org.apache.atlas.repository.store.graph.v1.InverseReferenceUpdateHardDeleteV1Test)  Time elapsed: 0.921 sec  <<< FAILURE!
java.lang.AssertionError: expected [null] but found [AtlasObjectId{guid='14161cba-3972-442d-adf1-eea842fb47fd', typeName='B', uniqueAttributes={}}]
	at org.testng.Assert.fail(Assert.java:94)
	at org.testng.Assert.failNotSame(Assert.java:492)
	at org.testng.Assert.assertNull(Assert.java:428)
	at org.testng.Assert.assertNull(Assert.java:417)
	at org.apache.atlas.repository.store.graph.v1.InverseReferenceUpdateV1Test.verifyReferenceValue(InverseReferenceUpdateV1Test.java:362)
	at org.apache.atlas.repository.store.graph.v1.InverseReferenceUpdateHardDeleteV1Test.verify_testInverseReferenceAutoUpdate_NonCompositeManyToOne(InverseReferenceUpdateHardDeleteV1Test.java:48)

testInverseReferenceAutoUpdate_NonComposite_OneToMany(org.apache.atlas.repository.store.graph.v1.InverseReferenceUpdateHardDeleteV1Test)  Time elapsed: 0.373 sec  <<< FAILURE!
java.lang.AssertionError: expected [1] but found [2]
	at org.testng.Assert.fail(Assert.java:94)
	at org.testng.Assert.failNotEquals(Assert.java:496)
	at org.testng.Assert.assertEquals(Assert.java:125)
	at org.testng.Assert.assertEquals(Assert.java:372)
	at org.testng.Assert.assertEquals(Assert.java:382)
	at org.apache.atlas.repository.store.graph.v1.InverseReferenceUpdateV1Test.verifyReferenceList(InverseReferenceUpdateV1Test.java:375)
	at org.apache.atlas.repository.store.graph.v1.InverseReferenceUpdateHardDeleteV1Test.verify_testInverseReferenceAutoUpdate_NonComposite_OneToMany(InverseReferenceUpdateHardDeleteV1Test.java:42)

testInverseReferenceAutoUpdate_NonComposite_OneToOne(org.apache.atlas.repository.store.graph.v1.InverseReferenceUpdateHardDeleteV1Test)  Time elapsed: 0.603 sec  <<< FAILURE!
java.lang.AssertionError: expected [null] but found [AtlasObjectId{guid='55b7152f-edd7-4681-aaa5-6378389b3172', typeName='B', uniqueAttributes={}}]
	at org.testng.Assert.fail(Assert.java:94)
	at org.testng.Assert.failNotSame(Assert.java:492)
	at org.testng.Assert.assertNull(Assert.java:428)
	at org.testng.Assert.assertNull(Assert.java:417)
	at org.apache.atlas.repository.store.graph.v1.InverseReferenceUpdateV1Test.verifyReferenceValue(InverseReferenceUpdateV1Test.java:362)
	at org.apache.atlas.repository.store.graph.v1.InverseReferenceUpdateHardDeleteV1Test.verify_testInverseReferenceAutoUpdate_NonComposite_OneToOne(InverseReferenceUpdateHardDeleteV1Test.java:58)

Tests run: 12, Failures: 0, Errors: 0, Skipped: 0, Time elapsed: 75.141 sec - in org.apache.atlas.repository.impexp.ExportServiceTest
Tests run: 5, Failures: 0, Errors: 0, Skipped: 0, Time elapsed: 72.508 sec - in org.apache.atlas.repository.store.graph.v1.InverseReferenceUpdateSoftDeleteV1Test
Tests run: 4, Failures: 0, Errors: 0, Skipped: 0, Time elapsed: 71.808 sec - in org.apache.atlas.repository.store.graph.v1.AtlasRelationshipStoreHardDeleteV1Test
Tests run: 12, Failures: 0, Errors: 0, Skipped: 0, Time elapsed: 71.874 sec - in org.apache.atlas.repository.userprofile.UserProfileServiceTest
Tests run: 18, Failures: 0, Errors: 0, Skipped: 0, Time elapsed: 98.813 sec - in org.apache.atlas.repository.store.graph.AtlasTypeDefGraphStoreTest
Tests run: 35, Failures: 0, Errors: 0, Skipped: 0, Time elapsed: 118.42 sec - in org.apache.atlas.glossary.GlossaryServiceTest
Tests run: 1, Failures: 0, Errors: 0, Skipped: 0, Time elapsed: 111.134 sec - in org.apache.atlas.repository.migration.PathTest
Tests run: 1, Failures: 0, Errors: 0, Skipped: 0, Time elapsed: 116.596 sec - in org.apache.atlas.repository.migration.HiveStocksTest
Tests run: 1, Failures: 0, Errors: 0, Skipped: 0, Time elapsed: 113.148 sec - in org.apache.atlas.repository.migration.HiveParititionTest
Tests run: 16, Failures: 1, Errors: 0, Skipped: 0, Time elapsed: 122.479 sec <<< FAILURE! - in org.apache.atlas.repository.store.graph.v1.AtlasEntityStoreV1Test
testMapOfPrimitivesUpdate(org.apache.atlas.repository.store.graph.v1.AtlasEntityStoreV1Test)  Time elapsed: 0.001 sec  <<< FAILURE!
java.lang.AssertionError: expected [1] but found [2]
	at org.testng.Assert.fail(Assert.java:94)
	at org.testng.Assert.failNotEquals(Assert.java:496)
	at org.testng.Assert.assertEquals(Assert.java:125)
	at org.testng.Assert.assertEquals(Assert.java:372)
	at org.testng.Assert.assertEquals(Assert.java:382)
	at org.apache.atlas.repository.store.graph.v1.AtlasEntityStoreV1Test.validateMutationResponse(AtlasEntityStoreV1Test.java:1035)
	at org.apache.atlas.repository.store.graph.v1.AtlasEntityStoreV1Test.testMapOfPrimitivesUpdate(AtlasEntityStoreV1Test.java:467)

Tests run: 9, Failures: 0, Errors: 0, Skipped: 0, Time elapsed: 129.563 sec - in org.apache.atlas.repository.tagpropagation.ClassificationPropagationTest
Tests run: 14, Failures: 0, Errors: 0, Skipped: 0, Time elapsed: 125.26 sec - in org.apache.atlas.repository.impexp.ImportServiceTest
Tests run: 246, Failures: 0, Errors: 0, Skipped: 0, Time elapsed: 186.718 sec - in org.apache.atlas.query.DSLQueriesTest

Results :

Failed tests: 
  AtlasEntityStoreV1Test.testMapOfPrimitivesUpdate:467->validateMutationResponse:1035 expected [1] but found [2]
  InverseReferenceUpdateHardDeleteV1Test>InverseReferenceUpdateV1Test.testInverseReferenceAutoUpdate_Map:354->verify_testInverseReferenceAutoUpdate_Map:71->InverseReferenceUpdateV1Test.verifyReferenceValue:362 expected [null] but found [AtlasObjectId{guid='dc7b3c4f-386d-4d5f-889f-df3ba816b075', typeName='A', uniqueAttributes={}}]
  InverseReferenceUpdateHardDeleteV1Test>InverseReferenceUpdateV1Test.testInverseReferenceAutoUpdate_NonCompositeManyToOne:201->verify_testInverseReferenceAutoUpdate_NonCompositeManyToOne:48->InverseReferenceUpdateV1Test.verifyReferenceValue:362 expected [null] but found [AtlasObjectId{guid='14161cba-3972-442d-adf1-eea842fb47fd', typeName='B', uniqueAttributes={}}]
  InverseReferenceUpdateHardDeleteV1Test>InverseReferenceUpdateV1Test.testInverseReferenceAutoUpdate_NonComposite_OneToMany:141->verify_testInverseReferenceAutoUpdate_NonComposite_OneToMany:42->InverseReferenceUpdateV1Test.verifyReferenceList:375 expected [1] but found [2]
  InverseReferenceUpdateHardDeleteV1Test>InverseReferenceUpdateV1Test.testInverseReferenceAutoUpdate_NonComposite_OneToOne:255->verify_testInverseReferenceAutoUpdate_NonComposite_OneToOne:58->InverseReferenceUpdateV1Test.verifyReferenceValue:362 expected [null] but found [AtlasObjectId{guid='55b7152f-edd7-4681-aaa5-6378389b3172', typeName='B', uniqueAttributes={}}]

Tests run: 539, Failures: 5, Errors: 0, Skipped: 0

[INFO] ------------------------------------------------------------------------
[INFO] Reactor Summary:
[INFO] 
[INFO] Apache Atlas Server Build Tools .................... SUCCESS [  0.578 s]
[INFO] apache-atlas ....................................... SUCCESS [  2.240 s]
[INFO] Apache Atlas Test Utility Tools .................... SUCCESS [  4.567 s]
[INFO] Open Connector Framework (OCF) ..................... SUCCESS [  1.590 s]
[INFO] Open Metadata Repository Services (OMRS) ........... SUCCESS [  6.183 s]
[INFO] Open Metadata and Governance (OMAG) Server APIs .... SUCCESS [  0.791 s]
[INFO] Connected Asset Open Metadata Access Service (OMAS)  SUCCESS [  0.963 s]
[INFO] Asset Consumer Open Metadata Access Service (OMAS) . SUCCESS [  0.958 s]
[INFO] Open Metadata and Governance (OMAG) Server ......... SUCCESS [  0.650 s]
[INFO] Apache Atlas Integration ........................... SUCCESS [ 38.958 s]
[INFO] Apache Atlas Common ................................ SUCCESS [  2.025 s]
[INFO] Apache Atlas Client ................................ SUCCESS [  0.097 s]
[INFO] atlas-client-common ................................ SUCCESS [  0.595 s]
[INFO] atlas-client-v1 .................................... SUCCESS [  2.528 s]
[INFO] Apache Atlas Server API ............................ SUCCESS [  0.664 s]
[INFO] Apache Atlas Notification .......................... SUCCESS [ 24.554 s]
[INFO] atlas-client-v2 .................................... SUCCESS [  0.560 s]
[INFO] Apache Atlas Graph Database Projects ............... SUCCESS [  0.069 s]
[INFO] Apache Atlas Graph Database API .................... SUCCESS [  0.510 s]
[INFO] Graph Database Common Code ......................... SUCCESS [  0.707 s]
[INFO] Apache Atlas JanusGraph DB Impl .................... SUCCESS [02:33 min]
[INFO] Apache Atlas Graph Database Implementation Dependencies SUCCESS [  1.907 s]
[INFO] Shaded version of Apache hbase client .............. SUCCESS [  7.149 s]
[INFO] Shaded version of Apache hbase server .............. SUCCESS [ 19.303 s]
[INFO] Apache Atlas Authorization ......................... SUCCESS [  3.972 s]
[INFO] Apache Atlas Repository ............................ FAILURE [03:20 min]
[INFO] Apache Atlas UI .................................... SKIPPED
[INFO] Apache Atlas Web Application ....................... SKIPPED
[INFO] Apache Atlas Documentation ......................... SKIPPED
[INFO] Apache Atlas FileSystem Model ...................... SKIPPED
[INFO] Apache Atlas Plugin Classloader .................... SKIPPED
[INFO] Apache Atlas Hive Bridge Shim ...................... SKIPPED
[INFO] Apache Atlas Hive Bridge ........................... SKIPPED
[INFO] Apache Atlas Falcon Bridge Shim .................... SKIPPED
[INFO] Apache Atlas Falcon Bridge ......................... SKIPPED
[INFO] Apache Atlas Sqoop Bridge Shim ..................... SKIPPED
[INFO] Apache Atlas Sqoop Bridge .......................... SKIPPED
[INFO] Apache Atlas Storm Bridge Shim ..................... SKIPPED
[INFO] Apache Atlas Storm Bridge .......................... SKIPPED
[INFO] Apache Atlas Hbase Bridge Shim ..................... SKIPPED
[INFO] Apache Atlas Hbase Bridge .......................... SKIPPED
[INFO] Apache Atlas Kafka Bridge .......................... SKIPPED
[INFO] Apache Atlas Distribution .......................... SKIPPED
[INFO] ------------------------------------------------------------------------
[INFO] BUILD FAILURE
[INFO] ------------------------------------------------------------------------
[INFO] Total time: 07:57 min
[INFO] Finished at: 2018-05-04T21:34:58Z
[INFO] Final Memory: 137M/1904M
[INFO] ------------------------------------------------------------------------
[ERROR] Failed to execute goal org.apache.maven.plugins:maven-surefire-plugin:2.18.1:test (default-test) on project atlas-repository: There are test failures.
[ERROR] 
[ERROR] Please refer to <https://builds.apache.org/job/Atlas-master-UnitTests/ws/repository/target/surefire-reports> for the individual test results.
[ERROR] -> [Help 1]
[ERROR] 
[ERROR] To see the full stack trace of the errors, re-run Maven with the -e switch.
[ERROR] Re-run Maven using the -X switch to enable full debug logging.
[ERROR] 
[ERROR] For more information about the errors and possible solutions, please read the following articles:
[ERROR] [Help 1] http://cwiki.apache.org/confluence/display/MAVEN/MojoFailureException
[ERROR] 
[ERROR] After correcting the problems, you can resume the build with the command
[ERROR]   mvn <goals> -rf :atlas-repository
Build step 'Execute shell' marked build as failure
[CHECKSTYLE] Collecting checkstyle analysis files...
[CHECKSTYLE] Searching for all files in <https://builds.apache.org/job/Atlas-master-UnitTests/ws/> that match the pattern **/target/checkstyle-result.xml
[CHECKSTYLE] No files found. Configuration error?
<Git Blamer> Using GitBlamer to create author and commit information for all warnings.
<Git Blamer> GIT_COMMIT=967bf67eb6858c91c97b13e2b1c60caa1d51299c, workspace=<https://builds.apache.org/job/Atlas-master-UnitTests/ws/>
[CHECKSTYLE] Computing warning deltas based on reference build #1256
[FINDBUGS] Collecting findbugs analysis files...
[FINDBUGS] Searching for all files in <https://builds.apache.org/job/Atlas-master-UnitTests/ws/> that match the pattern **/target/findbugs.xml
[FINDBUGS] No files found. Configuration error?
<Git Blamer> Using GitBlamer to create author and commit information for all warnings.
<Git Blamer> GIT_COMMIT=967bf67eb6858c91c97b13e2b1c60caa1d51299c, workspace=<https://builds.apache.org/job/Atlas-master-UnitTests/ws/>
[FINDBUGS] Computing warning deltas based on reference build #1256
Archiving artifacts
TestNG Reports Processing: START
Looking for TestNG results report in workspace using pattern: **/target/surefire-reports/testng-results.xml,**/target/failsafe-reports/testng-results.xml
Saving reports...
Processing '/x1/jenkins/jenkins-home/jobs/Atlas-master-UnitTests/builds/1262/testng/testng-results-1.xml'
Processing '/x1/jenkins/jenkins-home/jobs/Atlas-master-UnitTests/builds/1262/testng/testng-results-2.xml'
Processing '/x1/jenkins/jenkins-home/jobs/Atlas-master-UnitTests/builds/1262/testng/testng-results-3.xml'
Processing '/x1/jenkins/jenkins-home/jobs/Atlas-master-UnitTests/builds/1262/testng/testng-results-4.xml'
Processing '/x1/jenkins/jenkins-home/jobs/Atlas-master-UnitTests/builds/1262/testng/testng-results-5.xml'
Processing '/x1/jenkins/jenkins-home/jobs/Atlas-master-UnitTests/builds/1262/testng/testng-results-6.xml'
Processing '/x1/jenkins/jenkins-home/jobs/Atlas-master-UnitTests/builds/1262/testng/testng-results-7.xml'
Processing '/x1/jenkins/jenkins-home/jobs/Atlas-master-UnitTests/builds/1262/testng/testng-results.xml'
TestNG Reports Processing: FINISH