OSDir


[Date Prev][Date Next][Thread Prev][Thread Next][Date Index][Thread Index]

Build failed in Jenkins: PreCommit-ATLAS-Build-Test #346-master-ATLAS-2634-Avoid-duplicate-message-processing.patch


See <https://builds.apache.org/job/PreCommit-ATLAS-Build-Test/346/display/redirect?page=changes>

Changes:

[ssubramanian] ATLAS-2521: Remove Titan 0.5.4 support from Atlas #2

[ssubramanian] ATLAS-2643: Re-evaluate tag propagation when a relationship edge is

------------------------------------------
[...truncated 230.21 KB...]
[INFO] --- maven-surefire-plugin:2.18.1:test (default-test) @ atlas-repository ---
[INFO] Surefire report directory: <https://builds.apache.org/job/PreCommit-ATLAS-Build-Test/ws/repository/target/surefire-reports>
[INFO] Using configured provider org.apache.maven.surefire.testng.TestNGProvider

-------------------------------------------------------
 T E S T S
-------------------------------------------------------
Running org.apache.atlas.query.DSLQueriesTest
Running org.apache.atlas.repository.store.graph.v1.AtlasEntityStoreV1Test
Running org.apache.atlas.utils.TestResourceFileUtils
Running org.apache.atlas.repository.userprofile.UserProfileServiceTest
Running org.apache.atlas.utils.ObjectUpdateSynchronizerTest
Running org.apache.atlas.repository.store.graph.AtlasTypeDefGraphStoreTest
Running org.apache.atlas.glossary.GlossaryServiceTest
Running org.apache.atlas.repository.store.graph.v1.AtlasRelationshipStoreV1Test
Running org.apache.atlas.repository.store.graph.v1.AtlasRelationshipStoreSoftDeleteV1Test
Running org.apache.atlas.repository.store.graph.v1.AtlasRelationshipDefStoreV1Test
Running org.apache.atlas.repository.store.graph.v1.AtlasRelationshipStoreHardDeleteV1Test
Running org.apache.atlas.repository.impexp.ZipSinkTest
Running org.apache.atlas.repository.store.graph.v1.AtlasEntityStoreV1BulkImportPercentTest
Running org.apache.atlas.glossary.PaginationHelperTest
Running org.apache.atlas.repository.impexp.ImportServiceTest
Running org.apache.atlas.repository.impexp.ExportServiceTest
Running org.apache.atlas.TestModules
Running org.apache.atlas.query.DSLParsingTest
Running org.apache.atlas.repository.store.graph.v1.AtlasEntityDefStoreV1Test
Running org.apache.atlas.repository.impexp.UniqueListTest
Running org.apache.atlas.repository.impexp.ZipSourceTest
Running org.apache.atlas.repository.store.graph.v1.InverseReferenceUpdateHardDeleteV1Test
Running org.apache.atlas.repository.tagpropagation.ClassificationPropagationTest
Running org.apache.atlas.repository.store.graph.v1.InverseReferenceUpdateV1Test
Running org.apache.atlas.query.GremlinQueryComposerTest
Running org.apache.atlas.repository.impexp.ImportTransformsTest
Running org.apache.atlas.services.MetricsServiceTest
Running org.apache.atlas.repository.impexp.AtlasImportRequestTest
Running org.apache.atlas.repository.migration.RelationshipMappingTest
Running org.apache.atlas.repository.impexp.ImportTransformerTest
Running org.apache.atlas.repository.impexp.TypeAttributeDifferenceTest
Running org.apache.atlas.repository.store.graph.v1.InverseReferenceUpdateSoftDeleteV1Test
Running org.apache.atlas.repository.impexp.ImportTransformerJSONTest
Running org.apache.atlas.repository.migration.MigrationProgressServiceTest
Running org.apache.atlas.repository.migration.HiveParititionTest
Running org.apache.atlas.repository.audit.InMemoryAuditRepositoryTest
Running org.apache.atlas.repository.migration.PathTest
Running org.apache.atlas.repository.audit.CassandraAuditRepositoryTest
Running org.apache.atlas.repository.migration.HiveStocksTest
Tests run: 0, Failures: 0, Errors: 0, Skipped: 0, Time elapsed: 2.346 sec - in org.apache.atlas.repository.store.graph.v1.AtlasRelationshipStoreV1Test
Tests run: 0, Failures: 0, Errors: 0, Skipped: 0, Time elapsed: 2.419 sec - in org.apache.atlas.TestModules
Tests run: 0, Failures: 0, Errors: 0, Skipped: 0, Time elapsed: 2.437 sec - in org.apache.atlas.repository.store.graph.v1.InverseReferenceUpdateV1Test
Tests run: 0, Failures: 0, Errors: 0, Skipped: 0, Time elapsed: 2.963 sec - in org.apache.atlas.utils.TestResourceFileUtils
Tests run: 4, Failures: 0, Errors: 0, Skipped: 0, Time elapsed: 2.682 sec - in org.apache.atlas.repository.impexp.UniqueListTest
Tests run: 8, Failures: 0, Errors: 0, Skipped: 0, Time elapsed: 2.854 sec - in org.apache.atlas.repository.impexp.ImportTransformerTest
Tests run: 20, Failures: 0, Errors: 0, Skipped: 0, Time elapsed: 3.409 sec - in org.apache.atlas.glossary.PaginationHelperTest
Tests run: 6, Failures: 0, Errors: 0, Skipped: 0, Time elapsed: 2.277 sec - in org.apache.atlas.repository.audit.InMemoryAuditRepositoryTest
Tests run: 6, Failures: 0, Errors: 0, Skipped: 0, Time elapsed: 3.921 sec - in org.apache.atlas.repository.impexp.TypeAttributeDifferenceTest
Tests run: 8, Failures: 0, Errors: 0, Skipped: 0, Time elapsed: 4.475 sec - in org.apache.atlas.repository.impexp.ZipSinkTest
Tests run: 9, Failures: 0, Errors: 0, Skipped: 0, Time elapsed: 4.985 sec - in org.apache.atlas.utils.ObjectUpdateSynchronizerTest
Tests run: 9, Failures: 0, Errors: 0, Skipped: 0, Time elapsed: 4.966 sec - in org.apache.atlas.repository.store.graph.v1.AtlasEntityStoreV1BulkImportPercentTest
Tests run: 1, Failures: 0, Errors: 0, Skipped: 0, Time elapsed: 4.457 sec - in org.apache.atlas.repository.impexp.ImportTransformerJSONTest
Tests run: 8, Failures: 0, Errors: 0, Skipped: 0, Time elapsed: 4.947 sec - in org.apache.atlas.query.DSLParsingTest
Tests run: 3, Failures: 0, Errors: 0, Skipped: 0, Time elapsed: 4.801 sec - in org.apache.atlas.repository.impexp.ImportTransformsTest
Tests run: 6, Failures: 0, Errors: 0, Skipped: 0, Time elapsed: 4.779 sec - in org.apache.atlas.repository.impexp.AtlasImportRequestTest
Tests run: 6, Failures: 0, Errors: 0, Skipped: 0, Time elapsed: 5 sec - in org.apache.atlas.repository.impexp.ZipSourceTest
Tests run: 4, Failures: 0, Errors: 0, Skipped: 0, Time elapsed: 5.197 sec - in org.apache.atlas.repository.migration.MigrationProgressServiceTest
Tests run: 39, Failures: 0, Errors: 0, Skipped: 0, Time elapsed: 9.441 sec - in org.apache.atlas.query.GremlinQueryComposerTest
Tests run: 7, Failures: 0, Errors: 0, Skipped: 7, Time elapsed: 16.831 sec - in org.apache.atlas.repository.audit.CassandraAuditRepositoryTest
Tests run: 1, Failures: 0, Errors: 0, Skipped: 0, Time elapsed: 41.846 sec - in org.apache.atlas.services.MetricsServiceTest
Tests run: 10, Failures: 0, Errors: 0, Skipped: 0, Time elapsed: 58.866 sec - in org.apache.atlas.repository.store.graph.v1.AtlasRelationshipDefStoreV1Test
Tests run: 1, Failures: 0, Errors: 0, Skipped: 0, Time elapsed: 64.509 sec - in org.apache.atlas.repository.store.graph.v1.AtlasEntityDefStoreV1Test
Tests run: 5, Failures: 0, Errors: 0, Skipped: 0, Time elapsed: 71.431 sec - in org.apache.atlas.repository.store.graph.v1.InverseReferenceUpdateSoftDeleteV1Test
Tests run: 5, Failures: 4, Errors: 0, Skipped: 0, Time elapsed: 70.068 sec <<< FAILURE! - in org.apache.atlas.repository.store.graph.v1.InverseReferenceUpdateHardDeleteV1Test
testInverseReferenceAutoUpdate_Map(org.apache.atlas.repository.store.graph.v1.InverseReferenceUpdateHardDeleteV1Test)  Time elapsed: 1.422 sec  <<< FAILURE!
java.lang.AssertionError: expected [null] but found [AtlasObjectId{guid='26df5c5e-a3cf-4941-ae7a-0416d4261929', typeName='A', uniqueAttributes={}}]
	at org.testng.Assert.fail(Assert.java:94)
	at org.testng.Assert.failNotSame(Assert.java:492)
	at org.testng.Assert.assertNull(Assert.java:428)
	at org.testng.Assert.assertNull(Assert.java:417)
	at org.apache.atlas.repository.store.graph.v1.InverseReferenceUpdateV1Test.verifyReferenceValue(InverseReferenceUpdateV1Test.java:362)
	at org.apache.atlas.repository.store.graph.v1.InverseReferenceUpdateHardDeleteV1Test.verify_testInverseReferenceAutoUpdate_Map(InverseReferenceUpdateHardDeleteV1Test.java:71)

testInverseReferenceAutoUpdate_NonCompositeManyToOne(org.apache.atlas.repository.store.graph.v1.InverseReferenceUpdateHardDeleteV1Test)  Time elapsed: 0.479 sec  <<< FAILURE!
java.lang.AssertionError: expected [null] but found [AtlasObjectId{guid='12dcd445-b4c1-4084-a6ad-9039c848c971', typeName='B', uniqueAttributes={}}]
	at org.testng.Assert.fail(Assert.java:94)
	at org.testng.Assert.failNotSame(Assert.java:492)
	at org.testng.Assert.assertNull(Assert.java:428)
	at org.testng.Assert.assertNull(Assert.java:417)
	at org.apache.atlas.repository.store.graph.v1.InverseReferenceUpdateV1Test.verifyReferenceValue(InverseReferenceUpdateV1Test.java:362)
	at org.apache.atlas.repository.store.graph.v1.InverseReferenceUpdateHardDeleteV1Test.verify_testInverseReferenceAutoUpdate_NonCompositeManyToOne(InverseReferenceUpdateHardDeleteV1Test.java:48)

testInverseReferenceAutoUpdate_NonComposite_OneToMany(org.apache.atlas.repository.store.graph.v1.InverseReferenceUpdateHardDeleteV1Test)  Time elapsed: 0.16 sec  <<< FAILURE!
java.lang.AssertionError: expected [1] but found [2]
	at org.testng.Assert.fail(Assert.java:94)
	at org.testng.Assert.failNotEquals(Assert.java:496)
	at org.testng.Assert.assertEquals(Assert.java:125)
	at org.testng.Assert.assertEquals(Assert.java:372)
	at org.testng.Assert.assertEquals(Assert.java:382)
	at org.apache.atlas.repository.store.graph.v1.InverseReferenceUpdateV1Test.verifyReferenceList(InverseReferenceUpdateV1Test.java:375)
	at org.apache.atlas.repository.store.graph.v1.InverseReferenceUpdateHardDeleteV1Test.verify_testInverseReferenceAutoUpdate_NonComposite_OneToMany(InverseReferenceUpdateHardDeleteV1Test.java:42)

testInverseReferenceAutoUpdate_NonComposite_OneToOne(org.apache.atlas.repository.store.graph.v1.InverseReferenceUpdateHardDeleteV1Test)  Time elapsed: 0.452 sec  <<< FAILURE!
java.lang.AssertionError: expected [null] but found [AtlasObjectId{guid='b782ed09-71f5-42a3-a63f-a4d365f42f62', typeName='B', uniqueAttributes={}}]
	at org.testng.Assert.fail(Assert.java:94)
	at org.testng.Assert.failNotSame(Assert.java:492)
	at org.testng.Assert.assertNull(Assert.java:428)
	at org.testng.Assert.assertNull(Assert.java:417)
	at org.apache.atlas.repository.store.graph.v1.InverseReferenceUpdateV1Test.verifyReferenceValue(InverseReferenceUpdateV1Test.java:362)
	at org.apache.atlas.repository.store.graph.v1.InverseReferenceUpdateHardDeleteV1Test.verify_testInverseReferenceAutoUpdate_NonComposite_OneToOne(InverseReferenceUpdateHardDeleteV1Test.java:58)

Tests run: 1, Failures: 0, Errors: 0, Skipped: 0, Time elapsed: 73.405 sec - in org.apache.atlas.repository.migration.RelationshipMappingTest
Tests run: 12, Failures: 0, Errors: 0, Skipped: 0, Time elapsed: 78.131 sec - in org.apache.atlas.repository.impexp.ExportServiceTest
Tests run: 4, Failures: 0, Errors: 0, Skipped: 0, Time elapsed: 82.745 sec - in org.apache.atlas.repository.store.graph.v1.AtlasRelationshipStoreHardDeleteV1Test
Tests run: 4, Failures: 0, Errors: 0, Skipped: 0, Time elapsed: 85.569 sec - in org.apache.atlas.repository.store.graph.v1.AtlasRelationshipStoreSoftDeleteV1Test
Tests run: 18, Failures: 0, Errors: 0, Skipped: 0, Time elapsed: 87.899 sec - in org.apache.atlas.repository.store.graph.AtlasTypeDefGraphStoreTest
Tests run: 12, Failures: 0, Errors: 0, Skipped: 0, Time elapsed: 90.72 sec - in org.apache.atlas.repository.userprofile.UserProfileServiceTest
Tests run: 16, Failures: 1, Errors: 0, Skipped: 0, Time elapsed: 91.818 sec <<< FAILURE! - in org.apache.atlas.repository.store.graph.v1.AtlasEntityStoreV1Test
testMapOfPrimitivesUpdate(org.apache.atlas.repository.store.graph.v1.AtlasEntityStoreV1Test)  Time elapsed: 0.033 sec  <<< FAILURE!
java.lang.AssertionError: expected [1] but found [2]
	at org.testng.Assert.fail(Assert.java:94)
	at org.testng.Assert.failNotEquals(Assert.java:496)
	at org.testng.Assert.assertEquals(Assert.java:125)
	at org.testng.Assert.assertEquals(Assert.java:372)
	at org.testng.Assert.assertEquals(Assert.java:382)
	at org.apache.atlas.repository.store.graph.v1.AtlasEntityStoreV1Test.validateMutationResponse(AtlasEntityStoreV1Test.java:1035)
	at org.apache.atlas.repository.store.graph.v1.AtlasEntityStoreV1Test.testMapOfPrimitivesUpdate(AtlasEntityStoreV1Test.java:467)

Tests run: 1, Failures: 0, Errors: 0, Skipped: 0, Time elapsed: 91.575 sec - in org.apache.atlas.repository.migration.HiveParititionTest
Tests run: 35, Failures: 0, Errors: 0, Skipped: 0, Time elapsed: 94.567 sec - in org.apache.atlas.glossary.GlossaryServiceTest
Tests run: 1, Failures: 0, Errors: 0, Skipped: 0, Time elapsed: 95.74 sec - in org.apache.atlas.repository.migration.PathTest
Tests run: 1, Failures: 0, Errors: 0, Skipped: 0, Time elapsed: 102.363 sec - in org.apache.atlas.repository.migration.HiveStocksTest
Tests run: 14, Failures: 0, Errors: 0, Skipped: 0, Time elapsed: 107.321 sec - in org.apache.atlas.repository.impexp.ImportServiceTest
Tests run: 9, Failures: 0, Errors: 0, Skipped: 0, Time elapsed: 111.922 sec - in org.apache.atlas.repository.tagpropagation.ClassificationPropagationTest
Tests run: 246, Failures: 0, Errors: 0, Skipped: 0, Time elapsed: 161.121 sec - in org.apache.atlas.query.DSLQueriesTest

Results :

Failed tests: 
  AtlasEntityStoreV1Test.testMapOfPrimitivesUpdate:467->validateMutationResponse:1035 expected [1] but found [2]
  InverseReferenceUpdateHardDeleteV1Test>InverseReferenceUpdateV1Test.testInverseReferenceAutoUpdate_Map:354->verify_testInverseReferenceAutoUpdate_Map:71->InverseReferenceUpdateV1Test.verifyReferenceValue:362 expected [null] but found [AtlasObjectId{guid='26df5c5e-a3cf-4941-ae7a-0416d4261929', typeName='A', uniqueAttributes={}}]
  InverseReferenceUpdateHardDeleteV1Test>InverseReferenceUpdateV1Test.testInverseReferenceAutoUpdate_NonCompositeManyToOne:201->verify_testInverseReferenceAutoUpdate_NonCompositeManyToOne:48->InverseReferenceUpdateV1Test.verifyReferenceValue:362 expected [null] but found [AtlasObjectId{guid='12dcd445-b4c1-4084-a6ad-9039c848c971', typeName='B', uniqueAttributes={}}]
  InverseReferenceUpdateHardDeleteV1Test>InverseReferenceUpdateV1Test.testInverseReferenceAutoUpdate_NonComposite_OneToMany:141->verify_testInverseReferenceAutoUpdate_NonComposite_OneToMany:42->InverseReferenceUpdateV1Test.verifyReferenceList:375 expected [1] but found [2]
  InverseReferenceUpdateHardDeleteV1Test>InverseReferenceUpdateV1Test.testInverseReferenceAutoUpdate_NonComposite_OneToOne:255->verify_testInverseReferenceAutoUpdate_NonComposite_OneToOne:58->InverseReferenceUpdateV1Test.verifyReferenceValue:362 expected [null] but found [AtlasObjectId{guid='b782ed09-71f5-42a3-a63f-a4d365f42f62', typeName='B', uniqueAttributes={}}]

Tests run: 540, Failures: 5, Errors: 0, Skipped: 7

[INFO] ------------------------------------------------------------------------
[INFO] Reactor Summary:
[INFO] 
[INFO] Apache Atlas Server Build Tools .................... SUCCESS [  0.550 s]
[INFO] apache-atlas ....................................... SUCCESS [  3.308 s]
[INFO] Apache Atlas Test Utility Tools .................... SUCCESS [  4.225 s]
[INFO] Open Connector Framework (OCF) ..................... SUCCESS [  1.544 s]
[INFO] Open Metadata Repository Services (OMRS) ........... SUCCESS [  4.845 s]
[INFO] Open Metadata and Governance (OMAG) Server APIs .... SUCCESS [  0.853 s]
[INFO] Connected Asset Open Metadata Access Service (OMAS)  SUCCESS [  1.845 s]
[INFO] Asset Consumer Open Metadata Access Service (OMAS) . SUCCESS [  0.873 s]
[INFO] Open Metadata and Governance (OMAG) Server ......... SUCCESS [  0.671 s]
[INFO] Apache Atlas Integration ........................... SUCCESS [ 31.914 s]
[INFO] Apache Atlas Common ................................ SUCCESS [  3.019 s]
[INFO] Apache Atlas Client ................................ SUCCESS [  0.177 s]
[INFO] atlas-client-common ................................ SUCCESS [  0.710 s]
[INFO] atlas-client-v1 .................................... SUCCESS [  2.795 s]
[INFO] Apache Atlas Server API ............................ SUCCESS [  0.814 s]
[INFO] Apache Atlas Notification .......................... SUCCESS [ 16.540 s]
[INFO] atlas-client-v2 .................................... SUCCESS [  0.738 s]
[INFO] Apache Atlas Graph Database Projects ............... SUCCESS [  0.080 s]
[INFO] Apache Atlas Graph Database API .................... SUCCESS [  0.597 s]
[INFO] Graph Database Common Code ......................... SUCCESS [  0.727 s]
[INFO] Apache Atlas JanusGraph DB Impl .................... SUCCESS [02:14 min]
[INFO] Apache Atlas Graph Database Implementation Dependencies SUCCESS [  1.698 s]
[INFO] Shaded version of Apache hbase client .............. SUCCESS [  6.971 s]
[INFO] Shaded version of Apache hbase server .............. SUCCESS [ 18.760 s]
[INFO] Apache Atlas Authorization ......................... SUCCESS [  2.364 s]
[INFO] Apache Atlas Repository ............................ FAILURE [02:50 min]
[INFO] Apache Atlas UI .................................... SKIPPED
[INFO] Apache Atlas Web Application ....................... SKIPPED
[INFO] Apache Atlas Documentation ......................... SKIPPED
[INFO] Apache Atlas FileSystem Model ...................... SKIPPED
[INFO] Apache Atlas Plugin Classloader .................... SKIPPED
[INFO] Apache Atlas Hive Bridge Shim ...................... SKIPPED
[INFO] Apache Atlas Hive Bridge ........................... SKIPPED
[INFO] Apache Atlas Falcon Bridge Shim .................... SKIPPED
[INFO] Apache Atlas Falcon Bridge ......................... SKIPPED
[INFO] Apache Atlas Sqoop Bridge Shim ..................... SKIPPED
[INFO] Apache Atlas Sqoop Bridge .......................... SKIPPED
[INFO] Apache Atlas Storm Bridge Shim ..................... SKIPPED
[INFO] Apache Atlas Storm Bridge .......................... SKIPPED
[INFO] Apache Atlas Hbase Bridge Shim ..................... SKIPPED
[INFO] Apache Atlas Hbase Bridge .......................... SKIPPED
[INFO] Apache Atlas Kafka Bridge .......................... SKIPPED
[INFO] Apache Atlas Distribution .......................... SKIPPED
[INFO] ------------------------------------------------------------------------
[INFO] BUILD FAILURE
[INFO] ------------------------------------------------------------------------
[INFO] Total time: 06:52 min
[INFO] Finished at: 2018-05-04T16:42:02Z
[INFO] Final Memory: 144M/2291M
[INFO] ------------------------------------------------------------------------
[ERROR] Failed to execute goal org.apache.maven.plugins:maven-surefire-plugin:2.18.1:test (default-test) on project atlas-repository: There are test failures.
[ERROR] 
[ERROR] Please refer to <https://builds.apache.org/job/PreCommit-ATLAS-Build-Test/ws/repository/target/surefire-reports> for the individual test results.
[ERROR] -> [Help 1]
[ERROR] 
[ERROR] To see the full stack trace of the errors, re-run Maven with the -e switch.
[ERROR] Re-run Maven using the -X switch to enable full debug logging.
[ERROR] 
[ERROR] For more information about the errors and possible solutions, please read the following articles:
[ERROR] [Help 1] http://cwiki.apache.org/confluence/display/MAVEN/MojoFailureException
[ERROR] 
[ERROR] After correcting the problems, you can resume the build with the command
[ERROR]   mvn <goals> -rf :atlas-repository




{color:red}-1 overall{color}.  

    {color:green}+1 @author{color}.  The patch does not contain any @author tags.

Console output: https://builds.apache.org/job/PreCommit-ATLAS-Build-Test/346//console

This message is automatically generated.


======================================================================
======================================================================
    Adding comment to Jira.
======================================================================
======================================================================




======================================================================
======================================================================
    Finished build.
======================================================================
======================================================================


+ EXIT_CODE=1
+ '[' -d <https://builds.apache.org/job/PreCommit-ATLAS-Build-Test/ws/../atlas_patchprocess_16777> ']'
+ '[' -d <https://builds.apache.org/job/PreCommit-ATLAS-Build-Test/ws/atlas_patchprocess_16777> ']'
+ mv <https://builds.apache.org/job/PreCommit-ATLAS-Build-Test/ws/atlas_patchprocess_16777> <https://builds.apache.org/job/PreCommit-ATLAS-Build-Test/ws/patchprocess>
+ rm -f <https://builds.apache.org/job/PreCommit-ATLAS-Build-Test/ws/../atlas_patchprocess_16777>
+ exit 1
Build step 'Execute shell' marked build as failure
Set build name.
New build name is '#346-master-ATLAS-2634-Avoid-duplicate-message-processing.patch'
Archiving artifacts