OSDir


[Date Prev][Date Next][Thread Prev][Thread Next][Date Index][Thread Index]

Build failed in Jenkins: Atlas-master-UnitTests #1259


See <https://builds.apache.org/job/Atlas-master-UnitTests/1259/display/redirect>

------------------------------------------
[...truncated 173.54 KB...]
[INFO] --- maven-resources-plugin:2.7:testResources (default-testResources) @ atlas-repository ---
[INFO] Using 'UTF-8' encoding to copy filtered resources.
[INFO] Copying 35 resources
[INFO] Copying 3 resources
[INFO] 
[INFO] --- maven-compiler-plugin:3.7.0:testCompile (default-testCompile) @ atlas-repository ---
[INFO] Changes detected - recompiling the module!
[INFO] Compiling 43 source files to <https://builds.apache.org/job/Atlas-master-UnitTests/ws/repository/target/test-classes>
[INFO] <https://builds.apache.org/job/Atlas-master-UnitTests/ws/repository/src/test/java/org/apache/atlas/query/BasicTestSetup.java>: <https://builds.apache.org/job/Atlas-master-UnitTests/ws/repository/src/test/java/org/apache/atlas/query/BasicTestSetup.java> uses or overrides a deprecated API.
[INFO] <https://builds.apache.org/job/Atlas-master-UnitTests/ws/repository/src/test/java/org/apache/atlas/query/BasicTestSetup.java>: Recompile with -Xlint:deprecation for details.
[INFO] <https://builds.apache.org/job/Atlas-master-UnitTests/ws/repository/src/test/java/org/apache/atlas/repository/store/graph/v1/InverseReferenceUpdateV1Test.java>: Some input files use unchecked or unsafe operations.
[INFO] <https://builds.apache.org/job/Atlas-master-UnitTests/ws/repository/src/test/java/org/apache/atlas/repository/store/graph/v1/InverseReferenceUpdateV1Test.java>: Recompile with -Xlint:unchecked for details.
[INFO] 
[INFO] --- maven-surefire-plugin:2.18.1:test (default-test) @ atlas-repository ---
[INFO] Surefire report directory: <https://builds.apache.org/job/Atlas-master-UnitTests/ws/repository/target/surefire-reports>
[INFO] Using configured provider org.apache.maven.surefire.testng.TestNGProvider

-------------------------------------------------------
 T E S T S
-------------------------------------------------------
Running org.apache.atlas.repository.store.graph.v1.InverseReferenceUpdateHardDeleteV1Test
Running org.apache.atlas.repository.impexp.ZipSourceTest
Running org.apache.atlas.repository.impexp.UniqueListTest
Running org.apache.atlas.repository.impexp.ImportTransformsTest
Running org.apache.atlas.repository.impexp.AtlasImportRequestTest
Running org.apache.atlas.repository.impexp.ImportTransformerJSONTest
Running org.apache.atlas.repository.store.graph.v1.AtlasRelationshipDefStoreV1Test
Running org.apache.atlas.glossary.GlossaryServiceTest
Running org.apache.atlas.repository.impexp.ZipSinkTest
Running org.apache.atlas.repository.userprofile.UserProfileServiceTest
Running org.apache.atlas.repository.tagpropagation.ClassificationPropagationTest
Running org.apache.atlas.glossary.PaginationHelperTest
Running org.apache.atlas.repository.impexp.TypeAttributeDifferenceTest
Running org.apache.atlas.query.DSLParsingTest
Running org.apache.atlas.query.GremlinQueryComposerTest
Running org.apache.atlas.repository.impexp.ExportServiceTest
Running org.apache.atlas.services.MetricsServiceTest
Running org.apache.atlas.repository.impexp.ImportTransformerTest
Running org.apache.atlas.repository.migration.HiveParititionTest
Running org.apache.atlas.repository.store.graph.v1.AtlasRelationshipStoreHardDeleteV1Test
Running org.apache.atlas.repository.store.graph.v1.AtlasEntityStoreV1BulkImportPercentTest
Running org.apache.atlas.repository.migration.MigrationProgressServiceTest
Running org.apache.atlas.repository.migration.HiveStocksTest
Running org.apache.atlas.repository.store.graph.v1.AtlasRelationshipStoreV1Test
Running org.apache.atlas.repository.audit.InMemoryAuditRepositoryTest
Running org.apache.atlas.repository.audit.CassandraAuditRepositoryTest
Running org.apache.atlas.repository.migration.PathTest
Running org.apache.atlas.repository.store.graph.v1.InverseReferenceUpdateV1Test
Running org.apache.atlas.repository.store.graph.v1.InverseReferenceUpdateSoftDeleteV1Test
Running org.apache.atlas.repository.impexp.ImportServiceTest
Running org.apache.atlas.repository.store.graph.AtlasTypeDefGraphStoreTest
Running org.apache.atlas.utils.ObjectUpdateSynchronizerTest
Running org.apache.atlas.query.DSLQueriesTest
Running org.apache.atlas.repository.store.graph.v1.AtlasEntityDefStoreV1Test
Running org.apache.atlas.repository.store.graph.v1.AtlasRelationshipStoreSoftDeleteV1Test
Running org.apache.atlas.repository.store.graph.v1.AtlasEntityStoreV1Test
Running org.apache.atlas.repository.migration.RelationshipMappingTest
Running org.apache.atlas.TestModules
Running org.apache.atlas.utils.TestResourceFileUtils
Tests run: 4, Failures: 0, Errors: 0, Skipped: 0, Time elapsed: 2.542 sec - in org.apache.atlas.repository.impexp.UniqueListTest
Tests run: 8, Failures: 0, Errors: 0, Skipped: 0, Time elapsed: 2.859 sec - in org.apache.atlas.repository.impexp.ImportTransformerTest
Tests run: 0, Failures: 0, Errors: 0, Skipped: 0, Time elapsed: 2.319 sec - in org.apache.atlas.repository.store.graph.v1.InverseReferenceUpdateV1Test
Tests run: 20, Failures: 0, Errors: 0, Skipped: 0, Time elapsed: 3.12 sec - in org.apache.atlas.glossary.PaginationHelperTest
Tests run: 0, Failures: 0, Errors: 0, Skipped: 0, Time elapsed: 2.465 sec - in org.apache.atlas.repository.store.graph.v1.AtlasRelationshipStoreV1Test
Tests run: 6, Failures: 0, Errors: 0, Skipped: 0, Time elapsed: 2.942 sec - in org.apache.atlas.repository.audit.InMemoryAuditRepositoryTest
Tests run: 0, Failures: 0, Errors: 0, Skipped: 0, Time elapsed: 2.156 sec - in org.apache.atlas.TestModules
Tests run: 0, Failures: 0, Errors: 0, Skipped: 0, Time elapsed: 1.636 sec - in org.apache.atlas.utils.TestResourceFileUtils
Tests run: 6, Failures: 0, Errors: 0, Skipped: 0, Time elapsed: 3.861 sec - in org.apache.atlas.repository.impexp.TypeAttributeDifferenceTest
Tests run: 8, Failures: 0, Errors: 0, Skipped: 0, Time elapsed: 4.769 sec - in org.apache.atlas.repository.impexp.ZipSinkTest
Tests run: 3, Failures: 0, Errors: 0, Skipped: 0, Time elapsed: 4.954 sec - in org.apache.atlas.repository.impexp.ImportTransformsTest
Tests run: 6, Failures: 0, Errors: 0, Skipped: 0, Time elapsed: 4.984 sec - in org.apache.atlas.repository.impexp.AtlasImportRequestTest
Tests run: 1, Failures: 0, Errors: 0, Skipped: 0, Time elapsed: 5.056 sec - in org.apache.atlas.repository.impexp.ImportTransformerJSONTest
Tests run: 9, Failures: 0, Errors: 0, Skipped: 0, Time elapsed: 4.62 sec - in org.apache.atlas.repository.store.graph.v1.AtlasEntityStoreV1BulkImportPercentTest
Tests run: 8, Failures: 0, Errors: 0, Skipped: 0, Time elapsed: 5.095 sec - in org.apache.atlas.query.DSLParsingTest
Tests run: 9, Failures: 0, Errors: 0, Skipped: 0, Time elapsed: 4.652 sec - in org.apache.atlas.utils.ObjectUpdateSynchronizerTest
Tests run: 4, Failures: 0, Errors: 0, Skipped: 0, Time elapsed: 5.145 sec - in org.apache.atlas.repository.migration.MigrationProgressServiceTest
Tests run: 6, Failures: 0, Errors: 0, Skipped: 0, Time elapsed: 5.83 sec - in org.apache.atlas.repository.impexp.ZipSourceTest
Tests run: 39, Failures: 0, Errors: 0, Skipped: 0, Time elapsed: 10.767 sec - in org.apache.atlas.query.GremlinQueryComposerTest
Tests run: 6, Failures: 0, Errors: 0, Skipped: 0, Time elapsed: 21.891 sec - in org.apache.atlas.repository.audit.CassandraAuditRepositoryTest
Tests run: 1, Failures: 0, Errors: 0, Skipped: 0, Time elapsed: 27.66 sec - in org.apache.atlas.services.MetricsServiceTest
Tests run: 1, Failures: 0, Errors: 0, Skipped: 0, Time elapsed: 33.367 sec - in org.apache.atlas.repository.store.graph.v1.AtlasEntityDefStoreV1Test
Tests run: 10, Failures: 0, Errors: 0, Skipped: 0, Time elapsed: 39.525 sec - in org.apache.atlas.repository.store.graph.v1.AtlasRelationshipDefStoreV1Test
Tests run: 1, Failures: 0, Errors: 0, Skipped: 0, Time elapsed: 49.263 sec - in org.apache.atlas.repository.migration.RelationshipMappingTest
Tests run: 5, Failures: 0, Errors: 0, Skipped: 0, Time elapsed: 53.139 sec - in org.apache.atlas.repository.store.graph.v1.InverseReferenceUpdateSoftDeleteV1Test
Tests run: 5, Failures: 4, Errors: 0, Skipped: 0, Time elapsed: 50.341 sec <<< FAILURE! - in org.apache.atlas.repository.store.graph.v1.InverseReferenceUpdateHardDeleteV1Test
testInverseReferenceAutoUpdate_Map(org.apache.atlas.repository.store.graph.v1.InverseReferenceUpdateHardDeleteV1Test)  Time elapsed: 0.843 sec  <<< FAILURE!
java.lang.AssertionError: expected [null] but found [AtlasObjectId{guid='f6142081-23e6-43b9-a1a6-1edb4b152144', typeName='A', uniqueAttributes={}}]
	at org.testng.Assert.fail(Assert.java:94)
	at org.testng.Assert.failNotSame(Assert.java:492)
	at org.testng.Assert.assertNull(Assert.java:428)
	at org.testng.Assert.assertNull(Assert.java:417)
	at org.apache.atlas.repository.store.graph.v1.InverseReferenceUpdateV1Test.verifyReferenceValue(InverseReferenceUpdateV1Test.java:362)
	at org.apache.atlas.repository.store.graph.v1.InverseReferenceUpdateHardDeleteV1Test.verify_testInverseReferenceAutoUpdate_Map(InverseReferenceUpdateHardDeleteV1Test.java:71)

testInverseReferenceAutoUpdate_NonCompositeManyToOne(org.apache.atlas.repository.store.graph.v1.InverseReferenceUpdateHardDeleteV1Test)  Time elapsed: 0.848 sec  <<< FAILURE!
java.lang.AssertionError: expected [null] but found [AtlasObjectId{guid='040e63ba-2b5d-4008-9499-4428fa83ef70', typeName='B', uniqueAttributes={}}]
	at org.testng.Assert.fail(Assert.java:94)
	at org.testng.Assert.failNotSame(Assert.java:492)
	at org.testng.Assert.assertNull(Assert.java:428)
	at org.testng.Assert.assertNull(Assert.java:417)
	at org.apache.atlas.repository.store.graph.v1.InverseReferenceUpdateV1Test.verifyReferenceValue(InverseReferenceUpdateV1Test.java:362)
	at org.apache.atlas.repository.store.graph.v1.InverseReferenceUpdateHardDeleteV1Test.verify_testInverseReferenceAutoUpdate_NonCompositeManyToOne(InverseReferenceUpdateHardDeleteV1Test.java:48)

testInverseReferenceAutoUpdate_NonComposite_OneToMany(org.apache.atlas.repository.store.graph.v1.InverseReferenceUpdateHardDeleteV1Test)  Time elapsed: 0.576 sec  <<< FAILURE!
java.lang.AssertionError: expected [1] but found [2]
	at org.testng.Assert.fail(Assert.java:94)
	at org.testng.Assert.failNotEquals(Assert.java:496)
	at org.testng.Assert.assertEquals(Assert.java:125)
	at org.testng.Assert.assertEquals(Assert.java:372)
	at org.testng.Assert.assertEquals(Assert.java:382)
	at org.apache.atlas.repository.store.graph.v1.InverseReferenceUpdateV1Test.verifyReferenceList(InverseReferenceUpdateV1Test.java:375)
	at org.apache.atlas.repository.store.graph.v1.InverseReferenceUpdateHardDeleteV1Test.verify_testInverseReferenceAutoUpdate_NonComposite_OneToMany(InverseReferenceUpdateHardDeleteV1Test.java:42)

testInverseReferenceAutoUpdate_NonComposite_OneToOne(org.apache.atlas.repository.store.graph.v1.InverseReferenceUpdateHardDeleteV1Test)  Time elapsed: 1.462 sec  <<< FAILURE!
java.lang.AssertionError: expected [null] but found [AtlasObjectId{guid='fd625b83-0641-4e40-98bf-4092e93d7313', typeName='B', uniqueAttributes={}}]
	at org.testng.Assert.fail(Assert.java:94)
	at org.testng.Assert.failNotSame(Assert.java:492)
	at org.testng.Assert.assertNull(Assert.java:428)
	at org.testng.Assert.assertNull(Assert.java:417)
	at org.apache.atlas.repository.store.graph.v1.InverseReferenceUpdateV1Test.verifyReferenceValue(InverseReferenceUpdateV1Test.java:362)
	at org.apache.atlas.repository.store.graph.v1.InverseReferenceUpdateHardDeleteV1Test.verify_testInverseReferenceAutoUpdate_NonComposite_OneToOne(InverseReferenceUpdateHardDeleteV1Test.java:58)

Tests run: 4, Failures: 0, Errors: 0, Skipped: 0, Time elapsed: 53.967 sec - in org.apache.atlas.repository.store.graph.v1.AtlasRelationshipStoreSoftDeleteV1Test
Tests run: 4, Failures: 0, Errors: 0, Skipped: 0, Time elapsed: 55.944 sec - in org.apache.atlas.repository.store.graph.v1.AtlasRelationshipStoreHardDeleteV1Test
Tests run: 12, Failures: 0, Errors: 0, Skipped: 0, Time elapsed: 57.479 sec - in org.apache.atlas.repository.userprofile.UserProfileServiceTest
Tests run: 12, Failures: 0, Errors: 0, Skipped: 0, Time elapsed: 57.918 sec - in org.apache.atlas.repository.impexp.ExportServiceTest
Tests run: 18, Failures: 0, Errors: 0, Skipped: 0, Time elapsed: 62.53 sec - in org.apache.atlas.repository.store.graph.AtlasTypeDefGraphStoreTest
Tests run: 35, Failures: 0, Errors: 0, Skipped: 0, Time elapsed: 65.132 sec - in org.apache.atlas.glossary.GlossaryServiceTest
Tests run: 16, Failures: 1, Errors: 0, Skipped: 0, Time elapsed: 64.871 sec <<< FAILURE! - in org.apache.atlas.repository.store.graph.v1.AtlasEntityStoreV1Test
testMapOfPrimitivesUpdate(org.apache.atlas.repository.store.graph.v1.AtlasEntityStoreV1Test)  Time elapsed: 0.032 sec  <<< FAILURE!
java.lang.AssertionError: expected [1] but found [2]
	at org.testng.Assert.fail(Assert.java:94)
	at org.testng.Assert.failNotEquals(Assert.java:496)
	at org.testng.Assert.assertEquals(Assert.java:125)
	at org.testng.Assert.assertEquals(Assert.java:372)
	at org.testng.Assert.assertEquals(Assert.java:382)
	at org.apache.atlas.repository.store.graph.v1.AtlasEntityStoreV1Test.validateMutationResponse(AtlasEntityStoreV1Test.java:1035)
	at org.apache.atlas.repository.store.graph.v1.AtlasEntityStoreV1Test.testMapOfPrimitivesUpdate(AtlasEntityStoreV1Test.java:467)

Tests run: 1, Failures: 0, Errors: 0, Skipped: 0, Time elapsed: 72.559 sec - in org.apache.atlas.repository.migration.HiveParititionTest
Tests run: 1, Failures: 0, Errors: 0, Skipped: 0, Time elapsed: 72.371 sec - in org.apache.atlas.repository.migration.PathTest
Tests run: 1, Failures: 0, Errors: 0, Skipped: 0, Time elapsed: 72.865 sec - in org.apache.atlas.repository.migration.HiveStocksTest
Tests run: 14, Failures: 0, Errors: 0, Skipped: 0, Time elapsed: 77.59 sec - in org.apache.atlas.repository.impexp.ImportServiceTest
Tests run: 9, Failures: 0, Errors: 0, Skipped: 0, Time elapsed: 82.468 sec - in org.apache.atlas.repository.tagpropagation.ClassificationPropagationTest
Tests run: 246, Failures: 0, Errors: 0, Skipped: 0, Time elapsed: 133.575 sec - in org.apache.atlas.query.DSLQueriesTest

Results :

Failed tests: 
  AtlasEntityStoreV1Test.testMapOfPrimitivesUpdate:467->validateMutationResponse:1035 expected [1] but found [2]
  InverseReferenceUpdateHardDeleteV1Test>InverseReferenceUpdateV1Test.testInverseReferenceAutoUpdate_Map:354->verify_testInverseReferenceAutoUpdate_Map:71->InverseReferenceUpdateV1Test.verifyReferenceValue:362 expected [null] but found [AtlasObjectId{guid='f6142081-23e6-43b9-a1a6-1edb4b152144', typeName='A', uniqueAttributes={}}]
  InverseReferenceUpdateHardDeleteV1Test>InverseReferenceUpdateV1Test.testInverseReferenceAutoUpdate_NonCompositeManyToOne:201->verify_testInverseReferenceAutoUpdate_NonCompositeManyToOne:48->InverseReferenceUpdateV1Test.verifyReferenceValue:362 expected [null] but found [AtlasObjectId{guid='040e63ba-2b5d-4008-9499-4428fa83ef70', typeName='B', uniqueAttributes={}}]
  InverseReferenceUpdateHardDeleteV1Test>InverseReferenceUpdateV1Test.testInverseReferenceAutoUpdate_NonComposite_OneToMany:141->verify_testInverseReferenceAutoUpdate_NonComposite_OneToMany:42->InverseReferenceUpdateV1Test.verifyReferenceList:375 expected [1] but found [2]
  InverseReferenceUpdateHardDeleteV1Test>InverseReferenceUpdateV1Test.testInverseReferenceAutoUpdate_NonComposite_OneToOne:255->verify_testInverseReferenceAutoUpdate_NonComposite_OneToOne:58->InverseReferenceUpdateV1Test.verifyReferenceValue:362 expected [null] but found [AtlasObjectId{guid='fd625b83-0641-4e40-98bf-4092e93d7313', typeName='B', uniqueAttributes={}}]

Tests run: 539, Failures: 5, Errors: 0, Skipped: 0

[INFO] ------------------------------------------------------------------------
[INFO] Reactor Summary:
[INFO] 
[INFO] Apache Atlas Server Build Tools .................... SUCCESS [  0.471 s]
[INFO] apache-atlas ....................................... SUCCESS [  1.851 s]
[INFO] Apache Atlas Test Utility Tools .................... SUCCESS [  4.469 s]
[INFO] Open Connector Framework (OCF) ..................... SUCCESS [  1.545 s]
[INFO] Open Metadata Repository Services (OMRS) ........... SUCCESS [  4.780 s]
[INFO] Open Metadata and Governance (OMAG) Server APIs .... SUCCESS [  0.740 s]
[INFO] Connected Asset Open Metadata Access Service (OMAS)  SUCCESS [  0.837 s]
[INFO] Asset Consumer Open Metadata Access Service (OMAS) . SUCCESS [  0.839 s]
[INFO] Open Metadata and Governance (OMAG) Server ......... SUCCESS [  0.716 s]
[INFO] Apache Atlas Integration ........................... SUCCESS [ 30.049 s]
[INFO] Apache Atlas Common ................................ SUCCESS [  2.118 s]
[INFO] Apache Atlas Client ................................ SUCCESS [  0.109 s]
[INFO] atlas-client-common ................................ SUCCESS [  0.640 s]
[INFO] atlas-client-v1 .................................... SUCCESS [  2.470 s]
[INFO] Apache Atlas Server API ............................ SUCCESS [  0.690 s]
[INFO] Apache Atlas Notification .......................... SUCCESS [ 14.649 s]
[INFO] atlas-client-v2 .................................... SUCCESS [  0.624 s]
[INFO] Apache Atlas Graph Database Projects ............... SUCCESS [  0.083 s]
[INFO] Apache Atlas Graph Database API .................... SUCCESS [  0.556 s]
[INFO] Graph Database Common Code ......................... SUCCESS [  0.619 s]
[INFO] Apache Atlas JanusGraph DB Impl .................... SUCCESS [02:11 min]
[INFO] Apache Atlas Graph Database Implementation Dependencies SUCCESS [  1.929 s]
[INFO] Shaded version of Apache hbase client .............. SUCCESS [  6.789 s]
[INFO] Shaded version of Apache hbase server .............. SUCCESS [ 18.245 s]
[INFO] Apache Atlas Authorization ......................... SUCCESS [  2.231 s]
[INFO] Apache Atlas Repository ............................ FAILURE [02:23 min]
[INFO] Apache Atlas UI .................................... SKIPPED
[INFO] Apache Atlas Web Application ....................... SKIPPED
[INFO] Apache Atlas Documentation ......................... SKIPPED
[INFO] Apache Atlas FileSystem Model ...................... SKIPPED
[INFO] Apache Atlas Plugin Classloader .................... SKIPPED
[INFO] Apache Atlas Hive Bridge Shim ...................... SKIPPED
[INFO] Apache Atlas Hive Bridge ........................... SKIPPED
[INFO] Apache Atlas Falcon Bridge Shim .................... SKIPPED
[INFO] Apache Atlas Falcon Bridge ......................... SKIPPED
[INFO] Apache Atlas Sqoop Bridge Shim ..................... SKIPPED
[INFO] Apache Atlas Sqoop Bridge .......................... SKIPPED
[INFO] Apache Atlas Storm Bridge Shim ..................... SKIPPED
[INFO] Apache Atlas Storm Bridge .......................... SKIPPED
[INFO] Apache Atlas Hbase Bridge Shim ..................... SKIPPED
[INFO] Apache Atlas Hbase Bridge .......................... SKIPPED
[INFO] Apache Atlas Kafka Bridge .......................... SKIPPED
[INFO] Apache Atlas Distribution .......................... SKIPPED
[INFO] ------------------------------------------------------------------------
[INFO] BUILD FAILURE
[INFO] ------------------------------------------------------------------------
[INFO] Total time: 06:14 min
[INFO] Finished at: 2018-05-04T12:32:27Z
[INFO] Final Memory: 139M/1919M
[INFO] ------------------------------------------------------------------------
[ERROR] Failed to execute goal org.apache.maven.plugins:maven-surefire-plugin:2.18.1:test (default-test) on project atlas-repository: There are test failures.
[ERROR] 
[ERROR] Please refer to <https://builds.apache.org/job/Atlas-master-UnitTests/ws/repository/target/surefire-reports> for the individual test results.
[ERROR] -> [Help 1]
[ERROR] 
[ERROR] To see the full stack trace of the errors, re-run Maven with the -e switch.
[ERROR] Re-run Maven using the -X switch to enable full debug logging.
[ERROR] 
[ERROR] For more information about the errors and possible solutions, please read the following articles:
[ERROR] [Help 1] http://cwiki.apache.org/confluence/display/MAVEN/MojoFailureException
[ERROR] 
[ERROR] After correcting the problems, you can resume the build with the command
[ERROR]   mvn <goals> -rf :atlas-repository
Build step 'Execute shell' marked build as failure
[CHECKSTYLE] Collecting checkstyle analysis files...
[CHECKSTYLE] Searching for all files in <https://builds.apache.org/job/Atlas-master-UnitTests/ws/> that match the pattern **/target/checkstyle-result.xml
[CHECKSTYLE] No files found. Configuration error?
<Git Blamer> Using GitBlamer to create author and commit information for all warnings.
<Git Blamer> GIT_COMMIT=967bf67eb6858c91c97b13e2b1c60caa1d51299c, workspace=<https://builds.apache.org/job/Atlas-master-UnitTests/ws/>
[CHECKSTYLE] Computing warning deltas based on reference build #1256
[FINDBUGS] Collecting findbugs analysis files...
[FINDBUGS] Searching for all files in <https://builds.apache.org/job/Atlas-master-UnitTests/ws/> that match the pattern **/target/findbugs.xml
[FINDBUGS] No files found. Configuration error?
<Git Blamer> Using GitBlamer to create author and commit information for all warnings.
<Git Blamer> GIT_COMMIT=967bf67eb6858c91c97b13e2b1c60caa1d51299c, workspace=<https://builds.apache.org/job/Atlas-master-UnitTests/ws/>
[FINDBUGS] Computing warning deltas based on reference build #1256
Archiving artifacts
TestNG Reports Processing: START
Looking for TestNG results report in workspace using pattern: **/target/surefire-reports/testng-results.xml,**/target/failsafe-reports/testng-results.xml
Saving reports...
Processing '/x1/jenkins/jenkins-home/jobs/Atlas-master-UnitTests/builds/1259/testng/testng-results-1.xml'
Processing '/x1/jenkins/jenkins-home/jobs/Atlas-master-UnitTests/builds/1259/testng/testng-results-2.xml'
Processing '/x1/jenkins/jenkins-home/jobs/Atlas-master-UnitTests/builds/1259/testng/testng-results-3.xml'
Processing '/x1/jenkins/jenkins-home/jobs/Atlas-master-UnitTests/builds/1259/testng/testng-results-4.xml'
Processing '/x1/jenkins/jenkins-home/jobs/Atlas-master-UnitTests/builds/1259/testng/testng-results-5.xml'
Processing '/x1/jenkins/jenkins-home/jobs/Atlas-master-UnitTests/builds/1259/testng/testng-results-6.xml'
Processing '/x1/jenkins/jenkins-home/jobs/Atlas-master-UnitTests/builds/1259/testng/testng-results-7.xml'
Processing '/x1/jenkins/jenkins-home/jobs/Atlas-master-UnitTests/builds/1259/testng/testng-results.xml'
TestNG Reports Processing: FINISH