OSDir


[Date Prev][Date Next][Thread Prev][Thread Next][Date Index][Thread Index]

Build failed in Jenkins: PreCommit-ATLAS-Build-Test #345-master-0001-ATLAS-2643-Re-evaluate-tag-propagation-when-a-relati.patch


See <https://builds.apache.org/job/PreCommit-ATLAS-Build-Test/345/display/redirect?page=changes>

Changes:

[ssubramanian] ATLAS-2521: Remove Titan 0.5.4 support from Atlas

------------------------------------------
[...truncated 231.74 KB...]
[INFO] Surefire report directory: <https://builds.apache.org/job/PreCommit-ATLAS-Build-Test/ws/repository/target/surefire-reports>
[INFO] Using configured provider org.apache.maven.surefire.testng.TestNGProvider

-------------------------------------------------------
 T E S T S
-------------------------------------------------------
Running org.apache.atlas.utils.TestResourceFileUtils
Running org.apache.atlas.repository.migration.MigrationProgressServiceTest
Running org.apache.atlas.repository.userprofile.UserProfileServiceTest
Running org.apache.atlas.repository.migration.HiveParititionTest
Running org.apache.atlas.repository.impexp.UniqueListTest
Running org.apache.atlas.repository.migration.RelationshipMappingTest
Running org.apache.atlas.repository.migration.HiveStocksTest
Running org.apache.atlas.repository.impexp.AtlasImportRequestTest
Running org.apache.atlas.repository.migration.PathTest
Running org.apache.atlas.repository.tagpropagation.ClassificationPropagationTest
Running org.apache.atlas.repository.impexp.ImportTransformsTest
Running org.apache.atlas.utils.ObjectUpdateSynchronizerTest
Running org.apache.atlas.repository.store.graph.v1.AtlasRelationshipStoreHardDeleteV1Test
Running org.apache.atlas.repository.store.graph.v1.AtlasEntityStoreV1BulkImportPercentTest
Running org.apache.atlas.repository.store.graph.v1.AtlasEntityStoreV1Test
Running org.apache.atlas.repository.impexp.ImportTransformerJSONTest
Running org.apache.atlas.repository.impexp.TypeAttributeDifferenceTest
Running org.apache.atlas.repository.impexp.ExportServiceTest
Running org.apache.atlas.repository.impexp.ImportTransformerTest
Running org.apache.atlas.repository.store.graph.v1.AtlasRelationshipStoreSoftDeleteV1Test
Running org.apache.atlas.repository.audit.InMemoryAuditRepositoryTest
Running org.apache.atlas.glossary.PaginationHelperTest
Running org.apache.atlas.repository.store.graph.AtlasTypeDefGraphStoreTest
Running org.apache.atlas.glossary.GlossaryServiceTest
Running org.apache.atlas.repository.impexp.ZipSinkTest
Running org.apache.atlas.repository.impexp.ImportServiceTest
Running org.apache.atlas.repository.impexp.ZipSourceTest
Running org.apache.atlas.repository.store.graph.v1.InverseReferenceUpdateV1Test
Running org.apache.atlas.repository.store.graph.v1.InverseReferenceUpdateHardDeleteV1Test
Running org.apache.atlas.repository.store.graph.v1.AtlasEntityDefStoreV1Test
Tests run: 0, Failures: 0, Errors: 0, Skipped: 0, Time elapsed: 2.581 sec - in org.apache.atlas.utils.TestResourceFileUtils
Running org.apache.atlas.repository.audit.CassandraAuditRepositoryTest
Running org.apache.atlas.repository.store.graph.v1.AtlasRelationshipDefStoreV1Test
Tests run: 4, Failures: 0, Errors: 0, Skipped: 0, Time elapsed: 3.326 sec - in org.apache.atlas.repository.impexp.UniqueListTest
Tests run: 8, Failures: 0, Errors: 0, Skipped: 0, Time elapsed: 3.375 sec - in org.apache.atlas.repository.impexp.ImportTransformerTest
Tests run: 0, Failures: 0, Errors: 0, Skipped: 0, Time elapsed: 2.853 sec - in org.apache.atlas.repository.store.graph.v1.InverseReferenceUpdateV1Test
Running org.apache.atlas.repository.store.graph.v1.InverseReferenceUpdateSoftDeleteV1Test
Tests run: 6, Failures: 0, Errors: 0, Skipped: 0, Time elapsed: 3.679 sec - in org.apache.atlas.repository.audit.InMemoryAuditRepositoryTest
Tests run: 20, Failures: 0, Errors: 0, Skipped: 0, Time elapsed: 3.989 sec - in org.apache.atlas.glossary.PaginationHelperTest
Running org.apache.atlas.repository.store.graph.v1.AtlasRelationshipStoreV1Test
Tests run: 9, Failures: 0, Errors: 0, Skipped: 0, Time elapsed: 5.454 sec - in org.apache.atlas.utils.ObjectUpdateSynchronizerTest
Tests run: 9, Failures: 0, Errors: 0, Skipped: 0, Time elapsed: 5.525 sec - in org.apache.atlas.repository.store.graph.v1.AtlasEntityStoreV1BulkImportPercentTest
Running org.apache.atlas.TestModules
Tests run: 6, Failures: 0, Errors: 0, Skipped: 0, Time elapsed: 6.026 sec - in org.apache.atlas.repository.impexp.TypeAttributeDifferenceTest
Running org.apache.atlas.query.DSLParsingTest
Tests run: 6, Failures: 0, Errors: 0, Skipped: 0, Time elapsed: 6.659 sec - in org.apache.atlas.repository.impexp.AtlasImportRequestTest
Running org.apache.atlas.query.GremlinQueryComposerTest
Tests run: 3, Failures: 0, Errors: 0, Skipped: 0, Time elapsed: 7.021 sec - in org.apache.atlas.repository.impexp.ImportTransformsTest
Running org.apache.atlas.query.DSLQueriesTest
Running org.apache.atlas.services.MetricsServiceTest
Tests run: 0, Failures: 0, Errors: 0, Skipped: 0, Time elapsed: 2.155 sec - in org.apache.atlas.repository.store.graph.v1.AtlasRelationshipStoreV1Test
Tests run: 1, Failures: 0, Errors: 0, Skipped: 0, Time elapsed: 7.36 sec - in org.apache.atlas.repository.impexp.ImportTransformerJSONTest
Tests run: 8, Failures: 0, Errors: 0, Skipped: 0, Time elapsed: 6.607 sec - in org.apache.atlas.repository.impexp.ZipSinkTest
Tests run: 4, Failures: 0, Errors: 0, Skipped: 0, Time elapsed: 8.277 sec - in org.apache.atlas.repository.migration.MigrationProgressServiceTest
Tests run: 0, Failures: 0, Errors: 0, Skipped: 0, Time elapsed: 1.913 sec - in org.apache.atlas.TestModules
Tests run: 6, Failures: 0, Errors: 0, Skipped: 0, Time elapsed: 7.954 sec - in org.apache.atlas.repository.impexp.ZipSourceTest
Tests run: 8, Failures: 0, Errors: 0, Skipped: 0, Time elapsed: 3.41 sec - in org.apache.atlas.query.DSLParsingTest
Tests run: 39, Failures: 0, Errors: 0, Skipped: 0, Time elapsed: 19.397 sec - in org.apache.atlas.query.GremlinQueryComposerTest
Tests run: 6, Failures: 0, Errors: 0, Skipped: 0, Time elapsed: 27.07 sec - in org.apache.atlas.repository.audit.CassandraAuditRepositoryTest
Tests run: 1, Failures: 0, Errors: 0, Skipped: 0, Time elapsed: 35.954 sec - in org.apache.atlas.services.MetricsServiceTest
Tests run: 1, Failures: 0, Errors: 0, Skipped: 0, Time elapsed: 57.232 sec - in org.apache.atlas.repository.store.graph.v1.AtlasEntityDefStoreV1Test
Tests run: 10, Failures: 0, Errors: 0, Skipped: 0, Time elapsed: 56.331 sec - in org.apache.atlas.repository.store.graph.v1.AtlasRelationshipDefStoreV1Test
Tests run: 1, Failures: 0, Errors: 0, Skipped: 0, Time elapsed: 81.122 sec - in org.apache.atlas.repository.migration.RelationshipMappingTest
Tests run: 4, Failures: 0, Errors: 0, Skipped: 0, Time elapsed: 84.861 sec - in org.apache.atlas.repository.store.graph.v1.AtlasRelationshipStoreHardDeleteV1Test
Tests run: 4, Failures: 0, Errors: 0, Skipped: 0, Time elapsed: 84.212 sec - in org.apache.atlas.repository.store.graph.v1.AtlasRelationshipStoreSoftDeleteV1Test
Tests run: 5, Failures: 0, Errors: 0, Skipped: 0, Time elapsed: 82.15 sec - in org.apache.atlas.repository.store.graph.v1.InverseReferenceUpdateSoftDeleteV1Test
Tests run: 5, Failures: 4, Errors: 0, Skipped: 0, Time elapsed: 79.297 sec <<< FAILURE! - in org.apache.atlas.repository.store.graph.v1.InverseReferenceUpdateHardDeleteV1Test
testInverseReferenceAutoUpdate_Map(org.apache.atlas.repository.store.graph.v1.InverseReferenceUpdateHardDeleteV1Test)  Time elapsed: 2.576 sec  <<< FAILURE!
java.lang.AssertionError: expected [null] but found [AtlasObjectId{guid='2751825c-5a4e-432b-9f2e-c624c8d0c50f', typeName='A', uniqueAttributes={}}]
	at org.testng.Assert.fail(Assert.java:94)
	at org.testng.Assert.failNotSame(Assert.java:492)
	at org.testng.Assert.assertNull(Assert.java:428)
	at org.testng.Assert.assertNull(Assert.java:417)
	at org.apache.atlas.repository.store.graph.v1.InverseReferenceUpdateV1Test.verifyReferenceValue(InverseReferenceUpdateV1Test.java:362)
	at org.apache.atlas.repository.store.graph.v1.InverseReferenceUpdateHardDeleteV1Test.verify_testInverseReferenceAutoUpdate_Map(InverseReferenceUpdateHardDeleteV1Test.java:71)

testInverseReferenceAutoUpdate_NonCompositeManyToOne(org.apache.atlas.repository.store.graph.v1.InverseReferenceUpdateHardDeleteV1Test)  Time elapsed: 3.165 sec  <<< FAILURE!
java.lang.AssertionError: expected [null] but found [AtlasObjectId{guid='61ddc9b2-7e3e-404d-a5c4-0ab538c83939', typeName='B', uniqueAttributes={}}]
	at org.testng.Assert.fail(Assert.java:94)
	at org.testng.Assert.failNotSame(Assert.java:492)
	at org.testng.Assert.assertNull(Assert.java:428)
	at org.testng.Assert.assertNull(Assert.java:417)
	at org.apache.atlas.repository.store.graph.v1.InverseReferenceUpdateV1Test.verifyReferenceValue(InverseReferenceUpdateV1Test.java:362)
	at org.apache.atlas.repository.store.graph.v1.InverseReferenceUpdateHardDeleteV1Test.verify_testInverseReferenceAutoUpdate_NonCompositeManyToOne(InverseReferenceUpdateHardDeleteV1Test.java:48)

testInverseReferenceAutoUpdate_NonComposite_OneToMany(org.apache.atlas.repository.store.graph.v1.InverseReferenceUpdateHardDeleteV1Test)  Time elapsed: 0.801 sec  <<< FAILURE!
java.lang.AssertionError: expected [1] but found [2]
	at org.testng.Assert.fail(Assert.java:94)
	at org.testng.Assert.failNotEquals(Assert.java:496)
	at org.testng.Assert.assertEquals(Assert.java:125)
	at org.testng.Assert.assertEquals(Assert.java:372)
	at org.testng.Assert.assertEquals(Assert.java:382)
	at org.apache.atlas.repository.store.graph.v1.InverseReferenceUpdateV1Test.verifyReferenceList(InverseReferenceUpdateV1Test.java:375)
	at org.apache.atlas.repository.store.graph.v1.InverseReferenceUpdateHardDeleteV1Test.verify_testInverseReferenceAutoUpdate_NonComposite_OneToMany(InverseReferenceUpdateHardDeleteV1Test.java:42)

testInverseReferenceAutoUpdate_NonComposite_OneToOne(org.apache.atlas.repository.store.graph.v1.InverseReferenceUpdateHardDeleteV1Test)  Time elapsed: 1.131 sec  <<< FAILURE!
java.lang.AssertionError: expected [null] but found [AtlasObjectId{guid='5c510c3f-246a-43a6-9083-9ce6d05089d5', typeName='B', uniqueAttributes={}}]
	at org.testng.Assert.fail(Assert.java:94)
	at org.testng.Assert.failNotSame(Assert.java:492)
	at org.testng.Assert.assertNull(Assert.java:428)
	at org.testng.Assert.assertNull(Assert.java:417)
	at org.apache.atlas.repository.store.graph.v1.InverseReferenceUpdateV1Test.verifyReferenceValue(InverseReferenceUpdateV1Test.java:362)
	at org.apache.atlas.repository.store.graph.v1.InverseReferenceUpdateHardDeleteV1Test.verify_testInverseReferenceAutoUpdate_NonComposite_OneToOne(InverseReferenceUpdateHardDeleteV1Test.java:58)

Tests run: 12, Failures: 0, Errors: 0, Skipped: 0, Time elapsed: 90.893 sec - in org.apache.atlas.repository.userprofile.UserProfileServiceTest
Tests run: 12, Failures: 0, Errors: 0, Skipped: 0, Time elapsed: 92.82 sec - in org.apache.atlas.repository.impexp.ExportServiceTest
Tests run: 35, Failures: 0, Errors: 0, Skipped: 0, Time elapsed: 101.772 sec - in org.apache.atlas.glossary.GlossaryServiceTest
Tests run: 18, Failures: 0, Errors: 0, Skipped: 0, Time elapsed: 102.503 sec - in org.apache.atlas.repository.store.graph.AtlasTypeDefGraphStoreTest
Tests run: 1, Failures: 0, Errors: 0, Skipped: 0, Time elapsed: 103.938 sec - in org.apache.atlas.repository.migration.PathTest
Tests run: 16, Failures: 1, Errors: 0, Skipped: 0, Time elapsed: 105.753 sec <<< FAILURE! - in org.apache.atlas.repository.store.graph.v1.AtlasEntityStoreV1Test
testMapOfPrimitivesUpdate(org.apache.atlas.repository.store.graph.v1.AtlasEntityStoreV1Test)  Time elapsed: 0.035 sec  <<< FAILURE!
java.lang.AssertionError: expected [1] but found [2]
	at org.testng.Assert.fail(Assert.java:94)
	at org.testng.Assert.failNotEquals(Assert.java:496)
	at org.testng.Assert.assertEquals(Assert.java:125)
	at org.testng.Assert.assertEquals(Assert.java:372)
	at org.testng.Assert.assertEquals(Assert.java:382)
	at org.apache.atlas.repository.store.graph.v1.AtlasEntityStoreV1Test.validateMutationResponse(AtlasEntityStoreV1Test.java:1035)
	at org.apache.atlas.repository.store.graph.v1.AtlasEntityStoreV1Test.testMapOfPrimitivesUpdate(AtlasEntityStoreV1Test.java:467)

Tests run: 1, Failures: 0, Errors: 0, Skipped: 0, Time elapsed: 108.135 sec - in org.apache.atlas.repository.migration.HiveStocksTest
Tests run: 1, Failures: 0, Errors: 0, Skipped: 0, Time elapsed: 110.099 sec - in org.apache.atlas.repository.migration.HiveParititionTest
Tests run: 14, Failures: 0, Errors: 0, Skipped: 0, Time elapsed: 123.733 sec - in org.apache.atlas.repository.impexp.ImportServiceTest
Tests run: 9, Failures: 0, Errors: 0, Skipped: 0, Time elapsed: 132.58 sec - in org.apache.atlas.repository.tagpropagation.ClassificationPropagationTest
Tests run: 246, Failures: 0, Errors: 0, Skipped: 0, Time elapsed: 179.562 sec - in org.apache.atlas.query.DSLQueriesTest

Results :

Failed tests: 
  AtlasEntityStoreV1Test.testMapOfPrimitivesUpdate:467->validateMutationResponse:1035 expected [1] but found [2]
  InverseReferenceUpdateHardDeleteV1Test>InverseReferenceUpdateV1Test.testInverseReferenceAutoUpdate_Map:354->verify_testInverseReferenceAutoUpdate_Map:71->InverseReferenceUpdateV1Test.verifyReferenceValue:362 expected [null] but found [AtlasObjectId{guid='2751825c-5a4e-432b-9f2e-c624c8d0c50f', typeName='A', uniqueAttributes={}}]
  InverseReferenceUpdateHardDeleteV1Test>InverseReferenceUpdateV1Test.testInverseReferenceAutoUpdate_NonCompositeManyToOne:201->verify_testInverseReferenceAutoUpdate_NonCompositeManyToOne:48->InverseReferenceUpdateV1Test.verifyReferenceValue:362 expected [null] but found [AtlasObjectId{guid='61ddc9b2-7e3e-404d-a5c4-0ab538c83939', typeName='B', uniqueAttributes={}}]
  InverseReferenceUpdateHardDeleteV1Test>InverseReferenceUpdateV1Test.testInverseReferenceAutoUpdate_NonComposite_OneToMany:141->verify_testInverseReferenceAutoUpdate_NonComposite_OneToMany:42->InverseReferenceUpdateV1Test.verifyReferenceList:375 expected [1] but found [2]
  InverseReferenceUpdateHardDeleteV1Test>InverseReferenceUpdateV1Test.testInverseReferenceAutoUpdate_NonComposite_OneToOne:255->verify_testInverseReferenceAutoUpdate_NonComposite_OneToOne:58->InverseReferenceUpdateV1Test.verifyReferenceValue:362 expected [null] but found [AtlasObjectId{guid='5c510c3f-246a-43a6-9083-9ce6d05089d5', typeName='B', uniqueAttributes={}}]

Tests run: 539, Failures: 5, Errors: 0, Skipped: 0

[INFO] ------------------------------------------------------------------------
[INFO] Reactor Summary:
[INFO] 
[INFO] Apache Atlas Server Build Tools .................... SUCCESS [  0.656 s]
[INFO] apache-atlas ....................................... SUCCESS [  3.416 s]
[INFO] Apache Atlas Test Utility Tools .................... SUCCESS [  4.565 s]
[INFO] Open Connector Framework (OCF) ..................... SUCCESS [  1.817 s]
[INFO] Open Metadata Repository Services (OMRS) ........... SUCCESS [  5.947 s]
[INFO] Open Metadata and Governance (OMAG) Server APIs .... SUCCESS [  0.971 s]
[INFO] Connected Asset Open Metadata Access Service (OMAS)  SUCCESS [  1.147 s]
[INFO] Asset Consumer Open Metadata Access Service (OMAS) . SUCCESS [  1.028 s]
[INFO] Open Metadata and Governance (OMAG) Server ......... SUCCESS [  0.765 s]
[INFO] Apache Atlas Integration ........................... SUCCESS [ 38.325 s]
[INFO] Apache Atlas Common ................................ SUCCESS [  2.324 s]
[INFO] Apache Atlas Client ................................ SUCCESS [  0.117 s]
[INFO] atlas-client-common ................................ SUCCESS [  0.769 s]
[INFO] atlas-client-v1 .................................... SUCCESS [  2.571 s]
[INFO] Apache Atlas Server API ............................ SUCCESS [  0.770 s]
[INFO] Apache Atlas Notification .......................... SUCCESS [ 15.460 s]
[INFO] atlas-client-v2 .................................... SUCCESS [  0.656 s]
[INFO] Apache Atlas Graph Database Projects ............... SUCCESS [  0.077 s]
[INFO] Apache Atlas Graph Database API .................... SUCCESS [  0.595 s]
[INFO] Graph Database Common Code ......................... SUCCESS [  0.738 s]
[INFO] Apache Atlas JanusGraph DB Impl .................... SUCCESS [02:17 min]
[INFO] Apache Atlas Graph Database Implementation Dependencies SUCCESS [  2.076 s]
[INFO] Shaded version of Apache hbase client .............. SUCCESS [  8.348 s]
[INFO] Shaded version of Apache hbase server .............. SUCCESS [ 21.060 s]
[INFO] Apache Atlas Authorization ......................... SUCCESS [  2.361 s]
[INFO] Apache Atlas Repository ............................ FAILURE [03:17 min]
[INFO] Apache Atlas UI .................................... SKIPPED
[INFO] Apache Atlas Web Application ....................... SKIPPED
[INFO] Apache Atlas Documentation ......................... SKIPPED
[INFO] Apache Atlas FileSystem Model ...................... SKIPPED
[INFO] Apache Atlas Plugin Classloader .................... SKIPPED
[INFO] Apache Atlas Hive Bridge Shim ...................... SKIPPED
[INFO] Apache Atlas Hive Bridge ........................... SKIPPED
[INFO] Apache Atlas Falcon Bridge Shim .................... SKIPPED
[INFO] Apache Atlas Falcon Bridge ......................... SKIPPED
[INFO] Apache Atlas Sqoop Bridge Shim ..................... SKIPPED
[INFO] Apache Atlas Sqoop Bridge .......................... SKIPPED
[INFO] Apache Atlas Storm Bridge Shim ..................... SKIPPED
[INFO] Apache Atlas Storm Bridge .......................... SKIPPED
[INFO] Apache Atlas Hbase Bridge Shim ..................... SKIPPED
[INFO] Apache Atlas Hbase Bridge .......................... SKIPPED
[INFO] Apache Atlas Kafka Bridge .......................... SKIPPED
[INFO] Apache Atlas Migration Exporter .................... SKIPPED
[INFO] Apache Atlas Distribution .......................... SKIPPED
[INFO] ------------------------------------------------------------------------
[INFO] BUILD FAILURE
[INFO] ------------------------------------------------------------------------
[INFO] Total time: 07:32 min
[INFO] Finished at: 2018-05-03T23:13:07Z
[INFO] Final Memory: 145M/1797M
[INFO] ------------------------------------------------------------------------
[ERROR] Failed to execute goal org.apache.maven.plugins:maven-surefire-plugin:2.18.1:test (default-test) on project atlas-repository: There are test failures.
[ERROR] 
[ERROR] Please refer to <https://builds.apache.org/job/PreCommit-ATLAS-Build-Test/ws/repository/target/surefire-reports> for the individual test results.
[ERROR] -> [Help 1]
[ERROR] 
[ERROR] To see the full stack trace of the errors, re-run Maven with the -e switch.
[ERROR] Re-run Maven using the -X switch to enable full debug logging.
[ERROR] 
[ERROR] For more information about the errors and possible solutions, please read the following articles:
[ERROR] [Help 1] http://cwiki.apache.org/confluence/display/MAVEN/MojoFailureException
[ERROR] 
[ERROR] After correcting the problems, you can resume the build with the command
[ERROR]   mvn <goals> -rf :atlas-repository




{color:red}-1 overall{color}.  

    {color:green}+1 @author{color}.  The patch does not contain any @author tags.

Console output: https://builds.apache.org/job/PreCommit-ATLAS-Build-Test/345//console

This message is automatically generated.


======================================================================
======================================================================
    Adding comment to Jira.
======================================================================
======================================================================




======================================================================
======================================================================
    Finished build.
======================================================================
======================================================================


+ EXIT_CODE=1
+ '[' -d <https://builds.apache.org/job/PreCommit-ATLAS-Build-Test/ws/../atlas_patchprocess_14261> ']'
+ '[' -d <https://builds.apache.org/job/PreCommit-ATLAS-Build-Test/ws/atlas_patchprocess_14261> ']'
+ mv <https://builds.apache.org/job/PreCommit-ATLAS-Build-Test/ws/atlas_patchprocess_14261> <https://builds.apache.org/job/PreCommit-ATLAS-Build-Test/ws/patchprocess>
+ rm -f <https://builds.apache.org/job/PreCommit-ATLAS-Build-Test/ws/../atlas_patchprocess_14261>
+ exit 1
Build step 'Execute shell' marked build as failure
Set build name.
New build name is '#345-master-0001-ATLAS-2643-Re-evaluate-tag-propagation-when-a-relati.patch'
Archiving artifacts