OSDir


[Date Prev][Date Next][Thread Prev][Thread Next][Date Index][Thread Index]

Build failed in Jenkins: Atlas-0.8-IntegrationTests #204


See <https://builds.apache.org/job/Atlas-0.8-IntegrationTests/204/display/redirect?page=changes>

Changes:

[madhan] ATLAS-2635: added REST APIs to add/update/remove classifications for an

------------------------------------------
[...truncated 535.33 KB...]
127.0.0.1 - - [03/May/2018:15:53:56 +0000] "POST /api/atlas/entities HTTP/1.1" 201 - "-" "Java/1.8.0_172"
127.0.0.1 - - [03/May/2018:15:53:56 +0000] "POST /api/atlas/entities HTTP/1.1" 201 - "-" "Java/1.8.0_172"
127.0.0.1 - - [03/May/2018:15:53:56 +0000] "POST /api/atlas/entities HTTP/1.1" 201 - "-" "Java/1.8.0_172"
127.0.0.1 - - [03/May/2018:15:53:56 +0000] "GET /api/atlas/discovery/search?query=from+DB_v1&limit=10&offset=0 HTTP/1.1" 200 - "-" "Java/1.8.0_172"
127.0.0.1 - - [03/May/2018:15:53:57 +0000] "GET /api/atlas/discovery/search?query=DB_v1&limit=10&offset=0 HTTP/1.1" 200 - "-" "Java/1.8.0_172"
127.0.0.1 - - [03/May/2018:15:53:58 +0000] "GET /api/atlas/discovery/search?query=DB_v1+where+name%3D%22Reporting%22&limit=10&offset=0 HTTP/1.1" 200 - "-" "Java/1.8.0_172"
127.0.0.1 - - [03/May/2018:15:53:58 +0000] "GET /api/atlas/discovery/search?query=DB_v1+where+DB_v1.name%3D%22Reporting%22&limit=10&offset=0 HTTP/1.1" 200 - "-" "Java/1.8.0_172"
127.0.0.1 - - [03/May/2018:15:53:59 +0000] "GET /api/atlas/discovery/search?query=DB_v1+name+%3D+%22Reporting%22&limit=10&offset=0 HTTP/1.1" 200 - "-" "Java/1.8.0_172"
127.0.0.1 - - [03/May/2018:15:54:00 +0000] "GET /api/atlas/discovery/search?query=DB_v1+DB_v1.name+%3D+%22Reporting%22&limit=10&offset=0 HTTP/1.1" 200 - "-" "Java/1.8.0_172"
127.0.0.1 - - [03/May/2018:15:54:01 +0000] "GET /api/atlas/discovery/search?query=DB_v1+where+name%3D%22Reporting%22+select+name,+owner&limit=10&offset=0 HTTP/1.1" 200 - "-" "Java/1.8.0_172"
127.0.0.1 - - [03/May/2018:15:54:02 +0000] "GET /api/atlas/discovery/search?query=DB_v1+where+DB_v1.name%3D%22Reporting%22+select+name,+owner&limit=10&offset=0 HTTP/1.1" 200 - "-" "Java/1.8.0_172"
127.0.0.1 - - [03/May/2018:15:54:03 +0000] "GET /api/atlas/discovery/search?query=DB_v1+has+name&limit=10&offset=0 HTTP/1.1" 200 - "-" "Java/1.8.0_172"
127.0.0.1 - - [03/May/2018:15:54:04 +0000] "GET /api/atlas/discovery/search?query=DB_v1+where+DB_v1+has+name&limit=10&offset=0 HTTP/1.1" 200 - "-" "Java/1.8.0_172"
127.0.0.1 - - [03/May/2018:15:54:05 +0000] "GET /api/atlas/discovery/search?query=DB_v1,+Table_v1&limit=10&offset=0 HTTP/1.1" 200 - "-" "Java/1.8.0_172"
127.0.0.1 - - [03/May/2018:15:54:06 +0000] "GET /api/atlas/discovery/search?query=DB_v1+is+JdbcAccess&limit=10&offset=0 HTTP/1.1" 200 - "-" "Java/1.8.0_172"
127.0.0.1 - - [03/May/2018:15:54:07 +0000] "GET /api/atlas/discovery/search?query=from+Table_v1&limit=10&offset=0 HTTP/1.1" 200 - "-" "Java/1.8.0_172"
127.0.0.1 - - [03/May/2018:15:54:07 +0000] "GET /api/atlas/discovery/search?query=Table_v1&limit=10&offset=0 HTTP/1.1" 200 - "-" "Java/1.8.0_172"
127.0.0.1 - - [03/May/2018:15:54:08 +0000] "GET /api/atlas/discovery/search?query=Table_v1+is+Dimension_v1&limit=10&offset=0 HTTP/1.1" 200 - "-" "Java/1.8.0_172"
127.0.0.1 - - [03/May/2018:15:54:09 +0000] "GET /api/atlas/discovery/search?query=Column_v1+where+Column_v1+isa+PII_v1&limit=10&offset=0 HTTP/1.1" 200 - "-" "Java/1.8.0_172"
127.0.0.1 - - [03/May/2018:15:54:10 +0000] "GET /api/atlas/discovery/search?query=View_v1+is+Dimension_v1&limit=10&offset=0 HTTP/1.1" 200 - "-" "Java/1.8.0_172"
127.0.0.1 - - [03/May/2018:15:54:10 +0000] "GET /api/atlas/discovery/search?query=Column_v1+select+Column_v1.name&limit=10&offset=0 HTTP/1.1" 200 - "-" "Java/1.8.0_172"
127.0.0.1 - - [03/May/2018:15:54:11 +0000] "GET /api/atlas/discovery/search?query=Column_v1+select+name&limit=10&offset=0 HTTP/1.1" 200 - "-" "Java/1.8.0_172"
127.0.0.1 - - [03/May/2018:15:54:12 +0000] "GET /api/atlas/discovery/search?query=Column_v1+where+Column_v1.name%3D%22customer_id%22&limit=10&offset=0 HTTP/1.1" 200 - "-" "Java/1.8.0_172"
127.0.0.1 - - [03/May/2018:15:54:13 +0000] "GET /api/atlas/discovery/search?query=from+Table_v1+select+Table_v1.name&limit=10&offset=0 HTTP/1.1" 200 - "-" "Java/1.8.0_172"
127.0.0.1 - - [03/May/2018:15:54:14 +0000] "GET /api/atlas/discovery/search?query=DB_v1+where+(name+%3D+%22Reporting%22)&limit=10&offset=0 HTTP/1.1" 200 - "-" "Java/1.8.0_172"
127.0.0.1 - - [03/May/2018:15:54:15 +0000] "GET /api/atlas/discovery/search?query=DB_v1+where+(name+%3D+%22Reporting%22)+select+name+as+_col_0,+owner+as+_col_1&limit=10&offset=0 HTTP/1.1" 200 - "-" "Java/1.8.0_172"
127.0.0.1 - - [03/May/2018:15:54:16 +0000] "GET /api/atlas/discovery/search?query=DB_v1+where+DB_v1+is+JdbcAccess_v1&limit=10&offset=0 HTTP/1.1" 200 - "-" "Java/1.8.0_172"
127.0.0.1 - - [03/May/2018:15:54:17 +0000] "GET /api/atlas/discovery/search?query=DB_v1+where+DB_v1+has+name&limit=10&offset=0 HTTP/1.1" 200 - "-" "Java/1.8.0_172"
127.0.0.1 - - [03/May/2018:15:54:18 +0000] "GET /api/atlas/discovery/search?query=DB_v1+Table_v1&limit=10&offset=0 HTTP/1.1" 200 - "-" "Java/1.8.0_172"
127.0.0.1 - - [03/May/2018:15:54:19 +0000] "GET /api/atlas/discovery/search?query=DB_v1+where+DB_v1+has+name&limit=10&offset=0 HTTP/1.1" 200 - "-" "Java/1.8.0_172"
127.0.0.1 - - [03/May/2018:15:54:20 +0000] "GET /api/atlas/discovery/search?query=DB_v1+as+db1+Table+where+(db1.name+%3D+%22Reporting%22)&limit=10&offset=0 HTTP/1.1" 200 - "-" "Java/1.8.0_172"
127.0.0.1 - - [03/May/2018:15:54:20 +0000] "GET /api/atlas/discovery/search?query=DB_v1+where+(name+%3D+%22Reporting%22)+select+name+as+_col_0,+(createTime+%2B+1)+as+_col_1+&limit=10&offset=0 HTTP/1.1" 200 - "-" "Java/1.8.0_172"
127.0.0.1 - - [03/May/2018:15:54:21 +0000] "GET /api/atlas/discovery/search?query=Dimension_v1&limit=10&offset=0 HTTP/1.1" 200 - "-" "Java/1.8.0_172"
127.0.0.1 - - [03/May/2018:15:54:22 +0000] "GET /api/atlas/discovery/search?query=JdbcAccess_v1&limit=10&offset=0 HTTP/1.1" 200 - "-" "Java/1.8.0_172"
127.0.0.1 - - [03/May/2018:15:54:22 +0000] "GET /api/atlas/discovery/search?query=ETL_v1&limit=10&offset=0 HTTP/1.1" 200 - "-" "Java/1.8.0_172"
127.0.0.1 - - [03/May/2018:15:54:23 +0000] "GET /api/atlas/discovery/search?query=Metric_v1&limit=10&offset=0 HTTP/1.1" 200 - "-" "Java/1.8.0_172"
127.0.0.1 - - [03/May/2018:15:54:24 +0000] "GET /api/atlas/discovery/search?query=PII_v1&limit=10&offset=0 HTTP/1.1" 200 - "-" "Java/1.8.0_172"
127.0.0.1 - - [03/May/2018:15:54:25 +0000] "GET /api/atlas/discovery/search?query=%60Log+Data_v1%60&limit=10&offset=0 HTTP/1.1" 200 - "-" "Java/1.8.0_172"
127.0.0.1 - - [03/May/2018:15:54:26 +0000] "GET /api/atlas/discovery/search?query=Table_v1+where+name%3D%22sales_fact%22,+columns&limit=10&offset=0 HTTP/1.1" 200 - "-" "Java/1.8.0_172"
127.0.0.1 - - [03/May/2018:15:54:26 +0000] "GET /api/atlas/discovery/search?query=Table_v1+where+name%3D%22sales_fact%22,+columns+as+column+select+column.name,+column.dataType,+column.comment&limit=10&offset=0 HTTP/1.1" 200 - "-" "Java/1.8.0_172"
127.0.0.1 - - [03/May/2018:15:54:28 +0000] "GET /api/atlas/discovery/search?query=from+DataSet&limit=10&offset=0 HTTP/1.1" 200 - "-" "Java/1.8.0_172"
127.0.0.1 - - [03/May/2018:15:54:29 +0000] "GET /api/atlas/discovery/search?query=from+Process&limit=10&offset=0 HTTP/1.1" 200 - "-" "Java/1.8.0_172"
127.0.0.1 - - [03/May/2018:15:54:29 +0000] "GET /api/atlas/entities?type=DB_v1&property=name&value=Sales HTTP/1.1" 200 - "-" "Java/1.8.0_172"
127.0.0.1 - - [03/May/2018:15:54:29 +0000] "GET /api/atlas/entities?type=LoadProcess_v1&property=qualifiedName&value=loadSalesDaily HTTP/1.1" 200 - "-" "Java/1.8.0_172"
127.0.0.1 - - [03/May/2018:15:54:29 +0000] "GET /api/atlas/entities?type=Table_v1&property=qualifiedName&value=sales_fact HTTP/1.1" 200 - "-" "Java/1.8.0_172"
127.0.0.1 - - [03/May/2018:15:54:29 +0000] "GET /api/atlas/entities?type=Table_v1&property=qualifiedName&value=time_dim HTTP/1.1" 200 - "-" "Java/1.8.0_172"
127.0.0.1 - - [03/May/2018:15:54:30 +0000] "GET /api/atlas/entities?type=Table_v1&property=qualifiedName&value=sales_fact_daily_mv HTTP/1.1" 200 - "-" "Java/1.8.0_172"
127.0.0.1 - - [03/May/2018:15:54:30 +0000] "GET /api/atlas/entities?type=Table_v1&property=qualifiedName&value=sales_fact HTTP/1.1" 200 - "-" "Java/1.8.0_172"
127.0.0.1 - - [03/May/2018:15:54:30 +0000] "GET /api/atlas/entities?type=DB_v1&property=name&value=Sales HTTP/1.1" 200 - "-" "Java/1.8.0_172"
127.0.0.1 - - [03/May/2018:15:54:30 +0000] "GET /api/atlas/entities?type=View_v1&property=qualifiedName&value=product_dim_view HTTP/1.1" 200 - "-" "Java/1.8.0_172"
127.0.0.1 - - [03/May/2018:15:54:30 +0000] "GET /api/atlas/entities?type=Table_v1&property=qualifiedName&value=product_dim HTTP/1.1" 200 - "-" "Java/1.8.0_172"
Tests run: 135, Failures: 4, Errors: 0, Skipped: 0, Time elapsed: 199.916 sec <<< FAILURE! - in TestSuite
testEnterEmptyValues(org.apache.atlas.CredentialProviderUtilityIT)  Time elapsed: 0.806 sec  <<< FAILURE!
java.io.IOException: Invalid secret key format
	at com.sun.crypto.provider.JceKeyStore.engineLoad(JceKeyStore.java:856)
	at java.security.KeyStore.load(KeyStore.java:1445)
	at org.apache.hadoop.security.alias.AbstractJavaKeyStoreProvider.<init>(AbstractJavaKeyStoreProvider.java:106)
	at org.apache.hadoop.security.alias.JavaKeyStoreProvider.<init>(JavaKeyStoreProvider.java:49)
	at org.apache.hadoop.security.alias.JavaKeyStoreProvider.<init>(JavaKeyStoreProvider.java:41)
	at org.apache.hadoop.security.alias.JavaKeyStoreProvider$Factory.createProvider(JavaKeyStoreProvider.java:100)
	at org.apache.hadoop.security.alias.CredentialProviderFactory.getProviders(CredentialProviderFactory.java:58)
	at org.apache.atlas.CredentialProviderUtilityIT.testEnterEmptyValues(CredentialProviderUtilityIT.java:138)

testEnterMismatchedValues(org.apache.atlas.CredentialProviderUtilityIT)  Time elapsed: 0.604 sec  <<< FAILURE!
java.io.IOException: Invalid secret key format
	at com.sun.crypto.provider.JceKeyStore.engineLoad(JceKeyStore.java:856)
	at java.security.KeyStore.load(KeyStore.java:1445)
	at org.apache.hadoop.security.alias.AbstractJavaKeyStoreProvider.<init>(AbstractJavaKeyStoreProvider.java:106)
	at org.apache.hadoop.security.alias.JavaKeyStoreProvider.<init>(JavaKeyStoreProvider.java:49)
	at org.apache.hadoop.security.alias.JavaKeyStoreProvider.<init>(JavaKeyStoreProvider.java:41)
	at org.apache.hadoop.security.alias.JavaKeyStoreProvider$Factory.createProvider(JavaKeyStoreProvider.java:100)
	at org.apache.hadoop.security.alias.CredentialProviderFactory.getProviders(CredentialProviderFactory.java:58)
	at org.apache.atlas.CredentialProviderUtilityIT.testEnterMismatchedValues(CredentialProviderUtilityIT.java:192)

testEnterValidValues(org.apache.atlas.CredentialProviderUtilityIT)  Time elapsed: 0.611 sec  <<< FAILURE!
java.io.IOException: Invalid secret key format
	at com.sun.crypto.provider.JceKeyStore.engineLoad(JceKeyStore.java:856)
	at java.security.KeyStore.load(KeyStore.java:1445)
	at org.apache.hadoop.security.alias.AbstractJavaKeyStoreProvider.<init>(AbstractJavaKeyStoreProvider.java:106)
	at org.apache.hadoop.security.alias.JavaKeyStoreProvider.<init>(JavaKeyStoreProvider.java:49)
	at org.apache.hadoop.security.alias.JavaKeyStoreProvider.<init>(JavaKeyStoreProvider.java:41)
	at org.apache.hadoop.security.alias.JavaKeyStoreProvider$Factory.createProvider(JavaKeyStoreProvider.java:100)
	at org.apache.hadoop.security.alias.CredentialProviderFactory.getProviders(CredentialProviderFactory.java:58)
	at org.apache.atlas.CredentialProviderUtilityIT.testEnterValidValues(CredentialProviderUtilityIT.java:76)

testOverwriteValues(org.apache.atlas.CredentialProviderUtilityIT)  Time elapsed: 0.619 sec  <<< FAILURE!
java.io.IOException: Invalid secret key format
	at com.sun.crypto.provider.JceKeyStore.engineLoad(JceKeyStore.java:856)
	at java.security.KeyStore.load(KeyStore.java:1445)
	at org.apache.hadoop.security.alias.AbstractJavaKeyStoreProvider.<init>(AbstractJavaKeyStoreProvider.java:106)
	at org.apache.hadoop.security.alias.JavaKeyStoreProvider.<init>(JavaKeyStoreProvider.java:49)
	at org.apache.hadoop.security.alias.JavaKeyStoreProvider.<init>(JavaKeyStoreProvider.java:41)
	at org.apache.hadoop.security.alias.JavaKeyStoreProvider$Factory.createProvider(JavaKeyStoreProvider.java:100)
	at org.apache.hadoop.security.alias.CredentialProviderFactory.getProviders(CredentialProviderFactory.java:58)
	at org.apache.atlas.util.CredentialProviderUtility.getCredentialProvider(CredentialProviderUtility.java:150)
	at org.apache.atlas.util.CredentialProviderUtility.main(CredentialProviderUtility.java:75)
	at org.apache.atlas.CredentialProviderUtilityIT.testOverwriteValues(CredentialProviderUtilityIT.java:251)


Results :

Failed tests: 
  CredentialProviderUtilityIT.testEnterEmptyValues:138 » IO Invalid secret key f...
  CredentialProviderUtilityIT.testEnterMismatchedValues:192 » IO Invalid secret ...
  CredentialProviderUtilityIT.testEnterValidValues:76 » IO Invalid secret key fo...
  CredentialProviderUtilityIT.testOverwriteValues:251 » IO Invalid secret key fo...

Tests run: 135, Failures: 4, Errors: 0, Skipped: 0

[INFO] 
[INFO] --- jetty-maven-plugin:9.2.12.v20150709:stop (stop-jetty) @ atlas-webapp ---
[INFO] Waiting 10 seconds for jetty to stop
[INFO] Stopped ServerConnector@6775e3f4{HTTP/1.1}{0.0.0.0:31000}
[INFO] Closing Spring root WebApplicationContext
[INFO] Shutting down log4j
[INFO] Not cleaning cached beans: no such field javax.el.BeanELResolver.properties
[INFO] Stopped o.e.j.m.p.JettyWebAppContext@689938b9{/,<https://builds.apache.org/job/Atlas-0.8-IntegrationTests/ws/webapp/target/atlas-webapp-0.8.3-SNAPSHOT/,UNAVAILABLE}{/home/jenkins/jenkins-slave/workspace/Atlas-0.8-IntegrationTests/webapp/target/atlas-webapp-0.8.3-SNAPSHOT.war}>
[INFO] Server reports itself as stopped
[INFO] 
[INFO] --- maven-source-plugin:2.4:jar-no-fork (attach-sources) @ atlas-webapp ---
[INFO] Building jar: <https://builds.apache.org/job/Atlas-0.8-IntegrationTests/ws/webapp/target/atlas-webapp-0.8.3-SNAPSHOT-sources.jar>
log4j:WARN No appenders could be found for logger (org.apache.zookeeper.ClientCnxn).
log4j:WARN Please initialize the log4j system properly.
log4j:WARN See http://logging.apache.org/log4j/1.2/faq.html#noconfig for more info.
[INFO] 
[INFO] --- maven-source-plugin:2.4:test-jar-no-fork (attach-sources) @ atlas-webapp ---
[INFO] Building jar: <https://builds.apache.org/job/Atlas-0.8-IntegrationTests/ws/webapp/target/atlas-webapp-0.8.3-SNAPSHOT-test-sources.jar>
[INFO] 
[INFO] --- maven-failsafe-plugin:2.18.1:verify (verify) @ atlas-webapp ---
[INFO] Failsafe report directory: <https://builds.apache.org/job/Atlas-0.8-IntegrationTests/ws/webapp/target/failsafe-reports>
[INFO] ------------------------------------------------------------------------
[INFO] Reactor Summary:
[INFO] 
[INFO] Apache Atlas Server Build Tools .................... SUCCESS [  7.894 s]
[INFO] apache-atlas ....................................... SUCCESS [ 48.649 s]
[INFO] Apache Atlas Integration ........................... SUCCESS [01:04 min]
[INFO] Apache Atlas Common ................................ SUCCESS [  9.906 s]
[INFO] Apache Atlas Typesystem ............................ SUCCESS [ 53.082 s]
[INFO] Apache Atlas Client ................................ SUCCESS [  0.864 s]
[INFO] atlas-client-common ................................ SUCCESS [  8.319 s]
[INFO] atlas-client-v1 .................................... SUCCESS [  8.522 s]
[INFO] Apache Atlas Server API ............................ SUCCESS [  6.928 s]
[INFO] Apache Atlas Notification .......................... SUCCESS [ 12.067 s]
[INFO] atlas-client-v2 .................................... SUCCESS [  6.567 s]
[INFO] Apache Atlas Graph Database Projects ............... SUCCESS [  0.600 s]
[INFO] Apache Atlas Graph Database API .................... SUCCESS [  5.531 s]
[INFO] Graph Database Common Code ......................... SUCCESS [  5.954 s]
[INFO] Apache Atlas Titan 1.0.0 GraphDB Impl .............. SUCCESS [ 41.291 s]
[INFO] Shaded version of Apache hbase client .............. SUCCESS [  8.818 s]
[INFO] Apache Atlas Titan 0.5.4 Graph DB Impl ............. SUCCESS [ 39.917 s]
[INFO] Apache Atlas Graph Database Implementation Dependencies SUCCESS [  0.789 s]
[INFO] Shaded version of Apache hbase server .............. SUCCESS [ 23.014 s]
[INFO] Apache Atlas Repository ............................ SUCCESS [01:24 min]
[INFO] Apache Atlas Authorization ......................... SUCCESS [  7.382 s]
[INFO] Apache Atlas Business Catalog ...................... SUCCESS [ 11.240 s]
[INFO] Apache Atlas UI .................................... SUCCESS [01:26 min]
[INFO] Apache Atlas Web Application ....................... FAILURE [04:57 min]
[INFO] Apache Atlas Documentation ......................... SKIPPED
[INFO] Apache Atlas FileSystem Model ...................... SKIPPED
[INFO] Apache Atlas Plugin Classloader .................... SKIPPED
[INFO] Apache Atlas Hive Bridge Shim ...................... SKIPPED
[INFO] Apache Atlas Hive Bridge ........................... SKIPPED
[INFO] Apache Atlas Falcon Bridge Shim .................... SKIPPED
[INFO] Apache Atlas Falcon Bridge ......................... SKIPPED
[INFO] Apache Atlas Sqoop Bridge Shim ..................... SKIPPED
[INFO] Apache Atlas Sqoop Bridge .......................... SKIPPED
[INFO] Apache Atlas Storm Bridge Shim ..................... SKIPPED
[INFO] Apache Atlas Storm Bridge .......................... SKIPPED
[INFO] Apache Atlas Hbase Bridge Shim ..................... SKIPPED
[INFO] Apache Atlas Hbase Bridge .......................... SKIPPED
[INFO] Apache Atlas Migration Exporter .................... SKIPPED
[INFO] Apache Atlas Distribution .......................... SKIPPED
[INFO] ------------------------------------------------------------------------
[INFO] BUILD FAILURE
[INFO] ------------------------------------------------------------------------
[INFO] Total time: 14:19 min
[INFO] Finished at: 2018-05-03T15:54:34Z
[INFO] Final Memory: 378M/2856M
[INFO] ------------------------------------------------------------------------
[ERROR] Failed to execute goal org.apache.maven.plugins:maven-failsafe-plugin:2.18.1:verify (verify) on project atlas-webapp: There are test failures.
[ERROR] 
[ERROR] Please refer to <https://builds.apache.org/job/Atlas-0.8-IntegrationTests/ws/webapp/target/failsafe-reports> for the individual test results.
[ERROR] -> [Help 1]
[ERROR] 
[ERROR] To see the full stack trace of the errors, re-run Maven with the -e switch.
[ERROR] Re-run Maven using the -X switch to enable full debug logging.
[ERROR] 
[ERROR] For more information about the errors and possible solutions, please read the following articles:
[ERROR] [Help 1] http://cwiki.apache.org/confluence/display/MAVEN/MojoFailureException
[ERROR] 
[ERROR] After correcting the problems, you can resume the build with the command
[ERROR]   mvn <goals> -rf :atlas-webapp
Build step 'Execute shell' marked build as failure
[CHECKSTYLE] Collecting checkstyle analysis files...
[CHECKSTYLE] Searching for all files in <https://builds.apache.org/job/Atlas-0.8-IntegrationTests/ws/> that match the pattern **/target/checkstyle-result.xml
[CHECKSTYLE] Parsing 22 files in <https://builds.apache.org/job/Atlas-0.8-IntegrationTests/ws/>
[CHECKSTYLE] Successfully parsed file <https://builds.apache.org/job/Atlas-0.8-IntegrationTests/ws/authorization/target/checkstyle-result.xml> with 471 unique warnings and 0 duplicates.
[CHECKSTYLE] Successfully parsed file <https://builds.apache.org/job/Atlas-0.8-IntegrationTests/ws/catalog/target/checkstyle-result.xml> with 2608 unique warnings and 0 duplicates.
[CHECKSTYLE] Successfully parsed file <https://builds.apache.org/job/Atlas-0.8-IntegrationTests/ws/client/client-v1/target/checkstyle-result.xml> with 3484 unique warnings and 0 duplicates.
[CHECKSTYLE] Successfully parsed file <https://builds.apache.org/job/Atlas-0.8-IntegrationTests/ws/client/client-v2/target/checkstyle-result.xml> with 3814 unique warnings and 0 duplicates.
[CHECKSTYLE] Successfully parsed file <https://builds.apache.org/job/Atlas-0.8-IntegrationTests/ws/client/common/target/checkstyle-result.xml> with 4304 unique warnings and 0 duplicates.
[CHECKSTYLE] Successfully parsed file <https://builds.apache.org/job/Atlas-0.8-IntegrationTests/ws/client/target/checkstyle-result.xml> with 4304 unique warnings and 0 duplicates.
[CHECKSTYLE] Successfully parsed file <https://builds.apache.org/job/Atlas-0.8-IntegrationTests/ws/common/target/checkstyle-result.xml> with 5263 unique warnings and 0 duplicates.
[CHECKSTYLE] Successfully parsed file <https://builds.apache.org/job/Atlas-0.8-IntegrationTests/ws/dashboardv2/target/checkstyle-result.xml> with 5263 unique warnings and 0 duplicates.
[CHECKSTYLE] Successfully parsed file <https://builds.apache.org/job/Atlas-0.8-IntegrationTests/ws/graphdb/api/target/checkstyle-result.xml> with 5536 unique warnings and 0 duplicates.
[CHECKSTYLE] Successfully parsed file <https://builds.apache.org/job/Atlas-0.8-IntegrationTests/ws/graphdb/common/target/checkstyle-result.xml> with 5723 unique warnings and 0 duplicates.
[CHECKSTYLE] Successfully parsed file <https://builds.apache.org/job/Atlas-0.8-IntegrationTests/ws/graphdb/graphdb-impls/target/checkstyle-result.xml> with 5723 unique warnings and 0 duplicates.
[CHECKSTYLE] Successfully parsed file <https://builds.apache.org/job/Atlas-0.8-IntegrationTests/ws/graphdb/target/checkstyle-result.xml> with 5723 unique warnings and 0 duplicates.
[CHECKSTYLE] Successfully parsed file <https://builds.apache.org/job/Atlas-0.8-IntegrationTests/ws/graphdb/titan0/target/checkstyle-result.xml> with 8178 unique warnings and 0 duplicates.
[CHECKSTYLE] Successfully parsed file <https://builds.apache.org/job/Atlas-0.8-IntegrationTests/ws/graphdb/titan1/target/checkstyle-result.xml> with 9145 unique warnings and 0 duplicates.
[CHECKSTYLE] Successfully parsed file <https://builds.apache.org/job/Atlas-0.8-IntegrationTests/ws/intg/target/checkstyle-result.xml> with 16069 unique warnings and 0 duplicates.
[CHECKSTYLE] Successfully parsed file <https://builds.apache.org/job/Atlas-0.8-IntegrationTests/ws/notification/target/checkstyle-result.xml> with 17826 unique warnings and 0 duplicates.
[CHECKSTYLE] Successfully parsed file <https://builds.apache.org/job/Atlas-0.8-IntegrationTests/ws/repository/target/checkstyle-result.xml> with 36863 unique warnings and 0 duplicates.
[CHECKSTYLE] Successfully parsed file <https://builds.apache.org/job/Atlas-0.8-IntegrationTests/ws/server-api/target/checkstyle-result.xml> with 37253 unique warnings and 0 duplicates.
[CHECKSTYLE] Successfully parsed file <https://builds.apache.org/job/Atlas-0.8-IntegrationTests/ws/shaded/hbase-client-shaded/target/checkstyle-result.xml> with 37253 unique warnings and 0 duplicates.
[CHECKSTYLE] Successfully parsed file <https://builds.apache.org/job/Atlas-0.8-IntegrationTests/ws/shaded/hbase-server-shaded/target/checkstyle-result.xml> with 37253 unique warnings and 0 duplicates.
[CHECKSTYLE] Successfully parsed file <https://builds.apache.org/job/Atlas-0.8-IntegrationTests/ws/target/checkstyle-result.xml> with 37253 unique warnings and 0 duplicates.
[CHECKSTYLE] Successfully parsed file <https://builds.apache.org/job/Atlas-0.8-IntegrationTests/ws/typesystem/target/checkstyle-result.xml> with 41494 unique warnings and 0 duplicates.
<Git Blamer> Using GitBlamer to create author and commit information for all warnings.
<Git Blamer> GIT_COMMIT=1500c73b307c34bad0ce1c5a3cff0d213319baab, workspace=<https://builds.apache.org/job/Atlas-0.8-IntegrationTests/ws/>
 > git rev-parse 1500c73b307c34bad0ce1c5a3cff0d213319baab^{commit} # timeout=10
[FINDBUGS] Collecting findbugs analysis files...
[FINDBUGS] Searching for all files in <https://builds.apache.org/job/Atlas-0.8-IntegrationTests/ws/> that match the pattern **/target/findbugs.xml
[FINDBUGS] Parsing 15 files in <https://builds.apache.org/job/Atlas-0.8-IntegrationTests/ws/>
[FINDBUGS] Successfully parsed file <https://builds.apache.org/job/Atlas-0.8-IntegrationTests/ws/authorization/target/findbugs.xml> with 0 unique warnings and 0 duplicates.
[FINDBUGS] Successfully parsed file <https://builds.apache.org/job/Atlas-0.8-IntegrationTests/ws/catalog/target/findbugs.xml> with 0 unique warnings and 0 duplicates.
[FINDBUGS] Successfully parsed file <https://builds.apache.org/job/Atlas-0.8-IntegrationTests/ws/client/client-v1/target/findbugs.xml> with 0 unique warnings and 0 duplicates.
[FINDBUGS] Successfully parsed file <https://builds.apache.org/job/Atlas-0.8-IntegrationTests/ws/client/client-v2/target/findbugs.xml> with 0 unique warnings and 0 duplicates.
[FINDBUGS] Successfully parsed file <https://builds.apache.org/job/Atlas-0.8-IntegrationTests/ws/client/common/target/findbugs.xml> with 0 unique warnings and 0 duplicates.
[FINDBUGS] Successfully parsed file <https://builds.apache.org/job/Atlas-0.8-IntegrationTests/ws/common/target/findbugs.xml> with 0 unique warnings and 0 duplicates.
[FINDBUGS] Successfully parsed file <https://builds.apache.org/job/Atlas-0.8-IntegrationTests/ws/graphdb/api/target/findbugs.xml> with 0 unique warnings and 0 duplicates.
[FINDBUGS] Successfully parsed file <https://builds.apache.org/job/Atlas-0.8-IntegrationTests/ws/graphdb/common/target/findbugs.xml> with 0 unique warnings and 0 duplicates.
[FINDBUGS] Successfully parsed file <https://builds.apache.org/job/Atlas-0.8-IntegrationTests/ws/graphdb/titan0/target/findbugs.xml> with 0 unique warnings and 0 duplicates.
[FINDBUGS] Successfully parsed file <https://builds.apache.org/job/Atlas-0.8-IntegrationTests/ws/graphdb/titan1/target/findbugs.xml> with 0 unique warnings and 0 duplicates.
[FINDBUGS] Successfully parsed file <https://builds.apache.org/job/Atlas-0.8-IntegrationTests/ws/intg/target/findbugs.xml> with 0 unique warnings and 0 duplicates.
[FINDBUGS] Successfully parsed file <https://builds.apache.org/job/Atlas-0.8-IntegrationTests/ws/notification/target/findbugs.xml> with 0 unique warnings and 0 duplicates.
[FINDBUGS] Successfully parsed file <https://builds.apache.org/job/Atlas-0.8-IntegrationTests/ws/repository/target/findbugs.xml> with 0 unique warnings and 0 duplicates.
[FINDBUGS] Successfully parsed file <https://builds.apache.org/job/Atlas-0.8-IntegrationTests/ws/server-api/target/findbugs.xml> with 0 unique warnings and 0 duplicates.
[FINDBUGS] Successfully parsed file <https://builds.apache.org/job/Atlas-0.8-IntegrationTests/ws/typesystem/target/findbugs.xml> with 0 unique warnings and 0 duplicates.
<Git Blamer> Using GitBlamer to create author and commit information for all warnings.
<Git Blamer> GIT_COMMIT=1500c73b307c34bad0ce1c5a3cff0d213319baab, workspace=<https://builds.apache.org/job/Atlas-0.8-IntegrationTests/ws/>
Archiving artifacts
[Fast Archiver] No prior successful build to compare, so performing full copy of artifacts
TestNG Reports Processing: START
Looking for TestNG results report in workspace using pattern: **/target/surefire-reports/testng-results.xml,**/target/failsafe-reports/testng-results.xml
Saving reports...
Processing '/x1/jenkins/jenkins-home/jobs/Atlas-0.8-IntegrationTests/builds/204/testng/testng-results.xml'
2.962963% of tests failed, which exceeded threshold of 0%. Marking build as UNSTABLE
TestNG Reports Processing: FINISH