OSDir

[Date Prev][Date Next][Thread Prev][Thread Next][Date Index][Thread Index]

Build failed in Jenkins: PreCommit-ATLAS-Build-Test #336-master-0001-Revaluate-removal-of-propagated-classifications-duri.patch


See <https://builds.apache.org/job/PreCommit-ATLAS-Build-Test/336/display/redirect?page=changes>

Changes:

[amestry] ATLAS-2624: (2): Fixed the case where same classifications are

------------------------------------------
[...truncated 304.70 KB...]
	at org.janusgraph.graphdb.transaction.StandardJanusGraphTx.verifyAttribute(StandardJanusGraphTx.java:580)
	at org.janusgraph.graphdb.relations.AbstractTypedRelation.property(AbstractTypedRelation.java:120)
	at org.apache.atlas.repository.graphdb.janus.AtlasJanusElement.setProperty(AtlasJanusElement.java:112)
	at org.apache.atlas.repository.store.graph.v1.AtlasGraphUtilsV1.setProperty(AtlasGraphUtilsV1.java:208)
	at org.apache.atlas.repository.store.graph.v1.DeleteHandlerV1.removeTagPropagation(DeleteHandlerV1.java:454)
	at org.apache.atlas.repository.store.graph.v1.SoftDeleteHandlerV1.deleteEdge(SoftDeleteHandlerV1.java:72)
	at org.apache.atlas.repository.store.graph.v1.DeleteHandlerV1.deleteEdgeReference(DeleteHandlerV1.java:317)
	at org.apache.atlas.repository.store.graph.v1.EntityGraphMapper.mapToVertexByTypeCategory(EntityGraphMapper.java:457)
	at org.apache.atlas.repository.store.graph.v1.EntityGraphMapper.mapAttribute(EntityGraphMapper.java:366)
	at org.apache.atlas.repository.store.graph.v1.EntityGraphMapper.mapAttributes(EntityGraphMapper.java:297)
	at org.apache.atlas.repository.store.graph.v1.EntityGraphMapper.mapAttributesAndClassifications(EntityGraphMapper.java:205)
	at org.apache.atlas.repository.store.graph.v1.AtlasEntityStoreV1.createOrUpdate(AtlasEntityStoreV1.java:636)
	at org.apache.atlas.repository.store.graph.v1.AtlasEntityStoreV1.createOrUpdate(AtlasEntityStoreV1.java:167)
	at org.apache.atlas.repository.store.graph.v1.AtlasEntityStoreV1Test.testPartialUpdateAttr(AtlasEntityStoreV1Test.java:769)

testSetObjectIdAttrToNull(org.apache.atlas.repository.store.graph.v1.AtlasEntityStoreV1Test)  Time elapsed: 0.813 sec  <<< FAILURE!
java.lang.IllegalArgumentException: Property value [NONE] is of type class org.apache.atlas.model.typedef.AtlasRelationshipDef$PropagateTags is not supported
	at org.apache.tinkerpop.gremlin.structure.Property$Exceptions.dataTypeOfPropertyValueNotSupported(Property.java:163)
	at org.apache.tinkerpop.gremlin.structure.Property$Exceptions.dataTypeOfPropertyValueNotSupported(Property.java:159)
	at org.janusgraph.graphdb.transaction.StandardJanusGraphTx.verifyAttribute(StandardJanusGraphTx.java:580)
	at org.janusgraph.graphdb.relations.AbstractTypedRelation.property(AbstractTypedRelation.java:120)
	at org.apache.atlas.repository.graphdb.janus.AtlasJanusElement.setProperty(AtlasJanusElement.java:112)
	at org.apache.atlas.repository.store.graph.v1.AtlasGraphUtilsV1.setProperty(AtlasGraphUtilsV1.java:208)
	at org.apache.atlas.repository.store.graph.v1.DeleteHandlerV1.removeTagPropagation(DeleteHandlerV1.java:454)
	at org.apache.atlas.repository.store.graph.v1.SoftDeleteHandlerV1.deleteEdge(SoftDeleteHandlerV1.java:72)
	at org.apache.atlas.repository.store.graph.v1.DeleteHandlerV1.deleteEdge(DeleteHandlerV1.java:653)
	at org.apache.atlas.repository.store.graph.v1.DeleteHandlerV1.deleteEdgeReference(DeleteHandlerV1.java:308)
	at org.apache.atlas.repository.store.graph.v1.EntityGraphMapper.mapToVertexByTypeCategory(EntityGraphMapper.java:457)
	at org.apache.atlas.repository.store.graph.v1.EntityGraphMapper.mapAttribute(EntityGraphMapper.java:366)
	at org.apache.atlas.repository.store.graph.v1.EntityGraphMapper.mapAttributes(EntityGraphMapper.java:297)
	at org.apache.atlas.repository.store.graph.v1.EntityGraphMapper.mapAttributesAndClassifications(EntityGraphMapper.java:205)
	at org.apache.atlas.repository.store.graph.v1.AtlasEntityStoreV1.createOrUpdate(AtlasEntityStoreV1.java:636)
	at org.apache.atlas.repository.store.graph.v1.AtlasEntityStoreV1.createOrUpdate(AtlasEntityStoreV1.java:167)
	at org.apache.atlas.repository.store.graph.v1.AtlasEntityStoreV1Test.testSetObjectIdAttrToNull(AtlasEntityStoreV1Test.java:902)

testArrayOfEntityUpdate(org.apache.atlas.repository.store.graph.v1.AtlasEntityStoreV1Test)  Time elapsed: 0.105 sec  <<< FAILURE!
java.lang.IllegalArgumentException: Property value [NONE] is of type class org.apache.atlas.model.typedef.AtlasRelationshipDef$PropagateTags is not supported
	at org.apache.tinkerpop.gremlin.structure.Property$Exceptions.dataTypeOfPropertyValueNotSupported(Property.java:163)
	at org.apache.tinkerpop.gremlin.structure.Property$Exceptions.dataTypeOfPropertyValueNotSupported(Property.java:159)
	at org.janusgraph.graphdb.transaction.StandardJanusGraphTx.verifyAttribute(StandardJanusGraphTx.java:580)
	at org.janusgraph.graphdb.relations.AbstractTypedRelation.property(AbstractTypedRelation.java:120)
	at org.apache.atlas.repository.graphdb.janus.AtlasJanusElement.setProperty(AtlasJanusElement.java:112)
	at org.apache.atlas.repository.store.graph.v1.AtlasGraphUtilsV1.setProperty(AtlasGraphUtilsV1.java:208)
	at org.apache.atlas.repository.store.graph.v1.DeleteHandlerV1.removeTagPropagation(DeleteHandlerV1.java:454)
	at org.apache.atlas.repository.store.graph.v1.SoftDeleteHandlerV1.deleteEdge(SoftDeleteHandlerV1.java:72)
	at org.apache.atlas.repository.store.graph.v1.DeleteHandlerV1.deleteEdgeReference(DeleteHandlerV1.java:317)
	at org.apache.atlas.repository.store.graph.v1.EntityGraphMapper.mapToVertexByTypeCategory(EntityGraphMapper.java:457)
	at org.apache.atlas.repository.store.graph.v1.EntityGraphMapper.mapAttribute(EntityGraphMapper.java:366)
	at org.apache.atlas.repository.store.graph.v1.EntityGraphMapper.mapAttributes(EntityGraphMapper.java:297)
	at org.apache.atlas.repository.store.graph.v1.EntityGraphMapper.mapAttributesAndClassifications(EntityGraphMapper.java:205)
	at org.apache.atlas.repository.store.graph.v1.AtlasEntityStoreV1.createOrUpdate(AtlasEntityStoreV1.java:636)
	at org.apache.atlas.repository.store.graph.v1.AtlasEntityStoreV1.createOrUpdate(AtlasEntityStoreV1.java:167)
	at org.apache.atlas.repository.store.graph.v1.AtlasEntityStoreV1Test.testArrayOfEntityUpdate(AtlasEntityStoreV1Test.java:272)

testClassUpdate(org.apache.atlas.repository.store.graph.v1.AtlasEntityStoreV1Test)  Time elapsed: 0.167 sec  <<< FAILURE!
java.lang.IllegalArgumentException: Property value [NONE] is of type class org.apache.atlas.model.typedef.AtlasRelationshipDef$PropagateTags is not supported
	at org.apache.tinkerpop.gremlin.structure.Property$Exceptions.dataTypeOfPropertyValueNotSupported(Property.java:163)
	at org.apache.tinkerpop.gremlin.structure.Property$Exceptions.dataTypeOfPropertyValueNotSupported(Property.java:159)
	at org.janusgraph.graphdb.transaction.StandardJanusGraphTx.verifyAttribute(StandardJanusGraphTx.java:580)
	at org.janusgraph.graphdb.relations.AbstractTypedRelation.property(AbstractTypedRelation.java:120)
	at org.apache.atlas.repository.graphdb.janus.AtlasJanusElement.setProperty(AtlasJanusElement.java:112)
	at org.apache.atlas.repository.store.graph.v1.AtlasGraphUtilsV1.setProperty(AtlasGraphUtilsV1.java:208)
	at org.apache.atlas.repository.store.graph.v1.DeleteHandlerV1.removeTagPropagation(DeleteHandlerV1.java:454)
	at org.apache.atlas.repository.store.graph.v1.SoftDeleteHandlerV1.deleteEdge(SoftDeleteHandlerV1.java:72)
	at org.apache.atlas.repository.store.graph.v1.DeleteHandlerV1.deleteEdgeReference(DeleteHandlerV1.java:317)
	at org.apache.atlas.repository.store.graph.v1.EntityGraphMapper.mapToVertexByTypeCategory(EntityGraphMapper.java:457)
	at org.apache.atlas.repository.store.graph.v1.EntityGraphMapper.mapAttribute(EntityGraphMapper.java:366)
	at org.apache.atlas.repository.store.graph.v1.EntityGraphMapper.mapAttributes(EntityGraphMapper.java:297)
	at org.apache.atlas.repository.store.graph.v1.EntityGraphMapper.mapAttributesAndClassifications(EntityGraphMapper.java:205)
	at org.apache.atlas.repository.store.graph.v1.AtlasEntityStoreV1.createOrUpdate(AtlasEntityStoreV1.java:636)
	at org.apache.atlas.repository.store.graph.v1.AtlasEntityStoreV1.createOrUpdate(AtlasEntityStoreV1.java:167)
	at org.apache.atlas.repository.store.graph.v1.AtlasEntityStoreV1Test.testClassUpdate(AtlasEntityStoreV1Test.java:586)

testUpdateEntityWithMap(org.apache.atlas.repository.store.graph.v1.AtlasEntityStoreV1Test)  Time elapsed: 1.032 sec  <<< FAILURE!
java.lang.IllegalArgumentException: Property value [NONE] is of type class org.apache.atlas.model.typedef.AtlasRelationshipDef$PropagateTags is not supported
	at org.apache.tinkerpop.gremlin.structure.Property$Exceptions.dataTypeOfPropertyValueNotSupported(Property.java:163)
	at org.apache.tinkerpop.gremlin.structure.Property$Exceptions.dataTypeOfPropertyValueNotSupported(Property.java:159)
	at org.janusgraph.graphdb.transaction.StandardJanusGraphTx.verifyAttribute(StandardJanusGraphTx.java:580)
	at org.janusgraph.graphdb.relations.AbstractTypedRelation.property(AbstractTypedRelation.java:120)
	at org.apache.atlas.repository.graphdb.janus.AtlasJanusElement.setProperty(AtlasJanusElement.java:112)
	at org.apache.atlas.repository.store.graph.v1.AtlasGraphUtilsV1.setProperty(AtlasGraphUtilsV1.java:208)
	at org.apache.atlas.repository.store.graph.v1.DeleteHandlerV1.removeTagPropagation(DeleteHandlerV1.java:454)
	at org.apache.atlas.repository.store.graph.v1.SoftDeleteHandlerV1.deleteEdge(SoftDeleteHandlerV1.java:72)
	at org.apache.atlas.repository.store.graph.v1.DeleteHandlerV1.deleteEdge(DeleteHandlerV1.java:653)
	at org.apache.atlas.repository.store.graph.v1.DeleteHandlerV1.deleteEdgeReference(DeleteHandlerV1.java:308)
	at org.apache.atlas.repository.store.graph.v1.DeleteHandlerV1.deleteEdgeReference(DeleteHandlerV1.java:281)
	at org.apache.atlas.repository.store.graph.v1.EntityGraphMapper.removeUnusedMapEntries(EntityGraphMapper.java:1134)
	at org.apache.atlas.repository.store.graph.v1.EntityGraphMapper.mapMapValue(EntityGraphMapper.java:848)
	at org.apache.atlas.repository.store.graph.v1.EntityGraphMapper.mapToVertexByTypeCategory(EntityGraphMapper.java:465)
	at org.apache.atlas.repository.store.graph.v1.EntityGraphMapper.mapAttribute(EntityGraphMapper.java:366)
	at org.apache.atlas.repository.store.graph.v1.EntityGraphMapper.mapAttributes(EntityGraphMapper.java:297)
	at org.apache.atlas.repository.store.graph.v1.EntityGraphMapper.mapAttributesAndClassifications(EntityGraphMapper.java:205)
	at org.apache.atlas.repository.store.graph.v1.AtlasEntityStoreV1.createOrUpdate(AtlasEntityStoreV1.java:636)
	at org.apache.atlas.repository.store.graph.v1.AtlasEntityStoreV1.createOrUpdate(AtlasEntityStoreV1.java:167)
	at org.apache.atlas.repository.store.graph.v1.AtlasEntityStoreV1Test.testUpdateEntityWithMap(AtlasEntityStoreV1Test.java:431)

Tests run: 1, Failures: 0, Errors: 0, Skipped: 0, Time elapsed: 89.183 sec - in org.apache.atlas.repository.migration.PathTest
Tests run: 18, Failures: 0, Errors: 0, Skipped: 0, Time elapsed: 93.407 sec - in org.apache.atlas.repository.store.graph.AtlasTypeDefGraphStoreTest
Tests run: 31, Failures: 2, Errors: 0, Skipped: 6, Time elapsed: 86.842 sec <<< FAILURE! - in org.apache.atlas.glossary.GlossaryServiceTest
testTermAssignmentAndDissociation(org.apache.atlas.glossary.GlossaryServiceTest)  Time elapsed: 0.592 sec  <<< FAILURE!
java.lang.AssertionError: expected [null] but found [[AtlasRelatedObjectId{AtlasObjectId{guid='0af3f899-ef30-496e-865c-3d58ee80206d', typeName='Asset', uniqueAttributes={}}displayText='testAsset', relationshipGuid='a798cb82-8916-4328-9e94-780fdc487180', relationshipStatus='ACTIVE', relationshipAttributes=AtlasStruct{typeName='__AtlasGlossarySemanticAssignment', attributes=[expression:null, createdBy:null, steward:null, confidence:null, description:null, source:null, status:null]}}]]
	at org.testng.Assert.fail(Assert.java:94)
	at org.testng.Assert.failNotSame(Assert.java:492)
	at org.testng.Assert.assertNull(Assert.java:428)
	at org.testng.Assert.assertNull(Assert.java:417)
	at org.apache.atlas.glossary.GlossaryServiceTest.testTermAssignmentAndDissociation(GlossaryServiceTest.java:688)

testUpdateGlossaryCategory(org.apache.atlas.glossary.GlossaryServiceTest)  Time elapsed: 0.965 sec  <<< FAILURE!
java.lang.AssertionError: expected [null] but found [[AtlasRelatedCategoryId{categoryGuid='01e16dba-5cee-49c2-bad0-008be45f0f88', parentCategoryGuid='null', relationGuid='c0f9cc57-2ac5-4946-b69c-cc3876d4e84d', displayText='null', description='null'}, AtlasRelatedCategoryId{categoryGuid='80b086e4-2925-48b2-b8d4-9ace08d79498', parentCategoryGuid='null', relationGuid='07ee5bee-9104-4c72-b79a-647010f3810e', displayText='null', description='null'}]]
	at org.testng.Assert.fail(Assert.java:94)
	at org.testng.Assert.failNotSame(Assert.java:492)
	at org.testng.Assert.assertNull(Assert.java:428)
	at org.testng.Assert.assertNull(Assert.java:417)
	at org.apache.atlas.glossary.GlossaryServiceTest.testUpdateGlossaryCategory(GlossaryServiceTest.java:467)

Tests run: 1, Failures: 0, Errors: 0, Skipped: 0, Time elapsed: 97.765 sec - in org.apache.atlas.repository.migration.HiveParititionTest
Tests run: 1, Failures: 0, Errors: 0, Skipped: 0, Time elapsed: 102.803 sec - in org.apache.atlas.repository.migration.HiveStocksTest
Tests run: 14, Failures: 0, Errors: 0, Skipped: 0, Time elapsed: 111.71 sec - in org.apache.atlas.repository.impexp.ImportServiceTest
Tests run: 9, Failures: 0, Errors: 0, Skipped: 0, Time elapsed: 116.493 sec - in org.apache.atlas.repository.tagpropagation.ClassificationPropagationTest
Tests run: 246, Failures: 0, Errors: 0, Skipped: 0, Time elapsed: 163.853 sec - in org.apache.atlas.query.DSLQueriesTest

Results :

Failed tests: 
  GlossaryServiceTest.testTermAssignmentAndDissociation:688 expected [null] but found [[AtlasRelatedObjectId{AtlasObjectId{guid='0af3f899-ef30-496e-865c-3d58ee80206d', typeName='Asset', uniqueAttributes={}}displayText='testAsset', relationshipGuid='a798cb82-8916-4328-9e94-780fdc487180', relationshipStatus='ACTIVE', relationshipAttributes=AtlasStruct{typeName='__AtlasGlossarySemanticAssignment', attributes=[expression:null, createdBy:null, steward:null, confidence:null, description:null, source:null, status:null]}}]]
  GlossaryServiceTest.testUpdateGlossaryCategory:467 expected [null] but found [[AtlasRelatedCategoryId{categoryGuid='01e16dba-5cee-49c2-bad0-008be45f0f88', parentCategoryGuid='null', relationGuid='c0f9cc57-2ac5-4946-b69c-cc3876d4e84d', displayText='null', description='null'}, AtlasRelatedCategoryId{categoryGuid='80b086e4-2925-48b2-b8d4-9ace08d79498', parentCategoryGuid='null', relationGuid='07ee5bee-9104-4c72-b79a-647010f3810e', displayText='null', description='null'}]]
  AtlasEntityStoreV1Test.testArrayOfEntityUpdate:272 » IllegalArgument Property ...
  AtlasEntityStoreV1Test.testClassUpdate:586 » IllegalArgument Property value [N...
  AtlasEntityStoreV1Test.testPartialUpdateAttr:769 » IllegalArgument Property va...
  AtlasEntityStoreV1Test.testSetObjectIdAttrToNull:902 » IllegalArgument Propert...
  AtlasEntityStoreV1Test.testUpdateEntityWithMap:431 » IllegalArgument Property ...
  InverseReferenceUpdateHardDeleteV1Test>InverseReferenceUpdateV1Test.testInverseReferenceAutoUpdate_Map:343 » IllegalArgument
  InverseReferenceUpdateHardDeleteV1Test>InverseReferenceUpdateV1Test.testInverseReferenceAutoUpdate_NonCompositeManyToOne:188 » IllegalArgument
  InverseReferenceUpdateHardDeleteV1Test>InverseReferenceUpdateV1Test.testInverseReferenceAutoUpdate_NonComposite_OneToMany:125 » IllegalArgument
  InverseReferenceUpdateHardDeleteV1Test>InverseReferenceUpdateV1Test.testInverseReferenceAutoUpdate_NonComposite_OneToOne:241 » IllegalArgument
  InverseReferenceUpdateSoftDeleteV1Test>InverseReferenceUpdateV1Test.testInverseReferenceAutoUpdate_Map:343 » IllegalArgument
  InverseReferenceUpdateSoftDeleteV1Test>InverseReferenceUpdateV1Test.testInverseReferenceAutoUpdate_NonCompositeManyToOne:188 » IllegalArgument
  InverseReferenceUpdateSoftDeleteV1Test>InverseReferenceUpdateV1Test.testInverseReferenceAutoUpdate_NonComposite_OneToMany:125 » IllegalArgument
  InverseReferenceUpdateSoftDeleteV1Test>InverseReferenceUpdateV1Test.testInverseReferenceAutoUpdate_NonComposite_OneToOne:241 » IllegalArgument

Tests run: 535, Failures: 15, Errors: 0, Skipped: 6

[INFO] ------------------------------------------------------------------------
[INFO] Reactor Summary:
[INFO] 
[INFO] Apache Atlas Server Build Tools .................... SUCCESS [  0.648 s]
[INFO] apache-atlas ....................................... SUCCESS [  3.422 s]
[INFO] Apache Atlas Test Utility Tools .................... SUCCESS [  4.792 s]
[INFO] Open Connector Framework (OCF) ..................... SUCCESS [  1.884 s]
[INFO] Open Metadata Repository Services (OMRS) ........... SUCCESS [  5.964 s]
[INFO] Open Metadata and Governance (OMAG) Server APIs .... SUCCESS [  1.011 s]
[INFO] Connected Asset Open Metadata Access Service (OMAS)  SUCCESS [  1.192 s]
[INFO] Asset Consumer Open Metadata Access Service (OMAS) . SUCCESS [  1.062 s]
[INFO] Open Metadata and Governance (OMAG) Server ......... SUCCESS [  0.822 s]
[INFO] Apache Atlas Integration ........................... SUCCESS [ 38.079 s]
[INFO] Apache Atlas Common ................................ SUCCESS [  2.526 s]
[INFO] Apache Atlas Client ................................ SUCCESS [  0.120 s]
[INFO] atlas-client-common ................................ SUCCESS [  0.648 s]
[INFO] atlas-client-v1 .................................... SUCCESS [  2.690 s]
[INFO] Apache Atlas Server API ............................ SUCCESS [  0.776 s]
[INFO] Apache Atlas Notification .......................... SUCCESS [ 16.860 s]
[INFO] atlas-client-v2 .................................... SUCCESS [  0.656 s]
[INFO] Apache Atlas Graph Database Projects ............... SUCCESS [  0.087 s]
[INFO] Apache Atlas Graph Database API .................... SUCCESS [  0.617 s]
[INFO] Graph Database Common Code ......................... SUCCESS [  0.743 s]
[INFO] Apache Atlas JanusGraph DB Impl .................... SUCCESS [01:51 min]
[INFO] Apache Atlas Graph Database Implementation Dependencies SUCCESS [  1.871 s]
[INFO] Shaded version of Apache hbase client .............. SUCCESS [  7.401 s]
[INFO] Apache Atlas Titan 0.5.4 Graph DB Impl ............. SUCCESS [ 28.005 s]
[INFO] Shaded version of Apache hbase server .............. SUCCESS [ 20.132 s]
[INFO] Apache Atlas Authorization ......................... SUCCESS [  2.292 s]
[INFO] Apache Atlas Repository ............................ FAILURE [02:59 min]
[INFO] Apache Atlas UI .................................... SKIPPED
[INFO] Apache Atlas Web Application ....................... SKIPPED
[INFO] Apache Atlas Documentation ......................... SKIPPED
[INFO] Apache Atlas FileSystem Model ...................... SKIPPED
[INFO] Apache Atlas Plugin Classloader .................... SKIPPED
[INFO] Apache Atlas Hive Bridge Shim ...................... SKIPPED
[INFO] Apache Atlas Hive Bridge ........................... SKIPPED
[INFO] Apache Atlas Falcon Bridge Shim .................... SKIPPED
[INFO] Apache Atlas Falcon Bridge ......................... SKIPPED
[INFO] Apache Atlas Sqoop Bridge Shim ..................... SKIPPED
[INFO] Apache Atlas Sqoop Bridge .......................... SKIPPED
[INFO] Apache Atlas Storm Bridge Shim ..................... SKIPPED
[INFO] Apache Atlas Storm Bridge .......................... SKIPPED
[INFO] Apache Atlas Hbase Bridge Shim ..................... SKIPPED
[INFO] Apache Atlas Hbase Bridge .......................... SKIPPED
[INFO] Apache Atlas Kafka Bridge .......................... SKIPPED
[INFO] Apache Atlas Migration Exporter .................... SKIPPED
[INFO] Apache Atlas Distribution .......................... SKIPPED
[INFO] ------------------------------------------------------------------------
[INFO] BUILD FAILURE
[INFO] ------------------------------------------------------------------------
[INFO] Total time: 07:17 min
[INFO] Finished at: 2018-05-03T05:03:44Z
[INFO] Final Memory: 159M/1961M
[INFO] ------------------------------------------------------------------------
[ERROR] Failed to execute goal org.apache.maven.plugins:maven-surefire-plugin:2.18.1:test (default-test) on project atlas-repository: There are test failures.
[ERROR] 
[ERROR] Please refer to <https://builds.apache.org/job/PreCommit-ATLAS-Build-Test/ws/repository/target/surefire-reports> for the individual test results.
[ERROR] -> [Help 1]
[ERROR] 
[ERROR] To see the full stack trace of the errors, re-run Maven with the -e switch.
[ERROR] Re-run Maven using the -X switch to enable full debug logging.
[ERROR] 
[ERROR] For more information about the errors and possible solutions, please read the following articles:
[ERROR] [Help 1] http://cwiki.apache.org/confluence/display/MAVEN/MojoFailureException
[ERROR] 
[ERROR] After correcting the problems, you can resume the build with the command
[ERROR]   mvn <goals> -rf :atlas-repository




{color:red}-1 overall{color}.  

    {color:green}+1 @author{color}.  The patch does not contain any @author tags.

Console output: https://builds.apache.org/job/PreCommit-ATLAS-Build-Test/336//console

This message is automatically generated.


======================================================================
======================================================================
    Adding comment to Jira.
======================================================================
======================================================================




======================================================================
======================================================================
    Finished build.
======================================================================
======================================================================


+ EXIT_CODE=1
+ '[' -d <https://builds.apache.org/job/PreCommit-ATLAS-Build-Test/ws/../atlas_patchprocess_4108> ']'
+ '[' -d <https://builds.apache.org/job/PreCommit-ATLAS-Build-Test/ws/atlas_patchprocess_4108> ']'
+ mv <https://builds.apache.org/job/PreCommit-ATLAS-Build-Test/ws/atlas_patchprocess_4108> <https://builds.apache.org/job/PreCommit-ATLAS-Build-Test/ws/patchprocess>
+ rm -f <https://builds.apache.org/job/PreCommit-ATLAS-Build-Test/ws/../atlas_patchprocess_4108>
+ exit 1
Build step 'Execute shell' marked build as failure
Set build name.
New build name is '#336-master-0001-Revaluate-removal-of-propagated-classifications-duri.patch'
Archiving artifacts