OSDir

[Date Prev][Date Next][Thread Prev][Thread Next][Date Index][Thread Index]

Build failed in Jenkins: PreCommit-ATLAS-Build-Test #334-master-ATLAS-2624-2-Fixed-the-case-where-same-classificatio.patch


See <https://builds.apache.org/job/PreCommit-ATLAS-Build-Test/334/display/redirect?page=changes>

Changes:

[ssubramanian] Summary:ATLAS-2579 : UI : Block Propagation at classification level in

------------------------------------------
[...truncated 258.13 KB...]
[INFO] Exclude: **/public/js/libs/**
[INFO] Exclude: **/atlas.data/**
[INFO] Exclude: **/${sys:atlas.data}/**
[INFO] Exclude: **/policy-store.txt
[INFO] Exclude: **/*rebel*.xml
[INFO] Exclude: **/*rebel*.xml.bak
[INFO] Exclude: **/test/resources/**
[INFO] 172 resources included (use -debug for more details)
[INFO] Rat check: Summary over all files. Unapproved: 0, unknown: 0, generated: 0, approved: 172 licenses.
[INFO] 
[INFO] --- maven-resources-plugin:2.7:copy-resources (copy-resources-solr) @ atlas-repository ---
[INFO] Using 'UTF-8' encoding to copy filtered resources.
[INFO] Copying 9 resources
[INFO] 
[INFO] --- maven-remote-resources-plugin:1.5:process (default) @ atlas-repository ---
[INFO] 
[INFO] --- maven-resources-plugin:2.7:resources (default-resources) @ atlas-repository ---
[INFO] Using 'UTF-8' encoding to copy filtered resources.
[INFO] skip non existing resourceDirectory <https://builds.apache.org/job/PreCommit-ATLAS-Build-Test/ws/repository/src/main/resources>
[INFO] Copying 2 resources to META-INF
[INFO] Copying 3 resources
[INFO] 
[INFO] --- maven-compiler-plugin:3.7.0:compile (default-compile) @ atlas-repository ---
[INFO] Changes detected - recompiling the module!
[INFO] Compiling 132 source files to <https://builds.apache.org/job/PreCommit-ATLAS-Build-Test/ws/repository/target/classes>
[INFO] <https://builds.apache.org/job/PreCommit-ATLAS-Build-Test/ws/repository/src/main/java/org/apache/atlas/repository/converters/AtlasInstanceConverter.java>: Some input files use or override a deprecated API.
[INFO] <https://builds.apache.org/job/PreCommit-ATLAS-Build-Test/ws/repository/src/main/java/org/apache/atlas/repository/converters/AtlasInstanceConverter.java>: Recompile with -Xlint:deprecation for details.
[INFO] <https://builds.apache.org/job/PreCommit-ATLAS-Build-Test/ws/repository/src/main/java/org/apache/atlas/util/SearchPredicateUtil.java>: Some input files use unchecked or unsafe operations.
[INFO] <https://builds.apache.org/job/PreCommit-ATLAS-Build-Test/ws/repository/src/main/java/org/apache/atlas/util/SearchPredicateUtil.java>: Recompile with -Xlint:unchecked for details.
[INFO] 
[INFO] --- maven-resources-plugin:2.7:testResources (default-testResources) @ atlas-repository ---
[INFO] Using 'UTF-8' encoding to copy filtered resources.
[INFO] Copying 35 resources
[INFO] Copying 3 resources
[INFO] 
[INFO] --- maven-compiler-plugin:3.7.0:testCompile (default-testCompile) @ atlas-repository ---
[INFO] Changes detected - recompiling the module!
[INFO] Compiling 43 source files to <https://builds.apache.org/job/PreCommit-ATLAS-Build-Test/ws/repository/target/test-classes>
[INFO] <https://builds.apache.org/job/PreCommit-ATLAS-Build-Test/ws/repository/src/test/java/org/apache/atlas/query/BasicTestSetup.java>: <https://builds.apache.org/job/PreCommit-ATLAS-Build-Test/ws/repository/src/test/java/org/apache/atlas/query/BasicTestSetup.java> uses or overrides a deprecated API.
[INFO] <https://builds.apache.org/job/PreCommit-ATLAS-Build-Test/ws/repository/src/test/java/org/apache/atlas/query/BasicTestSetup.java>: Recompile with -Xlint:deprecation for details.
[INFO] <https://builds.apache.org/job/PreCommit-ATLAS-Build-Test/ws/repository/src/test/java/org/apache/atlas/repository/impexp/UniqueListTest.java>: Some input files use unchecked or unsafe operations.
[INFO] <https://builds.apache.org/job/PreCommit-ATLAS-Build-Test/ws/repository/src/test/java/org/apache/atlas/repository/impexp/UniqueListTest.java>: Recompile with -Xlint:unchecked for details.
[INFO] 
[INFO] --- maven-surefire-plugin:2.18.1:test (default-test) @ atlas-repository ---
[INFO] Surefire report directory: <https://builds.apache.org/job/PreCommit-ATLAS-Build-Test/ws/repository/target/surefire-reports>
[INFO] Using configured provider org.apache.maven.surefire.testng.TestNGProvider

-------------------------------------------------------
 T E S T S
-------------------------------------------------------
Running org.apache.atlas.repository.store.graph.AtlasTypeDefGraphStoreTest
Running org.apache.atlas.repository.userprofile.UserProfileServiceTest
Running org.apache.atlas.repository.impexp.TypeAttributeDifferenceTest
Running org.apache.atlas.repository.impexp.ImportServiceTest
Running org.apache.atlas.repository.tagpropagation.ClassificationPropagationTest
Running org.apache.atlas.repository.migration.HiveParititionTest
Running org.apache.atlas.repository.store.graph.v1.AtlasRelationshipDefStoreV1Test
Running org.apache.atlas.repository.migration.RelationshipMappingTest
Running org.apache.atlas.repository.impexp.UniqueListTest
Running org.apache.atlas.repository.store.graph.v1.AtlasEntityStoreV1BulkImportPercentTest
Running org.apache.atlas.repository.store.graph.v1.AtlasRelationshipStoreV1Test
Running org.apache.atlas.repository.store.graph.v1.AtlasRelationshipStoreHardDeleteV1Test
Running org.apache.atlas.repository.migration.MigrationProgressServiceTest
Running org.apache.atlas.repository.impexp.ZipSourceTest
Running org.apache.atlas.repository.migration.HiveStocksTest
Running org.apache.atlas.repository.store.graph.v1.AtlasEntityStoreV1Test
Running org.apache.atlas.repository.migration.PathTest
Running org.apache.atlas.repository.store.graph.v1.InverseReferenceUpdateHardDeleteV1Test
Running org.apache.atlas.repository.impexp.ZipSinkTest
Running org.apache.atlas.repository.impexp.AtlasImportRequestTest
Running org.apache.atlas.repository.impexp.ImportTransformsTest
Running org.apache.atlas.repository.impexp.ImportTransformerJSONTest
Running org.apache.atlas.repository.store.graph.v1.AtlasRelationshipStoreSoftDeleteV1Test
Running org.apache.atlas.repository.store.graph.v1.InverseReferenceUpdateSoftDeleteV1Test
Running org.apache.atlas.services.MetricsServiceTest
Running org.apache.atlas.repository.impexp.ImportTransformerTest
Running org.apache.atlas.repository.store.graph.v1.InverseReferenceUpdateV1Test
Running org.apache.atlas.repository.store.graph.v1.AtlasEntityDefStoreV1Test
Running org.apache.atlas.repository.audit.InMemoryAuditRepositoryTest
Running org.apache.atlas.query.DSLParsingTest
Running org.apache.atlas.repository.impexp.ExportServiceTest
Running org.apache.atlas.repository.audit.CassandraAuditRepositoryTest
Tests run: 0, Failures: 0, Errors: 0, Skipped: 0, Time elapsed: 4.574 sec - in org.apache.atlas.repository.store.graph.v1.AtlasRelationshipStoreV1Test
Tests run: 4, Failures: 0, Errors: 0, Skipped: 0, Time elapsed: 5.559 sec - in org.apache.atlas.repository.impexp.UniqueListTest
Tests run: 0, Failures: 0, Errors: 0, Skipped: 0, Time elapsed: 3.906 sec - in org.apache.atlas.repository.store.graph.v1.InverseReferenceUpdateV1Test
Tests run: 8, Failures: 0, Errors: 0, Skipped: 0, Time elapsed: 4.586 sec - in org.apache.atlas.repository.impexp.ImportTransformerTest
Tests run: 6, Failures: 0, Errors: 0, Skipped: 0, Time elapsed: 4.226 sec - in org.apache.atlas.repository.audit.InMemoryAuditRepositoryTest
Running org.apache.atlas.query.GremlinQueryComposerTest
Tests run: 6, Failures: 0, Errors: 0, Skipped: 0, Time elapsed: 8.53 sec - in org.apache.atlas.repository.impexp.TypeAttributeDifferenceTest
Running org.apache.atlas.query.DSLQueriesTest
Running org.apache.atlas.glossary.PaginationHelperTest
Running org.apache.atlas.glossary.GlossaryServiceTest
Tests run: 6, Failures: 0, Errors: 0, Skipped: 0, Time elapsed: 8.657 sec - in org.apache.atlas.repository.impexp.ZipSourceTest
Tests run: 1, Failures: 0, Errors: 0, Skipped: 0, Time elapsed: 7.877 sec - in org.apache.atlas.repository.impexp.ImportTransformerJSONTest
Tests run: 6, Failures: 0, Errors: 0, Skipped: 0, Time elapsed: 8.409 sec - in org.apache.atlas.repository.impexp.AtlasImportRequestTest
Running org.apache.atlas.TestModules
Tests run: 3, Failures: 0, Errors: 0, Skipped: 0, Time elapsed: 9.185 sec - in org.apache.atlas.repository.impexp.ImportTransformsTest
Tests run: 9, Failures: 0, Errors: 0, Skipped: 0, Time elapsed: 10.324 sec - in org.apache.atlas.repository.store.graph.v1.AtlasEntityStoreV1BulkImportPercentTest
Tests run: 8, Failures: 0, Errors: 0, Skipped: 0, Time elapsed: 7.645 sec - in org.apache.atlas.query.DSLParsingTest
Running org.apache.atlas.utils.TestResourceFileUtils
Tests run: 4, Failures: 0, Errors: 0, Skipped: 0, Time elapsed: 10.705 sec - in org.apache.atlas.repository.migration.MigrationProgressServiceTest
Tests run: 8, Failures: 0, Errors: 0, Skipped: 0, Time elapsed: 10.223 sec - in org.apache.atlas.repository.impexp.ZipSinkTest
Running org.apache.atlas.utils.ObjectUpdateSynchronizerTest
Tests run: 0, Failures: 0, Errors: 0, Skipped: 0, Time elapsed: 2.658 sec - in org.apache.atlas.TestModules
Tests run: 0, Failures: 0, Errors: 0, Skipped: 0, Time elapsed: 1.446 sec - in org.apache.atlas.utils.TestResourceFileUtils
Tests run: 20, Failures: 0, Errors: 0, Skipped: 0, Time elapsed: 4.253 sec - in org.apache.atlas.glossary.PaginationHelperTest
Tests run: 9, Failures: 0, Errors: 0, Skipped: 0, Time elapsed: 4.202 sec - in org.apache.atlas.utils.ObjectUpdateSynchronizerTest
Tests run: 39, Failures: 0, Errors: 0, Skipped: 0, Time elapsed: 21.148 sec - in org.apache.atlas.query.GremlinQueryComposerTest
Tests run: 6, Failures: 0, Errors: 0, Skipped: 0, Time elapsed: 33.084 sec - in org.apache.atlas.repository.audit.CassandraAuditRepositoryTest
Tests run: 1, Failures: 0, Errors: 0, Skipped: 0, Time elapsed: 41.331 sec - in org.apache.atlas.services.MetricsServiceTest
Tests run: 1, Failures: 0, Errors: 0, Skipped: 0, Time elapsed: 62.431 sec - in org.apache.atlas.repository.store.graph.v1.AtlasEntityDefStoreV1Test
Tests run: 10, Failures: 0, Errors: 0, Skipped: 0, Time elapsed: 66.72 sec - in org.apache.atlas.repository.store.graph.v1.AtlasRelationshipDefStoreV1Test
Tests run: 1, Failures: 0, Errors: 0, Skipped: 0, Time elapsed: 89.806 sec - in org.apache.atlas.repository.migration.RelationshipMappingTest
Tests run: 4, Failures: 0, Errors: 0, Skipped: 0, Time elapsed: 89.417 sec - in org.apache.atlas.repository.store.graph.v1.AtlasRelationshipStoreSoftDeleteV1Test
Tests run: 4, Failures: 0, Errors: 0, Skipped: 0, Time elapsed: 92.06 sec - in org.apache.atlas.repository.store.graph.v1.AtlasRelationshipStoreHardDeleteV1Test
Tests run: 5, Failures: 0, Errors: 0, Skipped: 0, Time elapsed: 91.32 sec - in org.apache.atlas.repository.store.graph.v1.InverseReferenceUpdateSoftDeleteV1Test
Tests run: 12, Failures: 0, Errors: 0, Skipped: 0, Time elapsed: 95.414 sec - in org.apache.atlas.repository.userprofile.UserProfileServiceTest
Tests run: 5, Failures: 0, Errors: 0, Skipped: 0, Time elapsed: 94.154 sec - in org.apache.atlas.repository.store.graph.v1.InverseReferenceUpdateHardDeleteV1Test
Tests run: 12, Failures: 0, Errors: 0, Skipped: 0, Time elapsed: 92.197 sec - in org.apache.atlas.repository.impexp.ExportServiceTest
Tests run: 18, Failures: 0, Errors: 0, Skipped: 0, Time elapsed: 107.495 sec - in org.apache.atlas.repository.store.graph.AtlasTypeDefGraphStoreTest
Tests run: 35, Failures: 0, Errors: 0, Skipped: 0, Time elapsed: 100.004 sec - in org.apache.atlas.glossary.GlossaryServiceTest
Tests run: 16, Failures: 0, Errors: 0, Skipped: 0, Time elapsed: 108.806 sec - in org.apache.atlas.repository.store.graph.v1.AtlasEntityStoreV1Test
Tests run: 1, Failures: 0, Errors: 0, Skipped: 0, Time elapsed: 112.338 sec - in org.apache.atlas.repository.migration.HiveParititionTest
Tests run: 1, Failures: 0, Errors: 0, Skipped: 0, Time elapsed: 111.707 sec - in org.apache.atlas.repository.migration.PathTest
Tests run: 1, Failures: 0, Errors: 0, Skipped: 0, Time elapsed: 113.345 sec - in org.apache.atlas.repository.migration.HiveStocksTest
Tests run: 14, Failures: 0, Errors: 0, Skipped: 0, Time elapsed: 124.995 sec - in org.apache.atlas.repository.impexp.ImportServiceTest
Tests run: 9, Failures: 1, Errors: 0, Skipped: 1, Time elapsed: 129.24 sec <<< FAILURE! - in org.apache.atlas.repository.tagpropagation.ClassificationPropagationTest
addBlockedPropagatedClassifications(org.apache.atlas.repository.tagpropagation.ClassificationPropagationTest)  Time elapsed: 0.802 sec  <<< FAILURE!
java.lang.AssertionError: Propagated classification is not present in entity!
	at org.testng.Assert.fail(Assert.java:94)
	at org.apache.atlas.repository.tagpropagation.ClassificationPropagationTest.assertClassificationExistInEntity(ClassificationPropagationTest.java:466)
	at org.apache.atlas.repository.tagpropagation.ClassificationPropagationTest.addBlockedPropagatedClassifications(ClassificationPropagationTest.java:348)

Tests run: 246, Failures: 0, Errors: 0, Skipped: 0, Time elapsed: 182.458 sec - in org.apache.atlas.query.DSLQueriesTest

Results :

Failed tests: 
  ClassificationPropagationTest.addBlockedPropagatedClassifications:348->assertClassificationExistInEntity:466 Propagated classification is not present in entity!

Tests run: 539, Failures: 1, Errors: 0, Skipped: 1

[INFO] ------------------------------------------------------------------------
[INFO] Reactor Summary:
[INFO] 
[INFO] Apache Atlas Server Build Tools .................... SUCCESS [  0.732 s]
[INFO] apache-atlas ....................................... SUCCESS [  3.347 s]
[INFO] Apache Atlas Test Utility Tools .................... SUCCESS [  4.809 s]
[INFO] Open Connector Framework (OCF) ..................... SUCCESS [  1.933 s]
[INFO] Open Metadata Repository Services (OMRS) ........... SUCCESS [  6.343 s]
[INFO] Open Metadata and Governance (OMAG) Server APIs .... SUCCESS [  0.903 s]
[INFO] Connected Asset Open Metadata Access Service (OMAS)  SUCCESS [  1.371 s]
[INFO] Asset Consumer Open Metadata Access Service (OMAS) . SUCCESS [  1.181 s]
[INFO] Open Metadata and Governance (OMAG) Server ......... SUCCESS [  0.877 s]
[INFO] Apache Atlas Integration ........................... SUCCESS [ 40.887 s]
[INFO] Apache Atlas Common ................................ SUCCESS [  2.398 s]
[INFO] Apache Atlas Client ................................ SUCCESS [  0.143 s]
[INFO] atlas-client-common ................................ SUCCESS [  0.685 s]
[INFO] atlas-client-v1 .................................... SUCCESS [  2.511 s]
[INFO] Apache Atlas Server API ............................ SUCCESS [  0.838 s]
[INFO] Apache Atlas Notification .......................... SUCCESS [ 15.947 s]
[INFO] atlas-client-v2 .................................... SUCCESS [  0.721 s]
[INFO] Apache Atlas Graph Database Projects ............... SUCCESS [  0.100 s]
[INFO] Apache Atlas Graph Database API .................... SUCCESS [  0.599 s]
[INFO] Graph Database Common Code ......................... SUCCESS [  0.969 s]
[INFO] Apache Atlas JanusGraph DB Impl .................... SUCCESS [02:26 min]
[INFO] Apache Atlas Graph Database Implementation Dependencies SUCCESS [  2.220 s]
[INFO] Shaded version of Apache hbase client .............. SUCCESS [  8.644 s]
[INFO] Apache Atlas Titan 0.5.4 Graph DB Impl ............. SUCCESS [ 30.052 s]
[INFO] Shaded version of Apache hbase server .............. SUCCESS [ 21.563 s]
[INFO] Apache Atlas Authorization ......................... SUCCESS [  2.927 s]
[INFO] Apache Atlas Repository ............................ FAILURE [03:23 min]
[INFO] Apache Atlas UI .................................... SKIPPED
[INFO] Apache Atlas Web Application ....................... SKIPPED
[INFO] Apache Atlas Documentation ......................... SKIPPED
[INFO] Apache Atlas FileSystem Model ...................... SKIPPED
[INFO] Apache Atlas Plugin Classloader .................... SKIPPED
[INFO] Apache Atlas Hive Bridge Shim ...................... SKIPPED
[INFO] Apache Atlas Hive Bridge ........................... SKIPPED
[INFO] Apache Atlas Falcon Bridge Shim .................... SKIPPED
[INFO] Apache Atlas Falcon Bridge ......................... SKIPPED
[INFO] Apache Atlas Sqoop Bridge Shim ..................... SKIPPED
[INFO] Apache Atlas Sqoop Bridge .......................... SKIPPED
[INFO] Apache Atlas Storm Bridge Shim ..................... SKIPPED
[INFO] Apache Atlas Storm Bridge .......................... SKIPPED
[INFO] Apache Atlas Hbase Bridge Shim ..................... SKIPPED
[INFO] Apache Atlas Hbase Bridge .......................... SKIPPED
[INFO] Apache Atlas Kafka Bridge .......................... SKIPPED
[INFO] Apache Atlas Migration Exporter .................... SKIPPED
[INFO] Apache Atlas Distribution .......................... SKIPPED
[INFO] ------------------------------------------------------------------------
[INFO] BUILD FAILURE
[INFO] ------------------------------------------------------------------------
[INFO] Total time: 08:23 min
[INFO] Finished at: 2018-05-02T20:29:03Z
[INFO] Final Memory: 160M/1833M
[INFO] ------------------------------------------------------------------------
[ERROR] Failed to execute goal org.apache.maven.plugins:maven-surefire-plugin:2.18.1:test (default-test) on project atlas-repository: There are test failures.
[ERROR] 
[ERROR] Please refer to <https://builds.apache.org/job/PreCommit-ATLAS-Build-Test/ws/repository/target/surefire-reports> for the individual test results.
[ERROR] -> [Help 1]
[ERROR] 
[ERROR] To see the full stack trace of the errors, re-run Maven with the -e switch.
[ERROR] Re-run Maven using the -X switch to enable full debug logging.
[ERROR] 
[ERROR] For more information about the errors and possible solutions, please read the following articles:
[ERROR] [Help 1] http://cwiki.apache.org/confluence/display/MAVEN/MojoFailureException
[ERROR] 
[ERROR] After correcting the problems, you can resume the build with the command
[ERROR]   mvn <goals> -rf :atlas-repository




{color:red}-1 overall{color}.  

    {color:green}+1 @author{color}.  The patch does not contain any @author tags.

Console output: https://builds.apache.org/job/PreCommit-ATLAS-Build-Test/334//console

This message is automatically generated.


======================================================================
======================================================================
    Adding comment to Jira.
======================================================================
======================================================================




======================================================================
======================================================================
    Finished build.
======================================================================
======================================================================


+ EXIT_CODE=1
+ '[' -d <https://builds.apache.org/job/PreCommit-ATLAS-Build-Test/ws/../atlas_patchprocess_3813> ']'
+ '[' -d <https://builds.apache.org/job/PreCommit-ATLAS-Build-Test/ws/atlas_patchprocess_3813> ']'
+ mv <https://builds.apache.org/job/PreCommit-ATLAS-Build-Test/ws/atlas_patchprocess_3813> <https://builds.apache.org/job/PreCommit-ATLAS-Build-Test/ws/patchprocess>
+ rm -f <https://builds.apache.org/job/PreCommit-ATLAS-Build-Test/ws/../atlas_patchprocess_3813>
+ exit 1
Build step 'Execute shell' marked build as failure
Set build name.
New build name is '#334-master-ATLAS-2624-2-Fixed-the-case-where-same-classificatio.patch'
Archiving artifacts